{"text_format":"1","workbook":"xlsx","n_sheets":5,"sheets":["Linkwahl","SR Abk.","SR engl.","SR rum.","LS ZH Abk."],"not_rendered":{"charts":0,"images":0,"macros":1,"external_links":0,"defined_names":199,"comments":1,"pivot_tables":0},"unopened":[],"bounds":{"document_bytes":16777216,"sheet_cells":100000,"rows_first":2000,"rows_last":500,"rows_between":2000,"halvings":0,"cell_chars":16384,"cell_head_chars":4096},"cells_cut":0,"cells_raw":0,"read":"whole","date_system":"1900"}

{"sheet":"Linkwahl","index":0,"n_rows":544,"n_cols":41,"rows_kept":544,"cut":false,"hidden":false,"merged":[[102,40,102,44],[41,2,41,17],[50,5,50,9],[50,10,50,12],[86,7,86,8],[83,7,83,9],[82,1,82,4],[49,12,49,17],[112,5,112,6],[109,5,109,17],[111,16,111,18],[116,2,116,17],[61,1,62,1],[84,1,84,2],[69,13,69,15],[70,13,70,15],[74,13,74,15],[84,11,84,17],[84,3,84,4],[67,10,67,11],[70,10,70,11],[77,2,77,17],[109,20,109,22],[79,2,79,17],[81,0,81,6],[65,6,65,7],[65,9,65,12],[122,7,122,9],[82,11,83,21],[83,1,83,2],[83,3,83,4],[64,5,64,8],[64,9,64,12],[82,7,82,9],[7,24,7,36],[65,0,65,1],[74,10,74,11],[11,15,11,22],[11,5,11,6],[12,2,12,4],[19,2,19,10],[22,2,22,17],[13,0,13,1],[70,8,70,9],[30,0,30,1],[31,2,31,4],[31,6,31,7],[30,2,30,4],[94,2,94,17],[59,2,59,17],[51,5,51,9],[123,3,123,4],[124,1,124,4],[10,20,10,22],[57,2,57,17],[61,2,61,17],[2,19,4,22],[30,5,30,8],[30,9,30,11],[30,16,30,17],[30,12,30,15],[29,7,29,17],[49,0,49,10],[11,0,11,1],[11,2,11,4],[29,20,29,22],[10,0,10,10],[19,12,19,17],[20,2,20,17],[13,2,13,4],[25,2,25,17],[24,0,24,17],[27,2,27,17],[122,0,123,0],[45,0,45,17],[131,24,131,36],[81,20,81,22],[92,2,92,17],[90,2,90,17],[86,1,86,3],[120,0,120,6],[83,0,84,0],[126,2,126,17],[124,12,124,13],[121,11,122,21],[121,7,121,9],[120,20,120,22],[86,4,86,6],[86,12,86,14],[104,2,104,17],[97,20,97,22],[121,1,121,4],[106,2,106,17],[111,5,111,6],[118,2,118,17],[124,6,124,10],[122,1,122,2],[123,1,123,2],[122,3,122,4],[1,23,1,37],[0,23,0,37],[2,2,8,17],[31,16,31,17],[75,2,75,17],[69,10,69,11],[0,0,0,22],[64,2,64,4],[64,0,64,1],[65,2,65,4],[31,0,31,1],[43,2,43,17],[31,9,31,11],[47,2,47,17],[30,18,31,22]]}
["Link-Composer.XLT           © Georges Chanson, 8027 Zürich, chanson@arbeitsrechtler.ch        -       19.09.2021       -        ohne Gewähr!",null,null,null,null,null,null,null,null,null,null,null,null,null,null,null,null,null,null,null,null,null,null,null,null,null,null,null,null,null,null,null,null,null,null,null,null,null,{"$f":"IF(X1=\"\",\"\",X1/1440)","v":""}]
[null,null,"Link-Composer",null,null,null,null,null,null,null,null,null,null,null,null,null,null,null,null,null,null,null,null,null,null,null,null,null,null,null,null,null,null,null,null,null,null,null,{"$f":"IF(X2=\"\",\"\",X2/86400)","v":""}]
[null,null,"  1.  Entscheid/Gesetz-Daten in gelbe Felder eintragen (ev. Vorgaben überschreiben)\n  2.  zum empfohlenen Testen und Anzeigen im Internet-Browser auf jeweiligen Hyperlink klicken\n  3.  zum Einkopieren in Office-Dokumente mit entsprechender Schaltfläche entweder Linkname\n       (Linkname-Copy) bzw. bei SR + LS ZH auch Linknummer (Linknummer-Copy) oder reinen\n       Hyperlink (Hyperlink-Copy, z.T. mit Link auf HTML- oder PDF-Dokument) wählen und als\n       unformatierter Text mit <Bearbeiten><Inhalte einfügen> einfügen",null,null,null,null,null,null,null,null,null,null,null,null,null,null,null,null,"** Einkopieren in\n    Eingabezeile möglich"]
[]
[]
[]
[null,null,null,null,null,null,null,null,null,null,null,null,null,null,null,null,null,null,null,null,null,null,null,null,null,null,null,null,null,{"$f":"COUNTA(AD133:AD517)","v":178}]
[null,null,null,null,null,null,null,null,null,null,null,null,null,null,null,null,null,null,null,null,null,null,null,null,"Achtung: Bei Anpassungen Bereiche _SR... und _LS.. unter <Start><Formel><Namensmanager> neu definieren!"]
[null,null,null,null,null,null,null,null,null,null,null,null,null,null,null,null,null,null,null,null,null,null,null,null,"Abkürzungen Bundesgesetze",null,null,null,{"$f":"IF(LEFT(SRPunkt,2)=\"0.\",0,LOOKUP(TEXT(SRPunkt,\"000.000.000.000\"),_SRZitatE))","v":{"$error":"#N/A"}},"Verweis Linkwahl",null,{"$f":"IF(LEFT(SRPunkt,2)=\"0.\",0,LOOKUP(TEXT(SRPunkt,\"000.000.000.000\"),_SRZitatR))","v":{"$error":"#N/A"}},"Verweis",null,"Abkürzungen LS Zürich"]
[null,null,null,null,null,null,null,null,null,null,null,null,null,null,null,null,null,null,null,null,null,null,null,null,{"$f":"COUNTA(Y134:Y544)&\"/\"&ROW(Y544)","v":"390/544"},null,{"$f":"COUNTA(Y134:Y544)","v":390},null,{"$f":"TEXT(SRPunkt,\"000.000.000.000\")","v":""},{"$f":"IF(AC9=AC10,TRUE,FALSE)","v":{"$error":"#N/A"}},null,{"$f":"TEXT(SRPunkt,\"000.000.000.000\")","v":""},{"$f":"IF(AF9=AF10,TRUE,FALSE)","v":{"$error":"#N/A"}},null,{"$f":"COUNTA(AI133:AI366)&\"/\"&ROW(AI366)-9","v":"79/357"},{"$f":"COUNTA(AI133:AI729)","v":79}]
["Bundesgericht: Amtliche Sammlung (BGE)",null,null,null,null,null,null,null,null,null,null,null,null,null,null,{"$f":"IF(AND(C12<>\"\",OR(I12<>\"\",K12<>\"\",M12<>\"\")),\"(Band, Teil, Seite)\",\"\")","v":""}]
["Referenz **",null,null,null,null,"oder   ",null,"Band",null,"Teil",null,null,null,null,null,{"$f":"IF(AND(C12<>\"\",OR(I12<>\"\",K12<>\"\",M12<>\"\")),\"entweder gesamte Referenz oder Aufteilung!\",\"\")","v":""}]
[null,null,{"$f":"TRIM(BGERefIn)","v":""}]
["Beispiel:",null,"132 III 257",null,null," ",null,"Bsp.",132,null,"III",null,257,null,null,{"$f":"IF(RBGE=\"\",\"\",\"BGE \"&MBGEJahr&\" \"&MBGEBd&\" \"&MBGEp)","v":""}]
[null,{"$f":"IF(OR(AND(BGERef<>\"\",OR(BGEJahr<>\"\",BGEBd<>\"\",BGEp<>\"\")),AND(BGERef=\"\",OR(BGEJahr=\"\",BGEBd=\"\",BGEp=\"\"))),\"\",IF(BGEJahr<>\"\",BGEJahr,LEFT(BGERef,FIND(\" \",BGERef)-1)))","v":""},{"$f":"IF(BGERef=\"\",\"\",FIND(\" \",BGERef)-1)","v":""},{"$f":"IF(OR(AND(BGERef<>\"\",OR(BGEJahr<>\"\",BGEBd<>\"\",BGEp<>\"\")),AND(BGERef=\"\",BGEBd=\"\")),\"\",IF(BGEBd<>\"\",BGEBd,IF(BGEBdL=1,LEFT(RIGHT(TRIM(BGERef),E15+G15+1-1),E15-1),LEFT(RIGHT(TRIM(BGERef),E15+G15+1),E15))))","v":""},{"$f":"IF(BGERef=\"\",\"\",IF(BGEBdL=1,SEARCH(\" \",BGERef,4)-1-BGEBdL,SEARCH(\" \",BGERef,5)-2-BGEBdL))","v":""},{"$f":"IF(OR(AND(BGERef<>\"\",OR(BGEJahr<>\"\",BGEBd<>\"\",BGEp<>\"\")),AND(BGERef=\"\",OR(BGEJahr=\"\",BGEBd=\"\",BGEp=\"\"))),\"\",IF(BGEp<>\"\",BGEp,RIGHT(BGERef,$G$15)))","v":""},{"$f":"IF(BGERef=\"\",\"\",IF(BGEBdL=1,LEN(BGERef)-SEARCH(\" \",BGERef,4),LEN(BGERef)-SEARCH(\" \",BGERef,5)))","v":""},null,null,null,{"$f":"IF(MBGEBd=\"I\",1,IF(MBGEBd=\"II\",2,IF(MBGEBd=\"III\",3,IF(MBGEBd=\"IV\",4,\"\"))))","v":""}]
[{"$f":"IF(OR(MBGEJahr=\"\",MBGEBd=\"\",MBGEp=\"\"),\"\",IF(VALUE(MBGEJahr)>VALUE(RIGHT(YEAR(TODAY()),2))+126,\"Band \"&MBGEJahr&\" existiert noch nicht!\",IF(VALUE(MBGEJahr)<80,\"http://www.servat.unibe.ch/dfr/pdf/c\"&K15&TEXT(MBGEJahr,\"000\")&TEXT(MBGEp,\"000\")&\".pdf\",\"http://jumpcgi.bger.ch/cgi-bin/JumpCGI?id=\"&MBGEJahr&\"-\"&UPPER(MBGEBd)&\"-\"&MBGEp)))","v":""},null,null,null,null,null,null,null,{"$f":"IF(MBGEJahr>80,80,\"\")","v":80}]
[{"$f":"IF(OR(MBGEJahr=\"\",MBGEBd=\"\",MBGEp=\"\"),\"\",IF(VALUE(MBGEJahr)>VALUE(RIGHT(YEAR(TODAY()),2))+126,\"Band \"&MBGEJahr&\" existiert noch nicht!\",\"http://links.weblaw.ch/BGE-\"&MBGEJahr&\"-\"&UPPER(MBGEBd)&\"-\"&MBGEp))","v":""}]
[{"$f":"IF(OR(MBGEJahr=\"\",MBGEBd=\"\",MBGEp=\"\"),\"\",IF(VALUE(MBGEJahr)>VALUE(RIGHT(YEAR(TODAY()),2))+126,\"Band \"&MBGEJahr&\" existiert noch nicht!\",IF(VALUE(MBGEJahr)<80,\"Bd. vor 80, nicht auf www.bger.ch\",\"https://expert.bger.ch/cgi-bin/JumpCGI?id=BGE-\"&MBGEJahr&\"-\"&UPPER(MBGEBd)&\"-\"&MBGEp&\"&system=expert\")))","v":""}]
[{"$f":"IF(OR(MBGEJahr=\"\",MBGEBd=\"\",MBGEp=\"\"),\"\",IF(VALUE(MBGEJahr)>VALUE(RIGHT(YEAR(TODAY()),2))+126,\"Band \"&MBGEJahr&\" existiert noch nicht!\",IF(VALUE(MBGEJahr)<80,\"Bd. vor 80, nicht auf www.bger.ch\",IF(VALUE(MBGEJahr)<130,\"keine PDF-Fassung erhältlich\",\"https://expert.bger.ch/php/expert/http/checkpdf.php?filename=\"&MBGEJahr&\"/\"&MBGEJahr&\"-\"&LOWER(MBGEBd)&\"-\"&MBGEp&\".pdf&lang=de&type=atf\"))))","v":""}]
[null,null,{"$f":"\"Hinweis\"&IF(MBGEBd<>\"\",\"e\",\"\")&\": Seitenzahl muss 1. Seite des Entscheides entsprechen!\"","v":"Hinweis: Seitenzahl muss 1. Seite des Entscheides entsprechen!"},null,null,null,null,null,null,null,null,{"$f":"IF(MBGEBd=\"\",\"\",\"–\")","v":""},{"$f":"IF(MBGEBd=\"\",\"\",\"Teil \"&MBGEBd&IF(MBGEBd=\"I\",\" nur Bde. 1 - 97 und ab 121\",IF(OR(MBGEBd=\"IA\",MBGEBd=\"IB\"),\" nur Bde. 98 - 120\",IF(MBGEBd=\"II\",\" erst ab Bd. 24\",IF(MBGEBd=\"III\",\" erst ab Bd. 40\",IF(MBGEBd=\"IV\",\" erst ab Bd. 68\",IF(MBGEBd=\"V\",\" ab erst Bd. 96\",\"\")))))))","v":""}]
[{"$f":"IF(RBGE=\"\",\"\",\"HTML:\")","v":""},null,{"$f":"HYPERLINK(RBGE)","v":""}]
[]
[{"$f":"IF(RBGEWL=\"\",\"\",\"Weblaw:\")","v":""},null,{"$f":"HYPERLINK(RBGEWL)","v":""}]
[]
["Expertensuche (kostenpflichtiger Bereich auf www.bger.ch)"]
[{"$f":"IF(RBGEExpHTML=\"\",\"\",\"HTML:\")","v":""},null,{"$f":"HYPERLINK(RBGEExpHTML)","v":""}]
[]
[{"$f":"IF(RBGEExpPDF=\"\",\"\",\"PDF:\")","v":""},null,{"$f":"HYPERLINK(RBGEExpPDF)","v":""}]
[]
["Bundesgericht: Urteile ab 2000 (BGer)",null,null,null,null,null,null,{"$f":"IF(BGerJahr<2000,\"keine Internetpublikation vor 2000!\",IF(OR(BGer=\"\",AND(BGer<>\"\",EVG<>\"\")),\"\",IF(MID(BGer,1,1)=\" \",\"Leerschlag vor 1. Zahl entfernen!\",IF(AND(VALUE(N33)>2006,RIGHT(LEFT(BGer,3))=\".\"),\"Trennzeichen = •  ?\",IF(AND(VALUE(N33)<2007,RIGHT(LEFT(BGer,3))=\"_\"),\"Hinweis: Trennzeichen = •  \",\"\"))))&IF(EVG=\"\",\"\",IF(AND(BGer<>\"\",EVG<>\"\"),\"   entweder BGer oder EVGer!\",IF(MID(EVG,2,1)<>\" \",\"EVG-Referenz: Leerschlag vor Zahl !\",\"\"))))&IF(AND(OR(BGerTag=\"\",BGerMT=\"\",BGerJahr=\"\"),AND(BGerAbt<>\"\",BGerTrenn<>\"\",BGerNr<>\"\",BGerEJahr<>\"\")),\" ohne Datum nur Weblaw-Link!\",\"\")","v":""}]
["  Datum  **",null,null,null,null,"   + Prozess-Nummer **",null,null,null,null,null,null,null,null,null,null,null,null,{"$f":"IF(AND(BGerDatum<>\"\",OR(B36<>\"\",D36<>\"\",F36<>\"\")),\"Datum entweder gesamt oder einzeln!\",IF(AND(OR(BGer<>\"\",EVG<>\"\"),OR(H36<>\"\",Trenner<>\"\",L36<>\"\",N36<>\"\")),\"ProzNr entweder gesamt oder einzeln!\",\"\"))","v":""}]
["Beispiel:",null,"2007-11-05",null,null,null,"und",null,null,"4A_369/2007",null,null,null,null,null,null,"C 33/07"]
[null,null,null,null,null,null,"BGer",{"$f":"IF(AND(BGer<>\"\",EVG<>\"\"),\"\",IF(BGer=\"\",\"\",UPPER(LEFT(BGer,2))))","v":""},null,{"$f":"IF(OR(AND(BGer<>\"\",EVG<>\"\"),AND(BGer=\"\",EVG=\"\"),AND(BGer=\"\",EVG<>\"\")),\"\",IF(VALUE(N33)<2007,\".\",RIGHT(LEFT(BGer,3),1)))","v":""},null,{"$f":"IF(AND(BGer<>\"\",EVG<>\"\"),\"\",IF(BGer=\"\",\"\",LEFT(RIGHT(BGer,5+LBGerNr),LBGerNr)))","v":""},null,{"$f":"IF(AND(BGer<>\"\",EVG<>\"\"),\"\",IF(BGer=\"\",\"\",RIGHT(BGer,4)))","v":""},null,null,{"$f":"COUNTA(BGer)","v":0},{"$f":"IF(EVG<>\"\",LEN(EVG)-5,\"\")","v":""}]
[null,{"$f":"IF(C31<>\"\",DAY(C31),\"\")","v":""},null,{"$f":"IF(C31<>\"\",MONTH(C31),\"\")","v":""},null,{"$f":"IF(C31<>\"\",YEAR(C31),\"\")","v":""},"EVG",{"$f":"IF(AND(BGer<>\"\",EVG<>\"\"),\"\",IF(EVG=\"\",\"\",UPPER(LEFT(EVG,1))))","v":""},{"$f":"IF(H33<>\"\",H33,H34)","v":""},{"$f":"IF(AND(BGer<>\"\",EVG<>\"\"),\"\",IF(EVG=\"\",\"\",\"_\"))","v":""},{"$f":"IF(J33<>\"\",J33,J34)","v":""},{"$f":"IF(AND(BGer<>\"\",EVG<>\"\"),\"\",IF(EVG=\"\",\"\",LEFT(RIGHT(EVG,3+LEVGNr),LEVGNr)))","v":""},{"$f":"IF(L33<>\"\",L33,L34)","v":""},{"$f":"IF(AND(BGer<>\"\",EVG<>\"\"),\"\",IF(EVG=\"\",\"\",RIGHT(EVG,2)))","v":""},null,{"$f":"IF(N33<>\"\",N33,N34)","v":""},{"$f":"COUNTA(EVG)","v":0},{"$f":"SUM(Q33:Q34)","v":0},{"$f":"COUNT(H33,H34)","v":0}]
[]
["Tag",null,"Mt.",null,"Jahr",null,"Verf.",null,"Trenn",null,"Nr.",null,"Jahr"]
[null,{"$f":"IF(AND(B34<>\"\",B36<>\"\"),\"\",IF(B34<>\"\",B34,IF(B36<>\"\",B36,\"\")))","v":""},null,{"$f":"IF(AND(D34<>\"\",D36<>\"\"),\"\",IF(D34<>\"\",D34,IF(D36<>\"\",D36,\"\")))","v":""},null,{"$f":"IF(AND(F34<>\"\",F36<>\"\"),\"\",IF(F34<>\"\",F34,IF(F36<>\"\",F36,\"\")))","v":""},null,{"$f":"IF(AND(I34<>\"\",H36<>\"\"),\"\",IF(I34<>\"\",I34,IF(H36<>\"\",UPPER(H36),\"\")))","v":""},null,{"$f":"IF(AND(K34<>\"\",J36<>\"\"),\"\",IF(K34<>\"\",K34,IF(J36<>\"\",J36,\"\")))","v":""},null,{"$f":"IF(AND(M34<>\"\",L36<>\"\"),\"\",IF(M34<>\"\",M34,IF(L36<>\"\",L36,\"\")))","v":""},null,{"$f":"IF(AND(P34<>\"\",N36<>\"\"),\"\",IF(P34<>\"\",P34,IF(N36<>\"\",N36,\"\")))","v":""},null,{"$f":"IF(N34=\"\",0,N34+IF(LEFT(N34,1)=\"0\",2000,1900))","v":0}]
["Bsp.",1,null,9,null,2005,null,"4C",null,".  _",null,230,null,2005,null,{"$f":"IF(RBGer=\"\",\"\",\"BGer \"&BGerAbt&BGerTrenn&BGerNr&\"/\"&BGerEJahr&\" vom \"&TEXT(BGerTag,\"00\")&\".\"&TEXT(BGerMT,\"00\")&\".\"&BGerJahr)","v":""}]
[{"$f":"IF(OR(BGerTag=\"\",BGerMT=\"\",BGerJahr=\"\",BGerAbt=\"\",BGerTrenn=\"\",BGerNr=\"\",BGerEJahr=\"\",BGerJahr<2000),\"\",\"http://jumpcgi.BGer.ch/cgi-bin/JumpCGI?id=\"&TEXT(BGerTag,\"00\")&\".\"&TEXT(BGerMT,\"00\")&\".\"&BGerJahr&\"_\"&BGerAbt&BGerTrenn&BGerNr&\"/\"&BGerEJahr)","v":""},null,null,null,null,null,null,null,null,null,null,null,null,{"$f":"IF(BGer=\"\",\"\",FIND(\"/\",BGer)-4)","v":""}]
[{"$f":"IF(OR(BGerAbt=\"\",BGerTrenn=\"\",BGerNr=\"\",BGerEJahr=\"\",BGerJahr<2000),\"\",\"http://links.weblaw.ch/\"&BGerAbt&BGerTrenn&BGerNr&\"/\"&BGerEJahr)","v":""}]
[{"$f":"IF(OR(BGerTag=\"\",BGerMT=\"\",BGerJahr=\"\",BGerAbt=\"\",BGerTrenn=\"\",BGerNr=\"\",BGerEJahr=\"\",BGerJahr<2000),\"\",\"https://expert.bger.ch/php/expert/http/checkpdf.php?filename=\"&BGerJahr&\"/\"&LOWER(BGerAbt)&\"_\"&TEXT(BGerNr,\"0000\")&\"_\"&BGerEJahr&\"_\"&BGerJahr&\"_\"&TEXT(BGerMT,\"00\")&\"_\"&TEXT(BGerTag,\"00\")&\"_t.pdf&lang=de&type=aza\")","v":""}]
[{"$f":"IF(RBGer=\"\",\"\",\"HTML:\")","v":""},null,{"$f":"HYPERLINK(RBGer)","v":""}]
[]
[{"$f":"IF(RBGerWL=\"\",\"\",\"Weblaw:\")","v":""},null,{"$f":"HYPERLINK(RBGerWL)","v":""}]
[]
["PDF-Ausgabe (kostenpflichtiger Bereich auf www.bger.ch)"]
[]
[{"$f":"IF(RBGerPDF=\"\",\"\",\"PDF:\")","v":""},null,{"$f":"HYPERLINK(RBGerPDF)","v":""}]
[]
["Bundesverwaltungsgericht: Amtliche Sammlung (BVGE, ab 2007)"]
[null,"Jahr",null,"Nr.",null,"Urteilsdatum (nur für PDF-Link)"]
[null,"Bsp.",2007,null,1,{"$f":"IF(AND(MBVGEJahr<>\"\",MBVGENr<>\"\",BVGEDatum=\"\"),\"           ohne Datum kein PDF-Link!\",\"\")","v":""},null,null,null,null,null,null,null,null,null,{"$f":"IF(RBVGEHTML=\"\",\"\",\"BVGE \"&MBVGEJahr&\"/\"&MBVGENr)","v":""}]
[null,null,{"$f":"IF(OR(C51=\"\",C51<2007,C51>YEAR(TODAY())),\"\",C51)","v":""},null,{"$f":"IF(E51=\"\",\"\",INT(E51))","v":""},null,null,null,null,{"$f":"IF(K51<>\"\",TEXT(DAY(K51),\"00\"),\"\")","v":""},null,{"$f":"IF(K51<>\"\",TEXT(MONTH(K51),\"00\"),\"\")","v":""},null,{"$f":"IF(K51<>\"\",YEAR(K51),\"\")","v":""}]
[{"$f":"IF(OR(MBVGEJahr=\"\",MBVGENr=\"\"),\"\",\"http://www.bvger.ch/publiws/pub/cache.jsf?displayName=\"&MBVGEJahr&\"/\"&MBVGENr)","v":""}]
[{"$f":"IF(OR(MBVGEJahr=\"\",MBVGENr=\"\"),\"\",\"http://links.weblaw.ch/BVGE-\"&MBVGEJahr&\"/\"&MBVGENr)","v":""}]
[{"$f":"IF(OR(MBVGEJahr=\"\",MBVGENr=\"\",BVGE=\"\",BVGEDatum=\"\"),\"\",\"http://www.bvger.ch/publiws/download?displayName=\"&MBVGEJahr&\"/\"&MBVGENr&\"&decisionDate=\"&N53&\"-\"&L53&\"-\"&J53)","v":""}]
[]
[{"$f":"IF(A54=\"\",\"\",\"BVGer:\")","v":""},null,{"$f":"HYPERLINK(RBVGEHTML)","v":""},null,null,null,null,null,null,null,null,null,null,null,null,null,null,null,null,null,null,null,null,{"$f":"IF(LEFT(BVGProzNr,1)<1,\"Leerschlag vor Nummer entfernen!\",\"\")","v":""}]
[]
[{"$f":"IF(RBVGEWL=\"\",\"\",\"Weblaw:\")","v":""},null,{"$f":"HYPERLINK(RBVGEWL)","v":""}]
[]
[{"$f":"IF(RBVGEWL=\"\",\"\",\"PDF:\")","v":""},null,{"$f":"HYPERLINK(RBVGEPDF)","v":""}]
[]
["Bundesverwaltungsgericht: Urteile, weitere (BVGer, ab 2007)",null,null,null,null,null,null,null,null,null,null,null,{"$f":"IF(OR(MID(BVGProzNr,2,1)=\" \",MID(BVGProzNr,3,1)=\" \"),\"Leerschlag in Proz-Nr!\",IF(RIGHT(BVGProzNr,1)=\" \",\"Leerschlag am Schluss!\",IF(LEFT(BVGProzNr,1)=\" \",\"Leerschlag am Anfang!\",\"\")))","v":""},{"$f":"IF(BVGKJahr<2007,\"BVGer erst seit 2007 tätig!\",IF(AND(BVGDatum<>\"\",OR(B70<>\"\",D70<>\"\",F70<>\"\")),\"  Datum entweder gesamt\",IF(AND(BVGProzNr<>\"\",OR(I70<>\"\",K70<>\"\",N70<>\"\")),\"  ProzNr entweder gesamt\",\"\")))","v":""}]
["  Datum  **",null,null,null,null,"   + Prozess-Nummer **",null,null,null,null,null,null,null,{"$f":"IF(AND(BVGDatum<>\"\",OR(B70<>\"\",D70<>\"\",F70<>\"\")),\"  oder einzeln!\",IF(AND(BVGProzNr<>\"\",OR(I70<>\"\",K70<>\"\",N70<>\"\")),\"  oder einzeln!\",\"\"))","v":""}]
["Beispiel:",null,"2008-01-28",null,null,null,"und",null,null," A-391/2007",null,null,null,null,null,{"$f":"IF(RBVGerHTML=\"\",\"\",\"BVGer \"&UPPER(BVGAbt)&\"-\"&BVGProz&\"/\"&BVGPJahr)&IF(OR(BVGTag<>\"\",BVGMt<>\"\",BVGKJahr<>\"\"),\" vom \"&TEXT(BVGTag,\"00\")&\".\"&TEXT(BVGMt,\"00\")&\".\"&BVGKJahr,\"\")","v":""}]
[null,null,null,null,null,null,null,null,null,null,null,{"$f":"IF(BVGProzNr=\"\",\"\",FIND(\"/\",BVGProzNr)-3)","v":""}]
[null,{"$f":"IF(C65<>\"\",DAY(C65),\"\")","v":""},null,{"$f":"IF(C65<>\"\",MONTH(C65),\"\")","v":""},null,{"$f":"IF(C65<>\"\",YEAR(C65),\"\")","v":""},null,{"$f":"IF(BVGProzNr=\"\",\"\",LEFT(BVGProzNr,1))","v":""},null,null,{"$f":"IF(BVGProzNr=\"\",\"\",LEFT(RIGHT(BVGProzNr,5+LProzNrNr),LProzNrNr))","v":""},null,null,{"$f":"IF(BVGProzNr=\"\",\"\",RIGHT(BVGProzNr,4))","v":""}]
[]
["Tag",null,"Mt.",null,"Jahr",null,null,"Abt. ",null,"Nr. ",null,null,"Jahr"]
[null,{"$f":"IF(AND(B68<>\"\",B70<>\"\"),\"\",IF(B68<>\"\",B68,IF(B70<>\"\",B70,\"\")))","v":""},null,{"$f":"IF(AND(D68<>\"\",D70<>\"\"),\"\",IF(D68<>\"\",D68,IF(D70<>\"\",D70,\"\")))","v":""},null,{"$f":"IF(AND(F68<>\"\",F70<>\"\"),\"\",IF(F68<>\"\",F68,IF(F70<>\"\",F70,\"\")))","v":""},null,{"$f":"IF(AND(H68<>\"\",I70<>\"\"),\"\",IF(H68<>\"\",H68,IF(I70<>\"\",I70,\"\")))","v":""},{"$f":"IF(OR($Q$68=2,$P$67=1),I67,IF($P$68=1,I68,\"\"))","v":""},null,{"$f":"IF(AND(K68<>\"\",K70<>\"\"),\"\",IF(K68<>\"\",K68,IF(K70<>\"\",K70,\"\")))","v":""},null,null,{"$f":"IF(AND(N68<>\"\",N70<>\"\"),\"\",IF(N68<>\"\",N68,IF(N70<>\"\",N70,\"\")))","v":""}]
[{"$f":"IF(OR(BVGAbt=\"\",BVGAbt=\" \",BVGProz=\"\",BVGPJahr=\"\",BVGKJahr<2007),\"\",\"http://www.bvger.ch/publiws/pub/cache.jsf?displayName=\"&UPPER(BVGAbt)&\"-\"&BVGProz&\"/\"&BVGPJahr)","v":""}]
[{"$f":"IF(OR(BVGAbt=\"\",BVGAbt=\" \",BVGProz=\"\",BVGPJahr=\"\",BVGKJahr<2007),\"\",\"http://links.weblaw.ch/BVGer-\"&UPPER(BVGAbt)&\"-\"&BVGProz&\"/\"&BVGPJahr)","v":""}]
[{"$f":"IF(OR(BVGTag=\"\",BVGMt=\"\",BVGKJahr=\"\",BVGAbt=\"\",BVGProz=\"\",BVGPJahr=\"\",BVGKJahr<2007),\"\",\"http://www.bvger.ch/publiws/download?displayName=\"&UPPER(BVGAbt)&\"-\"&BVGProz&\"/\"&BVGPJahr&\"&decisionDate=\"&BVGKJahr&\"-\"&TEXT(BVGMt,\"00\")&\"-\"&TEXT(BVGTag,\"00\"))","v":""}]
["Bsp.",28,null,1,null,2008,null,null,"A",null,391,null,null,2007,null,null,{"$f":"IF(AND(OR(BVGTag=\"\",BVGMt=\"\",BVGKJahr=\"\"),AND(BVGAbt<>\"\",BVGProz<>\"\",BVGPJahr<>\"\")),\"   ohne Datum kein PDF-Link!\",\"\")","v":""}]
[{"$f":"IF(RBVGerHTML=\"\",\"\",\"BVGer:\")","v":""},null,{"$f":"HYPERLINK(RBVGerHTML)","v":""}]
[]
[{"$f":"IF(RBVGerWL=\"\",\"\",\"Weblaw:\")","v":""},null,{"$f":"HYPERLINK(RBVGerWL)","v":""}]
[]
[{"$f":"IF(RBVGerPDF=\"\",\"\",\"PDF:\")","v":""},null,{"$f":"HYPERLINK(RBVGerPDF)","v":""}]
[]
["Systematische Rechtssammlung (SR)",null,null,null,null,null,null,null,null,{"$f":"IF(AND(B83<>\"\",H83<>\"\"),\"entweder Nr. oder Abk. wählen!\",\"\")","v":""}]
["Nr **",null,null,null,null,"oder","Abk.",null,null,null,"Liste",{"$f":"IF(SRAbkIn=\"\",\"\",LOOKUP(SRAbkIn,_SRAbk,_SRName))","v":""}]
["Bsp.","101",null,"Punkte, keine",null,null,null,"Liste od. Eingabe"]
[null,"311.0",null,"Unterstriche!",null,"Art. ",null,null,"Spr. ","d","e-Liste",{"$f":"SRPunkt","v":""}]
[null,null,null,null,null,"Bsp. ",336,"c",{"$f":"IF(OR(AND(SRAbkIn=\"\",SRNrIn=\"\"),AND(SRAbkIn<>\"\",SRNrIn<>\"\")),\"\",IF(AND(SReWahr,SRrWahr),\"e / r !\",IF(SReWahr,\"e !\",IF(SRrWahr,\"r !\",\"\"))))","v":""},{"$f":"IF(OR(AND(SRAbkIn=\"\",SRNrIn=\"\"),AND(SRAbkIn<>\"\",SRNrIn<>\"\")),\"\",IF(AND(SRSpr=\"e\",AD10=FALSE),\"≠ e !\",IF(AND(SRSpr=\"r\",AG10=FALSE),\"≠ r !\",\"\")))","v":""},"r-Liste"]
[null,{"$f":"IF(AND(SRNrIn<>\"\",SRAbkIn<>\"\"),\"\",IF(SRNrIn<>\"\",TEXT(SUBSTITUTE(SRNrIn,\".\",\"_\"),\"@\"),TEXT(SUBSTITUTE(SRAnzeige,\".\",\"_\"),\"@\")))","v":""},null,null,{"$f":"IF(AND(SRNrIn<>\"\",SRAbkIn<>\"\"),\"\",IF(SRNrIn<>\"\",SRNrIn,SRAnzeige))","v":""},null,null,{"$f":"IF(SRAbkIn=\"\",\"\",LOOKUP(SRAbkIn,_SRAbk,_SRZitat))","v":""},null,{"$f":"LOWER(J85)","v":"d"},null,{"$f":"IF(G85=\"\",\"\",G85&IF(SRLitIn=\"SchlT\",\"\",LOWER(H85)))","v":""}]
[{"$f":"IF(OR(SRNr=\"\",AND(SRNr=\"\",Artikel<>\"\")),\"\",\"http://www.admin.ch/ch/\"&SRSprache&\"/\"&IF(SRSprache<>\"d\",\"rs\",\"sr\")&\"/\"&IF(Artikel=\"\",\"c\",\"\")&SRNr&IF(Artikel<>\"\",\"/\"&IF(SRLitIn=\"SchlT\",\"t\",\"\")&\"a\"&Artikel,\"\")&\".html\")","v":""}]
[{"$f":"IF(OR(AND(SRNrIn=\"\",SRAbkIn=\"\"),AND(SRNrIn<>\"\",SRAbkIn<>\"\")),\"\",\"http://www.admin.ch/ch/\"&SRSprache&\"/\"&IF(SRSprache<>\"d\",\"rs\",\"sr\")&\"/\"&IF(LEFT(SRPunkt,1)=\"0\",\"i\"&RIGHT(LEFT(SRPunkt,3),1),LEFT(SRPunkt,1))&\"/\"&SRPunkt&\".\"&IF(SRSprache=\"f\",\"fr\",IF(SRSprache=\"i\",\"it\",IF(SRSprache=\"e\",\"en\",\"de\")))&\".pdf\")","v":""}]
[{"$f":"IF(OR(SRNr=\"\",AND(SRNr=\"\",Artikel<>\"\")),\"\",\"http://links.weblaw.ch/\"&IF(SRSprache=\"f\",\"f/\",IF(SRSprache=\"i\",\"i/\",\"d/\"))&\"SR-\"&SRPunkt&IF(Artikel<>\"\",\"+\"&Artikel,\"\"))","v":""}]
[{"$f":"IF(RSRHTML=\"\",\"\",\"HTML:\")","v":""},null,{"$f":"HYPERLINK(RSRHTML)","v":""}]
[]
[{"$f":"IF(RSRPDF=\"\",\"\",\"PDF:\")","v":""},null,{"$f":"HYPERLINK(RSRPDF)","v":""}]
[]
[{"$f":"IF(RSRWL=\"\",\"\",\"Weblaw:\")","v":""},null,{"$f":"HYPERLINK(RSRWL)","v":""}]
[]
[]
["Amtliche Sammlung (AS, ab 1998 2009)",null,null,null,null,null,null,null,{"$f":"IF(OR(ASJahrIn=\"\",ASSeiteIn=\"\"),\"\",IF(AND(ASJahrIn<1999,ASSeiteIn<2009),\"Vor AS 1998 2009 im Internet nicht publiziert!\",IF(ASJahrIn>2020,\"zZt. keine Weblaw-Links ab 2021\",\"\")))","v":""}]
[]
[null,"Jahr",null,"Seite",null,"Spr. ","d"]
[null,"Bsp.",2010,null,1,"  Hinweis: Seitenzahl muss Beginn des Dokuments entsprechen!",null,null,null,null,null,null,null,null,null,{"$f":"IF(RASPDF=\"\",\"\",\"AS \"&MASJahr&\" \"&MASSeite)","v":""}]
[null,null,{"$f":"IF(OR(ASJahrIn=\"\",ASJahrIn<1998,ASJahrIn>YEAR(TODAY())),\"\",ASJahrIn)","v":""},null,{"$f":"IF(ASSeiteIn=\"\",\"\",INT(ASSeiteIn))","v":""},null,{"$f":"G100","v":"d"}]
[{"$f":"IF(OR(MASJahr=\"\",MASSeite=\"\",AND(ASJahrIn<1999,ASSeiteIn<2009)),\"\",IF(MASJahr<2021,\"http://www.admin.ch/opc/\"&IF(ASSpr=\"f\",\"fr\",IF(ASSpr=\"i\",\"it\",\"de\"))&\"/official-compilation/\"&MASJahr&\"/\"&MASSeite&\".pdf\",\"https://www.fedlex.admin.ch/eli/oc/\"&MASJahr&\"/\"&MASSeite&\"/\"&IF(ASSpr=\"f\",\"fr\",IF(ASSpr=\"i\",\"it\",\"de\"))))","v":""},null,null,null,null,null,null,null,null,null,null,null,null,null,null,null,null,null,null,null,null,null,null,null,null,null,null,null,null,null,null,null,null,null,null,null,null,null,null,null,{"$f":"HYPERLINK(M103)","v":""}]
[{"$f":"IF(OR(MASJahr=\"\",MASSeite=\"\",MASJahr>2020,AND(ASJahrIn<1999,ASSeiteIn<2009)),\"\",\"https://links.weblaw.ch/AS-\"&MASJahr&\"/\"&MASSeite)","v":""}]
[{"$f":"IF(RASPDF=\"\",\"\",\"PDF:\")","v":""},null,{"$f":"HYPERLINK(RASPDF)","v":""}]
[]
[{"$f":"IF(RASWL=\"\",\"\",\"Weblaw:\")","v":""},null,{"$f":"HYPERLINK(RASWL)","v":""}]
[]
[]
["Bundesblatt (BBl)",null,null,null,null,{"$f":"IF(OR(BBlJahrIn=\"\",BBlSeiteIn=\"\"),\"\",IF(AND(MBBlJahr<2000,MBBlSeite<4895),HYPERLINK(\"http://www.amtsdruckschriften.bar.admin.ch\",\"   Quelle: www.amtsdruckschriften.bar.admin.ch – Direktzugriff nur über Weblawlink!\"),IF(BBlJahrIn>2020,\"zZt. keine Weblaw-Links ab 2021\",\"\")))","v":""}]
[]
[null,"Jahr",null,"Seite",null,"Band  ",null,null,"Spr. ","d",{"$f":"IF(OR(BBlJahrIn=\"\",BBlSeiteIn=\"\"),\"\",IF(AND(BBlJahrIn<1998,BBlBdIn=\"\"),\"  Bd-Nr. in römischer Zahl eingeben!\",IF(AND(BBlJahrIn>1997,BBlBdIn<>\"\"),\"  ab 1998 keine Bd-Nr. mehr!\",\"\")))","v":""},null,null,null,null,null,{"$f":"IF(AND(RBBlPDF=\"\",RBBlWL=\"\"),\"\",\"BBl \"&MBBlJahr&IF(MBBlBd<>\"\",\" \"&MBBlBd,\"\")&\" \"&MBBlSeite)","v":""}]
[null,"Bsp.",2010,null,1,"nur bis 1997  ",null,"VI","  Hinweis: Seitenzahl muss Beginn des Dokuments entsprechen!"]
[null,null,{"$f":"IF(OR(BBlJahrIn=\"\",BBlJahrIn>YEAR(TODAY())),\"\",BBlJahrIn)","v":""},null,{"$f":"IF(BBlSeiteIn=\"\",\"\",INT(BBlSeiteIn))","v":""},null,null,{"$f":"IF(OR(BBlBdIn=\"\",MBBlJahr>1997),\"\",IF(AND(BBlBdIn>0,BBlBdIn<7),ROMAN(BBlBdIn),UPPER(BBlBdIn)))","v":""},null,{"$f":"BBlSpr","v":"d"}]
[{"$f":"IF(OR(MBBlJahr=\"\",MBBlSeite=\"\",AND(MBBlJahr<2000,MBBlSeite<4895)),\"\",IF(MBBlJahr<2021,\"http://www.admin.ch/opc/\"&IF(BBlSpr=\"f\",\"fr\",IF(BBlSpr=\"i\",\"it\",\"de\"))&\"/federal-gazette/\"&MBBlJahr&\"/\"&MBBlSeite&\".pdf\",\"https://www.fedlex.admin.ch/eli/fga/\"&MBBlJahr&\"/\"&MBBlSeite&\"/\"&IF(BBlSpr=\"f\",\"fr\",IF(BBlSpr=\"i\",\"it\",\"de\"\n))\n\n))","v":""}]
[{"$f":"IF(OR(MBBlJahr=\"\",MBBlSeite=\"\",BBlJahrIn>2020,AND(BBlJahrIn<1998,BBlBdIn=\"\")),\"\",\"http://links.weblaw.ch/\"&BBlSprache&\"/BBl-\"&MBBlJahr&IF(MBBlBd<>\"\",\"-\"&MBBlBd,\"\")&\"-\"&MBBlSeite)","v":""}]
[{"$f":"IF(RBBlPDF=\"\",\"\",\"PDF:\")","v":""},null,{"$f":"HYPERLINK(RBBlPDF)","v":""}]
[]
[{"$f":"IF(RBBlWL=\"\",\"\",\"Weblaw:\")","v":""},null,{"$f":"HYPERLINK(RBBlWL)","v":""}]
[]
["Zürcher Gesetzessammlung (LS ZH)",null,null,null,null,null,null,{"$f":"IF(AND(B122<>\"\",H122<>\"\"),\"entweder Nr. oder Abk. wählen!\",\"\")","v":""}]
["Nr **",null,null,null,null,"oder","Abk.",null,null,null,"Liste",{"$f":"IF(LSAbkIn=\"\",\"\",LOOKUP(LSAbkIn,_LSAbk,_LSName))","v":""}]
["Bsp.","271",null,"Punkte, keine",null,null,null,"Liste od. Eingabe"]
[null,"632.1",null,"Unterstriche!",null,null,null,null,null,null,null,{"$f":"IF(RLSZH=\"\",\"\",\"LS \"&LSNr)","v":""}]
[null,{"$f":"IF(AND(LSin<>\"\",LSAbkIn<>\"\"),\"\",IF(LSin<>\"\",LSin,LSAnzeige))","v":""},null,null,null,null,{"$f":"IF(LSAbkIn=\"\",\"\",LOOKUP(LSAbkIn,_LSAbk,_LSZitat))","v":""},null,null,null,null,null,null,null,null,null,{"$f":"LOWER(Q122)","v":""}]
[{"$f":"IF(LSNr=\"\",\"\",\"http://www.zhlex.zh.ch/Erlass.html?Open&Ordnr=\"&LSNr)","v":""}]
[{"$f":"IF(A126=\"\",\"\",\"LINK:\")","v":""},null,{"$f":"HYPERLINK(RLSZH)","v":""}]
[]
[]
[]
[]
[null,null,null,null,null,null,null,null,null,null,null,null,null,null,null,null,null,null,null,null,null,null,null,null,"Achtung: Bei Anpassungen Bereiche _SR... und _LS.. unter <Einfügen><Namen> neu definieren!"]
[null,null,null,null,null,null,null,null,null,null,null,null,null,null,null,null,null,null,null,null,null,null,null,null,null,null,null,null,{"$f":"TEXT(AD133,\"000.000.000.000\")","v":"101.000.000.000"},101,"Federal Constitution of the Swiss Confederation of 18 April 1999",{"$f":"TEXT(AG133,\"000.000.000.000\")","v":"000.107.000.000"},"0.107","Convenziun dals 20 da november 1989 davart ils dretgs da l’uffant","AnwG","215.1","Anwaltsgesetz"]
[null,null,null,null,null,null,null,null,null,null,null,null,null,null,null,null,null,null,null,null,null,null,null,null,"AdoV","e","211.221.36","Adoptionsverordnung","124.000.000.000",124,"Ordinance of 31 October 2007 on the Use of Private Security Companies by the Federal Government (Ordinance on the Use of Private Security Companies, OUPSC)",{"$f":"TEXT(AG134,\"000.000.000.000\")","v":"0.441.1"},"0.441.1","Convenziun da basa dals 1. da favrer 1995 per proteger las minoritads naziunalas","AnwGebV","215.3","Anwaltsgebührenverordnung"]
[null,null,null,null,null,null,null,null,null,null,null,null,null,null,null,null,null,null,null,null,null,null,null,null,"AHVG",{"$f":"IF(LEFT(AA135,2)=\"0.\",\"\",IF(AND(TEXT(AA135,\"000.000.000\")=LOOKUP(TEXT(AA135,\"000.000.000\"),_SRZitatE),TEXT(AA135,\"000.000.000\")=LOOKUP(TEXT(AA135,\"000.000.000\"),_SRZitatR)),\"e / r\",IF(TEXT(AA135,\"000.000.000\")=LOOKUP(TEXT(AA135,\"000.000.000\"),_SRZitatE),\"e\",IF(TEXT(AA135,\"000.000.000\")=LOOKUP(TEXT(AA135,\"000.000.000\"),_SRZitatR),\"r\",\"\"))))","v":""},"831.10","Alters- und Hinterlassenenversicherungsgesetz","141.000.000.000","141.0","Federal Act of 29 September 1952 on the Acquisition and Loss of Swiss Citizenship (Federal Act on Citizenship [SCA])",{"$f":"TEXT(AG135,\"000.000.000.000\")","v":"0.441.2"},"0.441.2","Charta europeica dals 5 da november 1992 da las linguas regiunalas u minoritaras","AnwPrüfV","215.11","VO über die Fähigkeitsprüfung zum Anwaltsberuf"]
[null,null,null,null,null,null,null,null,null,null,null,null,null,null,null,null,null,null,null,null,null,null,null,null,"AHVV",{"$f":"IF(LEFT(AA136,2)=\"0.\",\"\",IF(AND(TEXT(AA136,\"000.000.000\")=LOOKUP(TEXT(AA136,\"000.000.000\"),_SRZitatE),TEXT(AA136,\"000.000.000\")=LOOKUP(TEXT(AA136,\"000.000.000\"),_SRZitatR)),\"e / r\",IF(TEXT(AA136,\"000.000.000\")=LOOKUP(TEXT(AA136,\"000.000.000\"),_SRZitatE),\"e\",IF(TEXT(AA136,\"000.000.000\")=LOOKUP(TEXT(AA136,\"000.000.000\"),_SRZitatR),\"r\",\"\"))))","v":""},831.101,"Alters- und Hinterlassenenversicherungsverordnung","141.210.000.000","141.21","Ordinance of 23 November 2005 on Fees under the Federal Act on Swiss Citizenship (FeeO-SCA)",{"$f":"TEXT(AG136,\"000.000.000.000\")","v":"101.000.000.000"},"101","Constituziun federala da la Confederaziun svizra dals 18 d’avrigl 1999","BiG","410.1","Bildungsgesetz"]
[null,null,null,null,null,null,null,null,null,null,null,null,null,null,null,null,null,null,null,null,null,null,null,null,"AIG","e / r","142.20","Ausländer- und Integrationsgesetz","142.200.000.000","142.20","Federal Act of 16 December 2005 on Foreign Nationals (FNIA)",{"$f":"TEXT(AG137,\"000.000.000.000\")","v":"131.226.000.000"},"131.226","Constituziun dal chantun Grischun dals 18 da matg 2003/14 da settember 2003","BüV","141.11","Bürgerrechtsverordnung"]
[null,null,null,null,null,null,null,null,null,null,null,null,null,null,null,null,null,null,null,null,null,null,null,null,"AltlV","e","814.680","Altlasten-Verordnung",{"$f":"TEXT(AD138,\"000.000.000.000\")","v":"142.310.000.000"},"142.31","Asylum Act of 26 June 1998 (AsylA)",{"$f":"TEXT(AG138,\"000.000.000.000\")","v":"141.000.000.000"},"141.0","Lescha federala dals 29 da settember 1952 davart l’acquist e la perdita dal dretg da burgais svizzer (Lescha davart il dretg da burgais [LDB])","BVKG","172.2","G über Versicherungskasse Staatspersonal"]
[null,null,null,null,null,null,null,null,null,null,null,null,null,null,null,null,null,null,null,null,null,null,null,null,"ArG",{"$f":"IF(LEFT(AA139,2)=\"0.\",\"\",IF(AND(TEXT(AA139,\"000.000.000\")=LOOKUP(TEXT(AA139,\"000.000.000\"),_SRZitatE),TEXT(AA139,\"000.000.000\")=LOOKUP(TEXT(AA139,\"000.000.000\"),_SRZitatR)),\"e / r\",IF(TEXT(AA139,\"000.000.000\")=LOOKUP(TEXT(AA139,\"000.000.000\"),_SRZitatE),\"e\",IF(TEXT(AA139,\"000.000.000\")=LOOKUP(TEXT(AA139,\"000.000.000\"),_SRZitatR),\"r\",\"\"))))","v":""},822.11,"Arbeitsgesetz","142.512.000.000","142.512","Ordinance of 18 December 2013 on the Central Visa Information System and the National Visa System (Visa Information System-Ordinance, VISO)","142.200.000.000","142.20","Lescha federala dals 16 da december 2005 davart las persunas estras (LEI)","BVK-Statut","172.21","Statuten Versicherungskasse Staatspersonal"]
[null,null,null,null,null,null,null,null,null,null,null,null,null,null,null,null,null,null,null,null,null,null,null,null,"ArGV 1","",822.11099999999999,"Verordnung 1 zum Arbeitsgesetz","151.100.000.000","151.1","Federal Act of 24 March 1995 on Gender Equality (Gender Equality Act, GEA)","142.310.000.000","142.31","Lescha d’asil dals 26 da zercladur 1998 (LAsil)","EG AHVG/IVG",831.1,"EG zum AHVG"]
[null,null,null,null,null,null,null,null,null,null,null,null,null,null,null,null,null,null,null,null,null,null,null,null,"ArGV 2","",822.11199999999997,"Verordnung 2 zum Arbeitsgesetz (Sonderbestimmungen)","152.100.000.000","152.1","Federal Act of 26 June 1998 on Archiving (Archiving Act, ArchA)","143.100.000.000","143.1","Lescha federala dals 22 da zercladur 2001 davart ils documents d’identitad da las burgaisas e dals burgais svizzers (Lescha davart ils documents d’identitad, LDI)","EG AVIG","837.1","EG zum AVIG"]
[null,null,null,null,null,null,null,null,null,null,null,null,null,null,null,null,null,null,null,null,null,null,null,null,"ArGV 3","",822.11300000000006,"Verordnung 3 zum Arbeitsgesetz (Gesundheitsvorsorge)","152.110.000.000","152.11","Ordinance of 8 September 1999 to the Federal Act on Archiving (Archiving Ordinance)",{"$f":"TEXT(AG142,\"000.000.000.000\")","v":"151.100.000.000"},"151.1","Lescha federala dals 24 da mars 1995 davart l’egualitad da dunna ed um (Lescha d’egualitad, LEg)","EG BewG","234.1","EG zum BG Erwerb Grundstücke Personen im Ausland"]
[null,null,null,null,null,null,null,null,null,null,null,null,null,null,null,null,null,null,null,null,null,null,null,null,"ArGV 4","",822.11400000000003,"Verordnung 4 zum Arbeitsgesetz (Industrielle Betriebe)","152.300.000.000","152.3","Federal Act of 17 December 2004 on Freedom of Information in the Administration (Freedom of Information Act, FoIA)","152.300.000.000","152.3","Lescha federala dals 17 da december 2004 davart il princip da la transparenza da l’administraziun (Lescha da transparenza, LTrans)","EG FamZG","836.1","EinführungsG zum Familienzulagengesetz"]
[null,null,null,null,null,null,null,null,null,null,null,null,null,null,null,null,null,null,null,null,null,null,null,null,"ArGV 5","",822.11500000000001,"Verordnung 5 zum Arbeitsgesetz (Jugendarbeitsschutzverordnung)","152.310.000.000","152.31","Ordinance of 24 May 2006 on Freedom of Information in the Administration (Freedom of Information Ordinance, FoIO)","152.310.000.000","152.31","Ordinaziun dals 24 da matg 2006 davart il princip da la transparenza da l’administraziun (Ordinaziun da transparenza, OTrans)","EG GlG",151,"EG zum Gleichstellungsgesetz"]
[null,null,null,null,null,null,null,null,null,null,null,null,null,null,null,null,null,null,null,null,null,null,null,null,"ARV 1","","822.221","Chauffeurverordnung","161.100.000.000","161.1","Federal Act of 17 December 1976 on Political Rights",{"$f":"TEXT(AG145,\"000.000.000.000\")","v":"161.100.000.000"},"161.1","Lescha federala dals 17 da december davart ils dretgs politics","EG KVG","832.01","EG zum Krankenversicherungsgesetz"]
[null,null,null,null,null,null,null,null,null,null,null,null,null,null,null,null,null,null,null,null,null,null,null,null,"ARV 2","","822.222","Arbeits- und Ruhezeit berufsmässiger Motorfahrzeugführer (Personentransport)","161.116.000.000","161.116","Federal Chancellery Ordinance of 13 December 2013 on Electronic Voting (VEleS)","161.110.000.000","161.11","Ordinaziun dals 24 da matg 1978 davart ils dretgs politics (ODP)","EG OHG","341","EG zum Opferhilfegesetz"]
[null,null,null,null,null,null,null,null,null,null,null,null,null,null,null,null,null,null,null,null,null,null,null,null,"ASG","e","195.1","Auslandschweizergesetz","170.512.000.000","170.512","Federal Act of 18 June 2004 on the Compilations of Federal Legislation and the Federal Gazette (Publications Act, PublA)","171.100.000.000",171.1,"Lescha federala dals 13 da december 2002 davart l’Assamblea federala (Lescha dal parlament, LParl)","EG ZGB","230","EG zum ZGB"]
[null,null,null,null,null,null,null,null,null,null,null,null,null,null,null,null,null,null,null,null,null,null,null,null,"AsylG","e / r","142.31","Asylgesetz","171.100.000.000","171.10","Federal Act of 13 December 2002 on the Federal Assembly (Parliament Act, ParlA)","172.010.000.000","172.010","Lescha dals 21 da mars 1997 davart l’organisaziun da la regenza e da l’administraziun (LORA)","ESchG",632.1,"Erbschafts- und Schenkungssteuergesetz"]
[null,null,null,null,null,null,null,null,null,null,null,null,null,null,null,null,null,null,null,null,null,null,null,null,"ATSG",{"$f":"IF(LEFT(AA149,2)=\"0.\",\"\",IF(AND(TEXT(AA149,\"000.000.000\")=LOOKUP(TEXT(AA149,\"000.000.000\"),_SRZitatE),TEXT(AA149,\"000.000.000\")=LOOKUP(TEXT(AA149,\"000.000.000\"),_SRZitatR)),\"e / r\",IF(TEXT(AA149,\"000.000.000\")=LOOKUP(TEXT(AA149,\"000.000.000\"),_SRZitatE),\"e\",IF(TEXT(AA149,\"000.000.000\")=LOOKUP(TEXT(AA149,\"000.000.000\"),_SRZitatR),\"r\",\"\"))))","v":""},"830.1","Allgemeiner Teil Sozialversicherungsrecht","171.130.000.000","171.13","Standing Orders of the National Council of 3 October 2003 (SO-NC)",{"$f":"TEXT(AG149,\"000.000.000.000\")","v":"172.021.000.000"},"172.021","Lescha federala dals 20 da december 1968 davart la procedura administrativa (PA)","GebV OG","211.11","Gebührenverordnung Obergericht"]
[null,null,null,null,null,null,null,null,null,null,null,null,null,null,null,null,null,null,null,null,null,null,null,null,"ATSV","","830.11","VO Allgemeiner Teil Sozialversicherungsrecht","171.140.000.000","171.14","Standing Orders of the Council of States of 20 June 2003 (SO-CS)","172.081.000.000","172.081","Ordinaziun dals 14 da november 2012 davart ils servetschs linguistics da l’administraziun federala (Ordinaziun dals servetschs linguistics, OSLing)","GebV StrV","323.1","Gebührenverordnung Strafverfolgungsbehörden"]
[null,null,null,null,null,null,null,null,null,null,null,null,null,null,null,null,null,null,null,null,null,null,null,null,"AVEG","","221.215.311","Allgemeinverbindlicherklärung von Gesamtarbeitsverträgen, BG über die ","172.010.000.000","172.010","Government and Administration Organisation Act of 21 March 1997 (GAOA)",{"$f":"TEXT(AG151,\"000.000.000.000\")","v":"172.220.1"},"172.220.1","Lescha dals 24 da mars 2000 davart il persunal da la confederaziun (LPers)","GebV VGr","175.252","Gebührenverordnung Verwaltungsgericht"]
[null,null,null,null,null,null,null,null,null,null,null,null,null,null,null,null,null,null,null,null,null,null,null,null,"AVG","",823.11,"Arbeitsvermittlungsgesetz","172.021.000.000","172.021","Federal Act of 20 December 1968 on Administrative Procedure (Administrative Procedure Act, APA)","173.110.000.000","173.110","Lescha federala dals 20 da december 1968 davart la procedura administrativa (PA)","GG",131.1,"Gemeindegesetz"]
[null,null,null,null,null,null,null,null,null,null,null,null,null,null,null,null,null,null,null,null,null,null,null,null,"AVIG","","837.0","Arbeitslosenversicherungsgesetz","172.061.000.000","172.061","Federal Act of 18 March 2005 on the Consultation Procedure (Consultation Procedure Act, CPA)","210.000.000.000","210","Cudesch civil svizzer dals 10 da december 1907","GOG","211.1","Gerichtsorganisationsgesetz"]
[null,null,null,null,null,null,null,null,null,null,null,null,null,null,null,null,null,null,null,null,null,null,null,null,"AVIV","",837.02,"Arbeitslosenversicherungsverordnung",{"$f":"TEXT(AD154,\"000.000.000.000\")","v":"172.081.000.000"},"172.081","Ordinance on the Federal Administration Language Services Language Services Ordinance, LangSO) ","220.000.000.000","220","Lescha federala dals 30 da mars 1911 davart la cumplettaziun dal cudesch civil svizzer (Tschintgavla part: Dretg d’obligaziuns)","GPR",161,"G über die politischen Rechte"]
[null,null,null,null,null,null,null,null,null,null,null,null,null,null,null,null,null,null,null,null,null,null,null,null,"AVV","",823.11099999999999,"Arbeitsvermittlungsverordnung","172.222.1","172.222.1","Federal Act of 20 December 2006 on the Federal Pension Fund (PUBLICA Act)","272.000.000.000",272,"Cudesch da procedura civila svizzer dals 19 da december 2008 (Cudesch da procedura civila, CPC)","GSG","351","Gewaltsschutzgesetz"]
[null,null,null,null,null,null,null,null,null,null,null,null,null,null,null,null,null,null,null,null,null,null,null,null,"AwG","r","143.1","Ausweisgesetz","173.410.000.000","173.41","Federal Act of 20 March 2009 on the Federal Patent Court (Patent Court Act, PatCA)","311.000.000.000","311.0","Cudesch penal svizzer dals 21 da december 1936","GSVGer","351.3","VO zum Gewaltsschutzsgesetz"]
[null,null,null,null,null,null,null,null,null,null,null,null,null,null,null,null,null,null,null,null,null,null,null,null,"AZG",{"$f":"IF(LEFT(AA157,2)=\"0.\",\"\",IF(AND(TEXT(AA157,\"000.000.000\")=LOOKUP(TEXT(AA157,\"000.000.000\"),_SRZitatE),TEXT(AA157,\"000.000.000\")=LOOKUP(TEXT(AA157,\"000.000.000\"),_SRZitatR)),\"e / r\",IF(TEXT(AA157,\"000.000.000\")=LOOKUP(TEXT(AA157,\"000.000.000\"),_SRZitatE),\"e\",IF(TEXT(AA157,\"000.000.000\")=LOOKUP(TEXT(AA157,\"000.000.000\"),_SRZitatR),\"r\",\"\"))))","v":""},822.21,"Arbeitszeitgesetz (öffentlicher Verkehr)","191.110.000.000","191.11","Ordinance of 7 October 2015 on the Fees charged by the Federal Department of Foreign Affairs (FDFA Fees Ordinance, FeeO FDFA)","311.100.000.000","311.1","Lescha federala dals 20 da zercladur 2003 davart il dretg penal per giuvenils (Dretg penal per giuvenils, DPG)","GSVGer","212.81","G über das Sozialversicherungsgericht"]
[null,null,null,null,null,null,null,null,null,null,null,null,null,null,null,null,null,null,null,null,null,null,null,null,"AZGV",{"$f":"IF(LEFT(AA158,2)=\"0.\",\"\",IF(AND(TEXT(AA158,\"000.000.000\")=LOOKUP(TEXT(AA158,\"000.000.000\"),_SRZitatE),TEXT(AA158,\"000.000.000\")=LOOKUP(TEXT(AA158,\"000.000.000\"),_SRZitatR)),\"e / r\",IF(TEXT(AA158,\"000.000.000\")=LOOKUP(TEXT(AA158,\"000.000.000\"),_SRZitatE),\"e\",IF(TEXT(AA158,\"000.000.000\")=LOOKUP(TEXT(AA158,\"000.000.000\"),_SRZitatR),\"r\",\"\"))))","v":""},822.21100000000001,"Arbeitszeitgesetz, VO zum (öffentlicher Verkehr)","192.120.000.000","192.12","Federal Act of 22 June 2007 on the Privileges, Immunities and Facilities and the Financial Subsidies granted by Switzerland as a Host State (\"Host State Act\", \"HSA\")","312.000.000.000","312.0","Cudesch da procedura penala svizzer dals 5 d’october 2007 (Cudesch da procedura penala, CPP)","IDG","170.4","G über die Information und den Datenschutz"]
[null,null,null,null,null,null,null,null,null,null,null,null,null,null,null,null,null,null,null,null,null,null,null,null,"BankG",{"$f":"IF(LEFT(AA159,2)=\"0.\",\"\",IF(AND(TEXT(AA159,\"000.000.000\")=LOOKUP(TEXT(AA159,\"000.000.000\"),_SRZitatE),TEXT(AA159,\"000.000.000\")=LOOKUP(TEXT(AA159,\"000.000.000\"),_SRZitatR)),\"e / r\",IF(TEXT(AA159,\"000.000.000\")=LOOKUP(TEXT(AA159,\"000.000.000\"),_SRZitatE),\"e\",IF(TEXT(AA159,\"000.000.000\")=LOOKUP(TEXT(AA159,\"000.000.000\"),_SRZitatR),\"r\",\"\"))))","v":""},"952.0","Bankengesesetz","192.121.000.000","192.121","Ordinance of 7 December 2007 to the Federal Act on the Privileges, Immunities and Facilities and the Financial Subsidies granted by Switzerland as a Host State (Host State Ordinance, HSO)",{"$f":"TEXT(AG159,\"000.000.000.000\")","v":"313.000.000.000"},"313.0","Lescha federala dals 22 da mars 1974 davart il dretg penal administrativ (DPA)","IDV","170.41","VO über die Information und den Datenschutz"]
[null,null,null,null,null,null,null,null,null,null,null,null,null,null,null,null,null,null,null,null,null,null,null,null,"BankV",{"$f":"IF(LEFT(AA160,2)=\"0.\",\"\",IF(AND(TEXT(AA160,\"000.000.000\")=LOOKUP(TEXT(AA160,\"000.000.000\"),_SRZitatE),TEXT(AA160,\"000.000.000\")=LOOKUP(TEXT(AA160,\"000.000.000\"),_SRZitatR)),\"e / r\",IF(TEXT(AA160,\"000.000.000\")=LOOKUP(TEXT(AA160,\"000.000.000\"),_SRZitatE),\"e\",IF(TEXT(AA160,\"000.000.000\")=LOOKUP(TEXT(AA160,\"000.000.000\"),_SRZitatR),\"r\",\"\"))))","v":""},"952.02","Bankenverordnung","195.100.000.000","195.1","Federal Act of 26 September 2014 on Swiss Persons and Institutions Abroad (Swiss Abroad Act, SAA)",{"$f":"TEXT(AG160,\"000.000.000.000\")","v":"362.000.000.000"},"362","Conclus federal dals 17 da december 2004 davart l’approvaziun e la realisaziun da las cunvegnas bilateralas tranter la Svizra e la UE per l’associaziun a la reglamentaziun da Schengen e da Dublin","JHG","852.1","Jugendhilfegesetz"]
[null,null,null,null,null,null,null,null,null,null,null,null,null,null,null,null,null,null,null,null,null,null,null,null,"BB ScheA","r","362","Genehmigung/Umsetzung Schengen-/Dublin-Abkommen, BB über","195.110.000.000","195.11","Ordinance of 7 October 2015 on Swiss Persons and Institutions Abroad (Swiss Abroad Ordinance, SAO)","412.100.000.000","412.10","Lescha federala dals 13 da december 2002 davart la furmaziun professiunala (LFPr)","JStrV","322","VO über die Jugendstrafrechtspflege"]
[null,null,null,null,null,null,null,null,null,null,null,null,null,null,null,null,null,null,null,null,null,null,null,null,"BBG","e / r","412.10","Berufsbildungsgesetz","196.100.000.000","196.1","Federal Act of 1 October 2010 on the Restitution of Assets illicitly obtained by Politically Exposed Persons Restitution of Illicit Assets Act (RIAA)","412.101.000.000","412.101","Ordinaziun dals 19 da november 2003 davart la furmaziun professiunala (OFPr)","JVV","331.1","Justizvollzugsverordnung"]
[null,null,null,null,null,null,null,null,null,null,null,null,null,null,null,null,null,null,null,null,null,null,null,null,"BBV","e / r","412.101","Berufsbildungsverordnung","210.000.000.000","210","Swiss Civil Code of 10 December 1907","420.100.000.000","420.1","Lescha federala dals 14 da december 2012 davart la promoziun da la perscrutaziun e da l’innovaziun (LPPI)","KGBV","252","Kantonale Grundbuchverordnung"]
[null,null,null,null,null,null,null,null,null,null,null,null,null,null,null,null,null,null,null,null,null,null,null,null,"BEG","e","957.1","Bucheffektengesetz","211.221.36","211.221.36","Ordinance of 29 June 2011 on Adoption (Adoption Ordinance, AdoptO)","420.110.000.000","420.11","Ordinaziun dals 29 da november 2013 tar la Lescha federala davart la promoziun da la perscrutaziun e da l’innovaziun (Ordinaziun da perscrutaziun e d’innovaziun, O-LPPI)","KRG",171.1,"Kantonsratsgesetz"]
[null,null,null,null,null,null,null,null,null,null,null,null,null,null,null,null,null,null,null,null,null,null,null,null,"BEHG",{"$f":"IF(LEFT(AA165,2)=\"0.\",\"\",IF(AND(TEXT(AA165,\"000.000.000\")=LOOKUP(TEXT(AA165,\"000.000.000\"),_SRZitatE),TEXT(AA165,\"000.000.000\")=LOOKUP(TEXT(AA165,\"000.000.000\"),_SRZitatR)),\"e / r\",IF(TEXT(AA165,\"000.000.000\")=LOOKUP(TEXT(AA165,\"000.000.000\"),_SRZitatE),\"e\",IF(TEXT(AA165,\"000.000.000\")=LOOKUP(TEXT(AA165,\"000.000.000\"),_SRZitatR),\"r\",\"\"))))","v":""},"954.1","Börsengesetz","211.222.32","211.222.32","Federal Act of 21 December 2007 on International Child Abduction and the Hague Conventions on the Protection of Children and Adults","441.100.000.000","441.1","Lescha federala dals 5 d’october 2007 davart las linguas naziunalas e la chapientscha tranter las cuminanzas linguisticas (lescha da linguas, LLing)","KV",101,"Verfassung des Kantons Zürich "]
[null,null,null,null,null,null,null,null,null,null,null,null,null,null,null,null,null,null,null,null,null,null,null,null,"BehiG",{"$f":"IF(LEFT(AA166,2)=\"0.\",\"\",IF(AND(TEXT(AA166,\"000.000.000\")=LOOKUP(TEXT(AA166,\"000.000.000\"),_SRZitatE),TEXT(AA166,\"000.000.000\")=LOOKUP(TEXT(AA166,\"000.000.000\"),_SRZitatR)),\"e / r\",IF(TEXT(AA166,\"000.000.000\")=LOOKUP(TEXT(AA166,\"000.000.000\"),_SRZitatE),\"e\",IF(TEXT(AA166,\"000.000.000\")=LOOKUP(TEXT(AA166,\"000.000.000\"),_SRZitatR),\"r\",\"\"))))","v":""},"151.3","Behindertengleichstellungsgesetz","211.432.2","211.432.2","Ordinance of 18 November 1992 on Official Cadastral Surveying","441.110.000.000","441.11","Ordinaziun dals 4 da zercladur 2010 davart las linguas naziunalas e la chapientscha tranter las cuminanzas linguisticas (ordinaziun da linguas, OLing)","KZG","836.1","Kinderzulagengesetz"]
[null,null,null,null,null,null,null,null,null,null,null,null,null,null,null,null,null,null,null,null,null,null,null,null,"BEHV",{"$f":"IF(LEFT(AA167,2)=\"0.\",\"\",IF(AND(TEXT(AA167,\"000.000.000\")=LOOKUP(TEXT(AA167,\"000.000.000\"),_SRZitatE),TEXT(AA167,\"000.000.000\")=LOOKUP(TEXT(AA167,\"000.000.000\"),_SRZitatR)),\"e / r\",IF(TEXT(AA167,\"000.000.000\")=LOOKUP(TEXT(AA167,\"000.000.000\"),_SRZitatE),\"e\",IF(TEXT(AA167,\"000.000.000\")=LOOKUP(TEXT(AA167,\"000.000.000\"),_SRZitatR),\"r\",\"\"))))","v":""},"954.11","Börsenverordnung","211.432.21","211.432.21","DDPS Technical Ordinance of 10 June 1994 on Official Cadastral Survey-ing (TOCS)",{"$f":"TEXT(AG167,\"000.000.000.000\")","v":"442.100.000.000"},442.1,"Lescha federala dals 11 da december 2009 davart la promoziun da la cultura (Lescha per promover la cultura, LPCu)","LG",910.1,"Landwirtschaftsgesetz"]
[null,null,null,null,null,null,null,null,null,null,null,null,null,null,null,null,null,null,null,null,null,null,null,null,"BEHV-FINMA",{"$f":"IF(LEFT(AA168,2)=\"0.\",\"\",IF(AND(TEXT(AA168,\"000.000.000\")=LOOKUP(TEXT(AA168,\"000.000.000\"),_SRZitatE),TEXT(AA168,\"000.000.000\")=LOOKUP(TEXT(AA168,\"000.000.000\"),_SRZitatR)),\"e / r\",IF(TEXT(AA168,\"000.000.000\")=LOOKUP(TEXT(AA168,\"000.000.000\"),_SRZitatE),\"e\",IF(TEXT(AA168,\"000.000.000\")=LOOKUP(TEXT(AA168,\"000.000.000\"),_SRZitatR),\"r\",\"\"))))","v":""},"954.193","Börsenverordnung-FINMA","220.000.000.000","220","Federal Act of 30 March 1911 on the Amendment of the Swiss Civil Code (Part Five: The Code of Obligations)","442.110.000.000",442.11,"Ordinaziun dals 23 da november 2011 davart la promoziun da la cultura (OPCu)","LPG",412.31,"Lehrpersonalgesetz"]
[null,null,null,null,null,null,null,null,null,null,null,null,null,null,null,null,null,null,null,null,null,null,null,null,"BetmG","e",812.12099999999998,"Betäubungsmittelgesetz",{"$f":"TEXT(AD169,\"000.000.000.000\")","v":"231.100.000.000"},"231.1 ","Federal Act of 9 October 1992 on Copyright and Related Rights (Copyright Act, CopA)","451.100.000.000","451.1","Lescha federala dal 1. da fanadur 1966 davart la protecziun da la natira e da la patria (LPNP)","LPVO","412.311","Lehrpersonalverordnung"]
[null,null,null,null,null,null,null,null,null,null,null,null,null,null,null,null,null,null,null,null,null,null,null,null,"BetmV",{"$f":"IF(LEFT(AA170,2)=\"0.\",\"\",IF(AND(TEXT(AA170,\"000.000.000\")=LOOKUP(TEXT(AA170,\"000.000.000\"),_SRZitatE),TEXT(AA170,\"000.000.000\")=LOOKUP(TEXT(AA170,\"000.000.000\"),_SRZitatR)),\"e / r\",IF(TEXT(AA170,\"000.000.000\")=LOOKUP(TEXT(AA170,\"000.000.000\"),_SRZitatE),\"e\",IF(TEXT(AA170,\"000.000.000\")=LOOKUP(TEXT(AA170,\"000.000.000\"),_SRZitatR),\"r\",\"\"))))","v":""},"812.121.1","Betäubungsmittelverordnung",{"$f":"TEXT(AD170,\"000.000.000.000\")","v":"232.110.000.000"},"232.11 ","Federal Act of 28 August 1992 on the Protection of Trade Marks and Indications of Source (Trade Mark Protection Act, TmPA)","451.110.000.000","451.11","Ordinaziun dals 16 da schaner 1991 davart la protecziun da la natira e da la patria (OPNP)","NAV Hausw",821.12,"NAV für hauswirtschaftliche Arbeitnehmer"]
[null,null,null,null,null,null,null,null,null,null,null,null,null,null,null,null,null,null,null,null,null,null,null,null,"BewG",{"$f":"IF(LEFT(AA171,2)=\"0.\",\"\",IF(AND(TEXT(AA171,\"000.000.000\")=LOOKUP(TEXT(AA171,\"000.000.000\"),_SRZitatE),TEXT(AA171,\"000.000.000\")=LOOKUP(TEXT(AA171,\"000.000.000\"),_SRZitatR)),\"e / r\",IF(TEXT(AA171,\"000.000.000\")=LOOKUP(TEXT(AA171,\"000.000.000\"),_SRZitatE),\"e\",IF(TEXT(AA171,\"000.000.000\")=LOOKUP(TEXT(AA171,\"000.000.000\"),_SRZitatR),\"r\",\"\"))))","v":""},"211.412.41","Erwerb von Grundstücken durch Personen im Ausland, BG über den ",{"$f":"TEXT(AD171,\"000.000.000.000\")","v":"232.120.000.000"},"232.12  ","Federal Act of 5 October 2001 on the Protection of Designs Designs Act, DesA)","455.000.000.000","455","Lescha federala dals 16 da december 2005 davart la protecziun dals animals (LPAn)"]
[null,null,null,null,null,null,null,null,null,null,null,null,null,null,null,null,null,null,null,null,null,null,null,null,"BewV",{"$f":"IF(LEFT(AA172,2)=\"0.\",\"\",IF(AND(TEXT(AA172,\"000.000.000\")=LOOKUP(TEXT(AA172,\"000.000.000\"),_SRZitatE),TEXT(AA172,\"000.000.000\")=LOOKUP(TEXT(AA172,\"000.000.000\"),_SRZitatR)),\"e / r\",IF(TEXT(AA172,\"000.000.000\")=LOOKUP(TEXT(AA172,\"000.000.000\"),_SRZitatE),\"e\",IF(TEXT(AA172,\"000.000.000\")=LOOKUP(TEXT(AA172,\"000.000.000\"),_SRZitatR),\"r\",\"\"))))","v":""},"211.412.411","Erwerb von Grundstücken durch Personen im Ausland, VO über den ","232.140.000.000","232.14  ","Federal Act of 25 June 1954 on Patents for Inventions (Patents Act, PatA)","520.100.000.000","520.1","Lescha federala dals 4 d’october 2002 davart la protecziun da la populaziun e la protecziun civila (LPPC)","NAV Landw",821.13,"NAV für das landwirtschaftliche Arbeitsverhältnis"]
[null,null,null,null,null,null,null,null,null,null,null,null,null,null,null,null,null,null,null,null,null,null,null,null,"BGA","e","152.1","Archivierungsgesetz",{"$f":"TEXT(AD173,\"000.000.000.000\")","v":"232.210.000.000"},"232.21","Federal Act on the Protection of the Swiss Coat of Arms and Other Public Signs (Coat of Arms Protection, CAPA)","672.400.000.000","672.4","Lescha federala dals 15 da zercladur 2012 davart l’imposiziun internaziunala da taglias a la funtauna (LITF)","NofV","242.2","Notariatsverordnung"]
[null,null,null,null,null,null,null,null,null,null,null,null,null,null,null,null,null,null,null,null,null,null,null,null,"BGBB",{"$f":"IF(LEFT(AA174,2)=\"0.\",\"\",IF(AND(TEXT(AA174,\"000.000.000\")=LOOKUP(TEXT(AA174,\"000.000.000\"),_SRZitatE),TEXT(AA174,\"000.000.000\")=LOOKUP(TEXT(AA174,\"000.000.000\"),_SRZitatR)),\"e / r\",IF(TEXT(AA174,\"000.000.000\")=LOOKUP(TEXT(AA174,\"000.000.000\"),_SRZitatE),\"e\",IF(TEXT(AA174,\"000.000.000\")=LOOKUP(TEXT(AA174,\"000.000.000\"),_SRZitatR),\"r\",\"\"))))","v":""},"211.412.11","bäuerliche Bodenrecht, BG über das ","235.100.000.000","235.1","Federal Act of 19 June 1992 on Data Protection (FADP)","700.000.000.000","700","Lescha federala dals 22 da zercladur 1979 davart la planisaziun dal territori (Lescha davart la planisaziun dal territori, LPT)","NotG","242","Notariatsgesetz"]
[null,null,null,null,null,null,null,null,null,null,null,null,null,null,null,null,null,null,null,null,null,null,null,null,"BGerR",{"$f":"IF(LEFT(AA175,2)=\"0.\",\"\",IF(AND(TEXT(AA175,\"000.000.000\")=LOOKUP(TEXT(AA175,\"000.000.000\"),_SRZitatE),TEXT(AA175,\"000.000.000\")=LOOKUP(TEXT(AA175,\"000.000.000\"),_SRZitatR)),\"e / r\",IF(TEXT(AA175,\"000.000.000\")=LOOKUP(TEXT(AA175,\"000.000.000\"),_SRZitatE),\"e\",IF(TEXT(AA175,\"000.000.000\")=LOOKUP(TEXT(AA175,\"000.000.000\"),_SRZitatR),\"r\",\"\"))))","v":""},"173.110.131","Bundesgericht, Reglement für das ","235.110.000.000","235.11","Ordinance of 14 June 1993 to the Federal Act on Data Protection (OFADP)","700.100.000.000","700.1","Ordinaziun dals 28 da zercladur 2000 davart la planisaziun dal territori (OPT)","NotGebV","243","Notariatsgebührenverordnung"]
[null,null,null,null,null,null,null,null,null,null,null,null,null,null,null,null,null,null,null,null,null,null,null,null,"BGF","r","923.0","Fischerei, BG über die","235.130.000.000","235.13","Ordinance of 28 September 2007 on Data Protection Certification (DPCO)","702.000.000.000","702","Lescha federala dals 20 da mars 2015 davart las abitaziuns secundaras (Lescha davart las abitaziuns secundaras, LAS)","OG RR",172.1,"G über die Organisation des RR + Verwaltung"]
[null,null,null,null,null,null,null,null,null,null,null,null,null,null,null,null,null,null,null,null,null,null,null,null,"BGFA",{"$f":"IF(LEFT(AA177,2)=\"0.\",\"\",IF(AND(TEXT(AA177,\"000.000.000\")=LOOKUP(TEXT(AA177,\"000.000.000\"),_SRZitatE),TEXT(AA177,\"000.000.000\")=LOOKUP(TEXT(AA177,\"000.000.000\"),_SRZitatR)),\"e / r\",IF(TEXT(AA177,\"000.000.000\")=LOOKUP(TEXT(AA177,\"000.000.000\"),_SRZitatE),\"e\",IF(TEXT(AA177,\"000.000.000\")=LOOKUP(TEXT(AA177,\"000.000.000\"),_SRZitatR),\"r\",\"\"))))","v":""},935.61,"Anwaltsgesetz","251.000.000.000","251","Federal Act of 6 October 1995 on Cartels and other Restraints of Competition (Cartel Act, CartA)","702.100.000.000","702.1","Ordinaziun dals 4 da december 2015 davart las abitaziuns secundaras (OAS)","OHV","341.1","Kantonale Opferhilfeverordnung"]
[null,null,null,null,null,null,null,null,null,null,null,null,null,null,null,null,null,null,null,null,null,null,null,null,"BGG","r","173.110","Bundesgerichtsgesetz","251.400.000.000","251.4","Ordinance of 17 June 1996 on the Control of Concentrations of Undertakings (Merger Control Ordinance, MCO)","721.100.000.000","721.100","Lescha federala dals 21 da zercladur 1991 davart la correcziun dals curs d’aua ","PBG",700.1,"Planungs- und Baugesetz"]
[null,null,null,null,null,null,null,null,null,null,null,null,null,null,null,null,null,null,null,null,null,null,null,null,"BG-HAÜ",{"$f":"IF(LEFT(AA179,2)=\"0.\",\"\",IF(AND(TEXT(AA179,\"000.000.000\")=LOOKUP(TEXT(AA179,\"000.000.000\"),_SRZitatE),TEXT(AA179,\"000.000.000\")=LOOKUP(TEXT(AA179,\"000.000.000\"),_SRZitatR)),\"e / r\",IF(TEXT(AA179,\"000.000.000\")=LOOKUP(TEXT(AA179,\"000.000.000\"),_SRZitatE),\"e\",IF(TEXT(AA179,\"000.000.000\")=LOOKUP(TEXT(AA179,\"000.000.000\"),_SRZitatR),\"r\",\"\"))))","v":""},"211.221.31","Haager Adoptionsübereink. + Massn. zum Schutz des Kindes bei internat. Adoptionen, BG zum","251.500.000.000","251.5","Ordinance of 12 March 2004 on Sanctions imposed for Unlawful Restraints of Competition (Cartel Act Sanctions Ordinance, CASO)","721.100.1","721.100.1","Ordinaziun dals 2 da november 1994 davart la correcziun dals curs d’aua (OCCA)","PG","177.10","Personalgesetz"]
[null,null,null,null,null,null,null,null,null,null,null,null,null,null,null,null,null,null,null,null,null,null,null,null,"BG-KKE","e","211.222.32","internationale Kindesentführung und die Haager Übereinkommen zum Schutz von Kindern und Erwachsenen, Bezirksgericht über","272.000.000.000","272","Swiss Civil Procedure Code of 19 December 2008 (Civil Procedure Code, CPC)","741.010.000.000","741.01","Lescha davart il traffic sin via dals 19 da december 1958 (LTV)","PHG",414.41,"G über die Pädagogische Hochschule"]
[null,null,null,null,null,null,null,null,null,null,null,null,null,null,null,null,null,null,null,null,null,null,null,null,"BGÖ","e / r","152.3","Öffentlichkeitsgesetz","311.000.000.000","311.0","Swiss Criminal Code of 21 December 1937","783.000.000.000","783.0","Lescha da posta dals 17 da december 2010 (LPO)","POG",551.1,"Polizeiorganisationsgesetz"]
[null,null,null,null,null,null,null,null,null,null,null,null,null,null,null,null,null,null,null,null,null,null,null,null,"BGSA",{"$f":"IF(LEFT(AA182,2)=\"0.\",\"\",IF(AND(TEXT(AA182,\"000.000.000\")=LOOKUP(TEXT(AA182,\"000.000.000\"),_SRZitatE),TEXT(AA182,\"000.000.000\")=LOOKUP(TEXT(AA182,\"000.000.000\"),_SRZitatR)),\"e / r\",IF(TEXT(AA182,\"000.000.000\")=LOOKUP(TEXT(AA182,\"000.000.000\"),_SRZitatE),\"e\",IF(TEXT(AA182,\"000.000.000\")=LOOKUP(TEXT(AA182,\"000.000.000\"),_SRZitatR),\"r\",\"\"))))","v":""},822.41,"Schwarzarbeit, BG gegen die ","312.000.000.000","312.0","Swiss Criminal Procedure Code of 5 October 2007 (Criminal Procedure Code, CPC)","783.010.000.000","783.01","Ordinaziun da posta dals 29 d’avust 2012 (OPO)","PublG","170.5","Publikationsgesetz"]
[null,null,null,null,null,null,null,null,null,null,null,null,null,null,null,null,null,null,null,null,null,null,null,null,"BGST","e","745.2","Sicherheitsorgane der Transportunternehmen im öffentlichen Verkehr, BG über die","351.100.000.000",351.1,"Federal Act of 20 March 1981 on International Mutual Assistance in Criminal Matters (Mutual Assistance Act, IMAC)","784.400.000.000","784.40","Lescha federala dals 24 da mars 2006 davart radio e televisiun (LRTV)","PublV","170.51","Publikationsverordnung"]
[null,null,null,null,null,null,null,null,null,null,null,null,null,null,null,null,null,null,null,null,null,null,null,null,"BiGV","e","432.22","Bibliothek am Guisanplatz, Verordnung über die ","371.000.000.000","371","Federal Act of 20 June 2003 on the Annulment of the Convictions of Persons who assisted Refugees at the time of the Nazi Regime","810.310.000.000","810.31","Lescha federala dals 19 da december 2003 davart la perscrutaziun da cellas embrionalas da basa (Lescha davart las cellas da basa, LCB)","PVO",177.11,"Personalverordnung"]
[null,null,null,null,null,null,null,null,null,null,null,null,null,null,null,null,null,null,null,null,null,null,null,null,"BIV-FINMA","e","952.05","Bankeninsolvenzverordnung-FINMA","412.100.000.000","412.10","Federal Act of 13 December 2002 on Vocational and Professional Education and Training (Vocational and Professional Education and Training Act, VPETA)","814.200.000.000","814.20","Lescha federala dals 24 da schaner 1991 davart la protecziun da las auas (Lescha davart la protecziun da las auas, LPAuas)","RLG",822.4,"Ruhetags- und Ladenöffnungsgesetz"]
[null,null,null,null,null,null,null,null,null,null,null,null,null,null,null,null,null,null,null,null,null,null,null,null,"BöB",{"$f":"IF(LEFT(AA186,2)=\"0.\",\"\",IF(AND(TEXT(AA186,\"000.000.000\")=LOOKUP(TEXT(AA186,\"000.000.000\"),_SRZitatE),TEXT(AA186,\"000.000.000\")=LOOKUP(TEXT(AA186,\"000.000.000\"),_SRZitatR)),\"e / r\",IF(TEXT(AA186,\"000.000.000\")=LOOKUP(TEXT(AA186,\"000.000.000\"),_SRZitatE),\"e\",IF(TEXT(AA186,\"000.000.000\")=LOOKUP(TEXT(AA186,\"000.000.000\"),_SRZitatR),\"r\",\"\"))))","v":""},"172.056.1","öffentliche Beschaffungswesen, BG über das","412.101.000.000","412.101","Ordinance of 19 November 2003 on Vocational and Professional Education and Training (Vocational and Professional Education and Training Ordinance, VPETO)","831.400.000.000","831.4","Lescha federala davart la prevenziun professiunala per vegls, survivents ed invaliditad, LPP ","SchlVerf GLG","177.12","Schlichtungsverfahren für Streitigkeiten nach GlG"]
[null,null,null,null,null,null,null,null,null,null,null,null,null,null,null,null,null,null,null,null,null,null,null,null,"BPG","r","172.220.1","Bundespersonalgesetz","412.106.1","412.106.1","Ordinance of 14 September 2005 on the Swiss Federal Institute for Vocational Education and Training (SFIVET Ordinance)","836.200.000.000","836.2","Lescha federala dals 24 da mars 2006 davart ils supplements da famiglia (lescha davart ils supplements da famiglia, LSFam)","SHG",851.1,"Sozialhilfegesetz"]
[null,null,null,null,null,null,null,null,null,null,null,null,null,null,null,null,null,null,null,null,null,null,null,null,"BPR","e / r","161.1","BG über die politischen Rechte",{"$f":"TEXT(AD188,\"000.000.000.000\")","v":"414.110.000.000"},"414.110","Federal Act of 4 October 1991 on the Federal Institutes of Technology (FIT Act)","910.100.000.000","910.1","Lescha federala dals 29 d’avrigl 1998 davart l’agricultura (Lescha d’agricultura, LAgr)"]
[null,null,null,null,null,null,null,null,null,null,null,null,null,null,null,null,null,null,null,null,null,null,null,null,"BPV",{"$f":"IF(LEFT(AA189,2)=\"0.\",\"\",IF(AND(TEXT(AA189,\"000.000.000\")=LOOKUP(TEXT(AA189,\"000.000.000\"),_SRZitatE),TEXT(AA189,\"000.000.000\")=LOOKUP(TEXT(AA189,\"000.000.000\"),_SRZitatR)),\"e / r\",IF(TEXT(AA189,\"000.000.000\")=LOOKUP(TEXT(AA189,\"000.000.000\"),_SRZitatE),\"e\",IF(TEXT(AA189,\"000.000.000\")=LOOKUP(TEXT(AA189,\"000.000.000\"),_SRZitatR),\"r\",\"\"))))","v":""},"172.220.111.3","Bundespersonalverordnung","414.200.000.000","414.20","Federal Act of 30 September 2011 on Funding and Coordination of the Swiss Higher Education Sector (Higher Education Act, HEdA)","923.000.000.000","923.0","Lescha federala dals 21 da zercladur 1991 davart la pestga (LFP)","SHV","851.11","Sozialhilfeverordnung"]
[null,null,null,null,null,null,null,null,null,null,null,null,null,null,null,null,null,null,null,null,null,null,null,null,"BSDA",null,"852.1","Sozialhilfe + Darlehen an Auslandschweizer, BG über","414.205.3","414.205.3","Guidelines of the Higher Education Council of 28 May 2015 for accreditation within the higher education sector (HEdA Accreditation Guidelines)","923.010.000.000","923.01","Ordinaziun dals 24 da november 1993 tar la lescha federala davart la pestga (OLFP)","StG",631.1,"Steuergesetz"]
[null,null,null,null,null,null,null,null,null,null,null,null,null,null,null,null,null,null,null,null,null,null,null,null,"BSG",null,"747.201","Binnenschifffahrtsgesetz","415.000.000.000","415.0","Federal Act of 17 June 2011 on the Prommotion of Sport and Exercice (Sport Promotion Act, SpoPA)","974.100.000.000","974.1","Lescha federala dals 24 da mars 2006 davart la collavuraziun cun ils stadis da l’Europa da l’ost","StJVG",331,"Straf- und Justizvollzugsgesetz"]
[null,null,null,null,null,null,null,null,null,null,null,null,null,null,null,null,null,null,null,null,null,null,null,null,"BStatG","e","431.01","Bundesstatistikgesetz ","420.100.000.000","420.1","Federal Act of 14 December 2012 on the Promotion of Research and Innovation (RIPA)",null,null,null,"StrG",722.1,"Strassengesetz"]
[null,null,null,null,null,null,null,null,null,null,null,null,null,null,null,null,null,null,null,null,null,null,null,null,"BStatOV","e","431.011","Organisation der Bundesstatistik, VO über ","431.010.000.000","431.01","Federal Statistics Act of 9 October 1992 (FStatA)",null,null,null,"StV",631.11,"VO zum Steuergesetz"]
[null,null,null,null,null,null,null,null,null,null,null,null,null,null,null,null,null,null,null,null,null,null,null,null,"BSV",null,"747.201.1","Binnenschifffahrtsverordnung","431.011.000.000","431.011","Ordinance of 30 June 1993 on the Organisation of Federal Statistics",null,null,null,"UniG",415.11,"Universitätsgesetz"]
[null,null,null,null,null,null,null,null,null,null,null,null,null,null,null,null,null,null,null,null,null,null,null,null,"BüG","e / r","141.0","Bürgerrechtsgesetz","431.020.000.000",431.02,"Federal Act of 23 June 2006 on the Harmonisation of the Register of Residents and of other Official Registers of Persons (Register Harmonisation Act, RHA)",null,null,null,"VBewG","234.1","VO zum EG BewG"]
[null,null,null,null,null,null,null,null,null,null,null,null,null,null,null,null,null,null,null,null,null,null,null,null,"BV","e / r","101","Bundesverfassung","431.112.000.000","431.112","Federal Act of 22 June 2007 on the Federal Census (Census Act)",null,null,null,"VBG","281.1","VO über Betreibungs- und Gemeindeammannämter"]
[null,null,null,null,null,null,null,null,null,null,null,null,null,null,null,null,null,null,null,null,null,null,null,null,"BVG",{"$f":"IF(LEFT(AA197,2)=\"0.\",\"\",IF(AND(TEXT(AA197,\"000.000.000\")=LOOKUP(TEXT(AA197,\"000.000.000\"),_SRZitatE),TEXT(AA197,\"000.000.000\")=LOOKUP(TEXT(AA197,\"000.000.000\"),_SRZitatR)),\"e / r\",IF(TEXT(AA197,\"000.000.000\")=LOOKUP(TEXT(AA197,\"000.000.000\"),_SRZitatE),\"e\",IF(TEXT(AA197,\"000.000.000\")=LOOKUP(TEXT(AA197,\"000.000.000\"),_SRZitatR),\"r\",\"\"))))","v":""},"831.40","berufliche Alters-, Hinterlassenen- und Invalidenvorsorge, BG über die ","432.220.000.000","432.22","Ordinance of 9 October 2013 on the Library Am Guisanplatz (BiGO)",null,null,null,"VO ArG",822.1,"VO zum Arbeitsgesetz"]
[null,null,null,null,null,null,null,null,null,null,null,null,null,null,null,null,null,null,null,null,null,null,null,null,"BVV 1",{"$f":"IF(LEFT(AA198,2)=\"0.\",\"\",IF(AND(TEXT(AA198,\"000.000.000\")=LOOKUP(TEXT(AA198,\"000.000.000\"),_SRZitatE),TEXT(AA198,\"000.000.000\")=LOOKUP(TEXT(AA198,\"000.000.000\"),_SRZitatR)),\"e / r\",IF(TEXT(AA198,\"000.000.000\")=LOOKUP(TEXT(AA198,\"000.000.000\"),_SRZitatE),\"e\",IF(TEXT(AA198,\"000.000.000\")=LOOKUP(TEXT(AA198,\"000.000.000\"),_SRZitatR),\"r\",\"\"))))","v":""},"831.435.1","Beaufsichtigung und die Registrierung der Vorsorgeeinrichtungen, VO über die ","441.100.000.000","441.1","Federal Act of 5 October 2007 on the National Languages and Understanding between the Linguistic Communities (Languages Act, LangA) ",null,null,null,"VO AVEG","821.11","VO über den Vollzug des AVEG"]
[null,null,null,null,null,null,null,null,null,null,null,null,null,null,null,null,null,null,null,null,null,null,null,null,"BVV 2",{"$f":"IF(LEFT(AA199,2)=\"0.\",\"\",IF(AND(TEXT(AA199,\"000.000.000\")=LOOKUP(TEXT(AA199,\"000.000.000\"),_SRZitatE),TEXT(AA199,\"000.000.000\")=LOOKUP(TEXT(AA199,\"000.000.000\"),_SRZitatR)),\"e / r\",IF(TEXT(AA199,\"000.000.000\")=LOOKUP(TEXT(AA199,\"000.000.000\"),_SRZitatE),\"e\",IF(TEXT(AA199,\"000.000.000\")=LOOKUP(TEXT(AA199,\"000.000.000\"),_SRZitatR),\"r\",\"\"))))","v":""},"831.441.1","berufliche Alters-, Hinterlassenen- und Invalidenvorsorge, VO über die ","441.110.000.000","441.11","Ordinance of 4 June 2010 on the National Languages and Understanding between the Linguistic Communities (Languages Ordinance, LangO)",null,null,null,"VO EG AVIG","837.11","VO zum EG AVIG"]
[null,null,null,null,null,null,null,null,null,null,null,null,null,null,null,null,null,null,null,null,null,null,null,null,"BVV 3",{"$f":"IF(LEFT(AA200,2)=\"0.\",\"\",IF(AND(TEXT(AA200,\"000.000.000\")=LOOKUP(TEXT(AA200,\"000.000.000\"),_SRZitatE),TEXT(AA200,\"000.000.000\")=LOOKUP(TEXT(AA200,\"000.000.000\"),_SRZitatR)),\"e / r\",IF(TEXT(AA200,\"000.000.000\")=LOOKUP(TEXT(AA200,\"000.000.000\"),_SRZitatE),\"e\",IF(TEXT(AA200,\"000.000.000\")=LOOKUP(TEXT(AA200,\"000.000.000\"),_SRZitatR),\"r\",\"\"))))","v":""},"831.461.3","steuerliche Abzugsberechtigung für Beiträge an anerkannte Vorsorgeformen, VO über die ","443.100.000.000","443.1","Federal Act of 14 December 2001 on Film Production and Film Culture (Film Act, FiA)",null,null,null,"VO EG KVG","832.1","Verordnung zum EG KVG"]
[null,null,null,null,null,null,null,null,null,null,null,null,null,null,null,null,null,null,null,null,null,null,null,null,"BWIS",null,"120","Massnahmen zur Wahrung der inneren Sicherheit, BG über","451.000.000.000","451","Federal Act of 1 July 1966 on the Protection of Nature and Cultural Heritage (NCHA)",null,null,null,"VO RLG",822.41,"VO zum Ruhetags- und Ladenöffnungsgesetz"]
[null,null,null,null,null,null,null,null,null,null,null,null,null,null,null,null,null,null,null,null,null,null,null,null,"BZG","r","520.1","Bevölkerungs- und Zivilschutzgesetz","451.100.000.000","451.1","Ordinance of 16 January 1991 on the Protection of Nature and Cultural Heritage (NCHO)",null,null,null,"VO UVG","832.21","VO zum Unfallversicherungsgesetz"]
[null,null,null,null,null,null,null,null,null,null,null,null,null,null,null,null,null,null,null,null,null,null,null,null,"BZP",{"$f":"IF(LEFT(AA203,2)=\"0.\",\"\",IF(AND(TEXT(AA203,\"000.000.000\")=LOOKUP(TEXT(AA203,\"000.000.000\"),_SRZitatE),TEXT(AA203,\"000.000.000\")=LOOKUP(TEXT(AA203,\"000.000.000\"),_SRZitatR)),\"e / r\",IF(TEXT(AA203,\"000.000.000\")=LOOKUP(TEXT(AA203,\"000.000.000\"),_SRZitatE),\"e\",IF(TEXT(AA203,\"000.000.000\")=LOOKUP(TEXT(AA203,\"000.000.000\"),_SRZitatR),\"r\",\"\"))))","v":""},"273","Bundeszivilprozess, BG über den","451.360.000.000","451.36","Ordinance of 7 November 2007 on Parks of National Importance (Parks Ordinance, ParkO) ",null,null,null,"VOG RR","172.11","VO über die Organisation des RR + Verwaltung"]
[null,null,null,null,null,null,null,null,null,null,null,null,null,null,null,null,null,null,null,null,null,null,null,null,"CartV","e","814.912.21","Cartagena-Verordnung",{"$f":"TEXT(AD204,\"000.000.000.000\")","v":"451.610.000.000"},"451.61","Ordinance of 11 December 2015 on the Nagoya Protocol on Access to Genetic Resources and the Fair and Equitable Sharing of Benefits Arising from their Utilization (Nagoya Ordinance, NagO)",null,null,null,"VPR",161.1,"VO über die politischen Rechte"]
[null,null,null,null,null,null,null,null,null,null,null,null,null,null,null,null,null,null,null,null,null,null,null,null,"CEDAW",{"$f":"IF(LEFT(AA205,2)=\"0.\",\"\",IF(AND(TEXT(AA205,\"000.000.000\")=LOOKUP(TEXT(AA205,\"000.000.000\"),_SRZitatE),TEXT(AA205,\"000.000.000\")=LOOKUP(TEXT(AA205,\"000.000.000\"),_SRZitatR)),\"e / r\",IF(TEXT(AA205,\"000.000.000\")=LOOKUP(TEXT(AA205,\"000.000.000\"),_SRZitatE),\"e\",IF(TEXT(AA205,\"000.000.000\")=LOOKUP(TEXT(AA205,\"000.000.000\"),_SRZitatR),\"r\",\"\"))))","v":""},"0.108","Übereinkommen zur Beseitigung jeder Form von Diskriminierung der Frau","454.000.000.000","454","Federal Act of 19 December 1980 on the Swiss National Park in the Canton of Graubünden (National Park Act)",null,null,null,"VRG",175.2,"Verwaltungsrechtspflegegesetz"]
[null,null,null,null,null,null,null,null,null,null,null,null,null,null,null,null,null,null,null,null,null,null,null,null,"ChemG","e","813.1","Chemikaliengesetz","510.411.000.000","510.411","Ordinance on the of 4 July 2007 Protection of Federal Information (Information Protection Ordinance, IPO)",null,null,null,"VSG","412.100","Volksschulgesetz"]
[null,null,null,null,null,null,null,null,null,null,null,null,null,null,null,null,null,null,null,null,null,null,null,null,"ChemPICV","e","814.82","PIC-Verordnung","510.620.000.000","510.62","Federal Act of 5 October 2007 on Geoinformation (Geoinformation Act, GeoIA)",null,null,null,"VSV","412.101","Volksschulverordnung"]
[null,null,null,null,null,null,null,null,null,null,null,null,null,null,null,null,null,null,null,null,null,null,null,null,"ChemRRV","e","814.81","Chemikalien-Risikoreduktions-Verordnung","514.510.000.000","514.51","Federal Act of 13 December 1996 on War Material (War Material Act, WMA)",null,null,null,"VV KZG","836.11","VollziehungsVO zum Kinderzulagengesetz"]
[null,null,null,null,null,null,null,null,null,null,null,null,null,null,null,null,null,null,null,null,null,null,null,null,"ChemV","e","813.11","Chemikalienverordnung","514.511.000.000","514.511","Ordinance of 25 February 1998 on War Material (War Material Ordinance, WMO)",null,null,null,"VVO PG",177.11099999999999,"VollzugsVO zum Personalgesetz"]
[null,null,null,null,null,null,null,null,null,null,null,null,null,null,null,null,null,null,null,null,null,null,null,null,"CISG",{"$f":"IF(LEFT(AA210,2)=\"0.\",\"\",IF(AND(TEXT(AA210,\"000.000.000\")=LOOKUP(TEXT(AA210,\"000.000.000\"),_SRZitatE),TEXT(AA210,\"000.000.000\")=LOOKUP(TEXT(AA210,\"000.000.000\"),_SRZitatR)),\"e / r\",IF(TEXT(AA210,\"000.000.000\")=LOOKUP(TEXT(AA210,\"000.000.000\"),_SRZitatE),\"e\",IF(TEXT(AA210,\"000.000.000\")=LOOKUP(TEXT(AA210,\"000.000.000\"),_SRZitatR),\"r\",\"\"))))","v":""},"0.221.211.1","UN-Übereinkommen über Verträge über den internationalen Warenkauf (Convention of International Sale of Goods)","531.000.000.000","531","Federal Act of 8 October 1982 on the National Economic Supply (National Economic Supply Act [NESA]) ",null,null,null,"VVSA",823.44,"VollzugsVG zum Schwarzarbeitsgesetz"]
[null,null,null,null,null,null,null,null,null,null,null,null,null,null,null,null,null,null,null,null,null,null,null,null,"CMR",{"$f":"IF(LEFT(AA211,2)=\"0.\",\"\",IF(AND(TEXT(AA211,\"000.000.000\")=LOOKUP(TEXT(AA211,\"000.000.000\"),_SRZitatE),TEXT(AA211,\"000.000.000\")=LOOKUP(TEXT(AA211,\"000.000.000\"),_SRZitatR)),\"e / r\",IF(TEXT(AA211,\"000.000.000\")=LOOKUP(TEXT(AA211,\"000.000.000\"),_SRZitatE),\"e\",IF(TEXT(AA211,\"000.000.000\")=LOOKUP(TEXT(AA211,\"000.000.000\"),_SRZitatR),\"r\",\"\"))))","v":""},"0.741.611","Übereinkommen über den Beförderungsvertrag im internationalen Strassengüterverkehr","632.100.000.000","632.10","Customs Tariff Act of 9 October 1986 (CTA)",null,null,null,"ZLG","831.3","Zusatzleistungengesetz"]
[null,null,null,null,null,null,null,null,null,null,null,null,null,null,null,null,null,null,null,null,null,null,null,null,"CO2AV","e","641.711.1","CO2-Anrechnungsverordnung","641.200.000.000","641.20","Federal Act of 12 June 2009 on Value Added Tax (Value Added Tax Act, VAT Act)",null,null,null,"ZLV","831.31","Zusatzleistungsverordnung"]
[null,null,null,null,null,null,null,null,null,null,null,null,null,null,null,null,null,null,null,null,null,null,null,null,"CO2-G","e","641.71","Reduktion der CO2-Emissionen, BG über die","641.201.000.000",641.20100000000002,"Ordinance of 27 November 2009 on Value Added Tax (Value Added Tax Ordinance, VAT Ordinance)",null,null,null,"ZVO",231.1,"Zivilstandsverordnung, Kantonale "]
[null,null,null,null,null,null,null,null,null,null,null,null,null,null,null,null,null,null,null,null,null,null,null,null,"CO2-V","e","641.711"," Reduktion der CO2-Emissionen, VO über die","641.201.511","641.201.511","Ordinance of the FDF of 11 December 2009 on Electronic Data and Information (OElDI)"]
[null,null,null,null,null,null,null,null,null,null,null,null,null,null,null,null,null,null,null,null,null,null,null,null,"DBG",{"$f":"IF(LEFT(AA215,2)=\"0.\",\"\",IF(AND(TEXT(AA215,\"000.000.000\")=LOOKUP(TEXT(AA215,\"000.000.000\"),_SRZitatE),TEXT(AA215,\"000.000.000\")=LOOKUP(TEXT(AA215,\"000.000.000\"),_SRZitatR)),\"e / r\",IF(TEXT(AA215,\"000.000.000\")=LOOKUP(TEXT(AA215,\"000.000.000\"),_SRZitatE),\"e\",IF(TEXT(AA215,\"000.000.000\")=LOOKUP(TEXT(AA215,\"000.000.000\"),_SRZitatR),\"r\",\"\"))))","v":""},"642.11","direkte Bundessteuer, BG über die ","641.710.000.000","641.71","Federal Act of 23 December 2011 on the Reduction of CO2 Emissions (CO2 Act)"]
[null,null,null,null,null,null,null,null,null,null,null,null,null,null,null,null,null,null,null,null,null,null,null,null,"DesG","e","232.12","Designgesetz","641.711.000.000","641.711","Ordinance of 30 November 2012 for the Reduction of CO2 Emissions (CO2 Ordinance)"]
[null,null,null,null,null,null,null,null,null,null,null,null,null,null,null,null,null,null,null,null,null,null,null,null,"DSG","e",235.1,"Datenschutzgesetz","641.714.11","641.714.11","Ordinance of 2 June 2017 on the Acquisition and Reporting of Tonne-Kilometre Data relating to Distances Covered by Aircraft "]
[null,null,null,null,null,null,null,null,null,null,null,null,null,null,null,null,null,null,null,null,null,null,null,null,"ECRMS","r","0.441.2","Europäische Charta der Regional- oder Minderheitensprachen","651.100.000.000","651.1","Federal Act of 28 September 2012 on International Administrative Assistance in Tax Matters (Tax Administrative Assistance Act, TAAA)"]
[null,null,null,null,null,null,null,null,null,null,null,null,null,null,null,null,null,null,null,null,null,null,null,null,"EHB-V","e","412.106.1","Eidgenössische Hochschulinstitut für Berufsbildung, VO über das","672.400.000.000","672.4","Federal Act of 15 June 2012 on International Withholding Tax (IWTA)"]
[null,null,null,null,null,null,null,null,null,null,null,null,null,null,null,null,null,null,null,null,null,null,null,null,"EHG",{"$f":"IF(LEFT(AA220,2)=\"0.\",\"\",IF(AND(TEXT(AA220,\"000.000.000\")=LOOKUP(TEXT(AA220,\"000.000.000\"),_SRZitatE),TEXT(AA220,\"000.000.000\")=LOOKUP(TEXT(AA220,\"000.000.000\"),_SRZitatR)),\"e / r\",IF(TEXT(AA220,\"000.000.000\")=LOOKUP(TEXT(AA220,\"000.000.000\"),_SRZitatE),\"e\",IF(TEXT(AA220,\"000.000.000\")=LOOKUP(TEXT(AA220,\"000.000.000\"),_SRZitatR),\"r\",\"\"))))","v":""},"221.112.742"," Haftpflicht der Eisenbahn- und Dampfschifffahrtsunternehmungen + der CH-Post.  BG über","721.101.000.000","721.101","Federal Act of 1 October 2010 on Water Retaining Facilities (Water Retaining Facilities Act, WRFA)"]
[null,null,null,null,null,null,null,null,null,null,null,null,null,null,null,null,null,null,null,null,null,null,null,null,"EigVV",{"$f":"IF(LEFT(AA221,2)=\"0.\",\"\",IF(AND(TEXT(AA221,\"000.000.000\")=LOOKUP(TEXT(AA221,\"000.000.000\"),_SRZitatE),TEXT(AA221,\"000.000.000\")=LOOKUP(TEXT(AA221,\"000.000.000\"),_SRZitatR)),\"e / r\",IF(TEXT(AA221,\"000.000.000\")=LOOKUP(TEXT(AA221,\"000.000.000\"),_SRZitatE),\"e\",IF(TEXT(AA221,\"000.000.000\")=LOOKUP(TEXT(AA221,\"000.000.000\"),_SRZitatR),\"r\",\"\"))))","v":""},"211.413.1","Eintragung der Eigentumsvorbehalte, VO betreffend die ","721.101.1","721.101.1","Water Retaining Facilities Ordinance of 17 October 2012 (WRFO)"]
[null,null,null,null,null,null,null,null,null,null,null,null,null,null,null,null,null,null,null,null,null,null,null,null,"ElDI-V","e","641.201.511","elektronische Daten und Informationen, Verordnung des EFD über ","732.100.000.000","732.1","Nuclear Energy Act of 21 March 2003 (NEA)"]
[null,null,null,null,null,null,null,null,null,null,null,null,null,null,null,null,null,null,null,null,null,null,null,null,"EleG",{"$f":"IF(LEFT(AA223,2)=\"0.\",\"\",IF(AND(TEXT(AA223,\"000.000.000\")=LOOKUP(TEXT(AA223,\"000.000.000\"),_SRZitatE),TEXT(AA223,\"000.000.000\")=LOOKUP(TEXT(AA223,\"000.000.000\"),_SRZitatR)),\"e / r\",IF(TEXT(AA223,\"000.000.000\")=LOOKUP(TEXT(AA223,\"000.000.000\"),_SRZitatE),\"e\",IF(TEXT(AA223,\"000.000.000\")=LOOKUP(TEXT(AA223,\"000.000.000\"),_SRZitatR),\"r\",\"\"))))","v":""},"734.0","Elektrizitätsgesetz","732.110.000.000","732.11","Nuclear Energy Ordinance of 10 December 2004 (NEO)"]
[null,null,null,null,null,null,null,null,null,null,null,null,null,null,null,null,null,null,null,null,null,null,null,null,"ELG",{"$f":"IF(LEFT(AA224,2)=\"0.\",\"\",IF(AND(TEXT(AA224,\"000.000.000\")=LOOKUP(TEXT(AA224,\"000.000.000\"),_SRZitatE),TEXT(AA224,\"000.000.000\")=LOOKUP(TEXT(AA224,\"000.000.000\"),_SRZitatR)),\"e / r\",IF(TEXT(AA224,\"000.000.000\")=LOOKUP(TEXT(AA224,\"000.000.000\"),_SRZitatE),\"e\",IF(TEXT(AA224,\"000.000.000\")=LOOKUP(TEXT(AA224,\"000.000.000\"),_SRZitatR),\"r\",\"\"))))","v":""},"831.30","Ergänzungsleistungen zur AHV, BG über ","734.500.000.000","734.5","Ordinance of 25 November 2015 on Electromagnetic Compatibility (OEMC) "]
[null,null,null,null,null,null,null,null,null,null,null,null,null,null,null,null,null,null,null,null,null,null,null,null,"ELV",{"$f":"IF(LEFT(AA225,2)=\"0.\",\"\",IF(AND(TEXT(AA225,\"000.000.000\")=LOOKUP(TEXT(AA225,\"000.000.000\"),_SRZitatE),TEXT(AA225,\"000.000.000\")=LOOKUP(TEXT(AA225,\"000.000.000\"),_SRZitatR)),\"e / r\",IF(TEXT(AA225,\"000.000.000\")=LOOKUP(TEXT(AA225,\"000.000.000\"),_SRZitatE),\"e\",IF(TEXT(AA225,\"000.000.000\")=LOOKUP(TEXT(AA225,\"000.000.000\"),_SRZitatR),\"r\",\"\"))))","v":""},"831.301","Ergänzungsleistungen zur AHV, VO über ","742.161.000.000","742.161","Ordinance of 17 December 2014 on the Safety Investigation of Transport Incidents (OSITI)"]
[null,null,null,null,null,null,null,null,null,null,null,null,null,null,null,null,null,null,null,null,null,null,null,null,"EmbG","e","946.231","Embargogesetz","745.200.000.000","745.2","Federal Act of 18 June 2010 on the Security Units of Public Transport Companies (PTSA)"]
[null,null,null,null,null,null,null,null,null,null,null,null,null,null,null,null,null,null,null,null,null,null,null,null,"EMKG","e","941.31","Edelmetallkontrollgesetz","745.210.000.000","745.21","Ordinance of 17 August 2011 on the Security Units of Public Transport Companies (PTSO)"]
[null,null,null,null,null,null,null,null,null,null,null,null,null,null,null,null,null,null,null,null,null,null,null,null,"EMKV","e","941.311","Edelmetallkontrollverordnung","748.941.000.000","748.941","DETEC Ordinance of 24 November 1994 on Special Category Aircraft (OSCA)"]
[null,null,null,null,null,null,null,null,null,null,null,null,null,null,null,null,null,null,null,null,null,null,null,null,"EMRK",{"$f":"IF(LEFT(AA229,2)=\"0.\",\"\",IF(AND(TEXT(AA229,\"000.000.000\")=LOOKUP(TEXT(AA229,\"000.000.000\"),_SRZitatE),TEXT(AA229,\"000.000.000\")=LOOKUP(TEXT(AA229,\"000.000.000\"),_SRZitatR)),\"e / r\",IF(TEXT(AA229,\"000.000.000\")=LOOKUP(TEXT(AA229,\"000.000.000\"),_SRZitatE),\"e\",IF(TEXT(AA229,\"000.000.000\")=LOOKUP(TEXT(AA229,\"000.000.000\"),_SRZitatR),\"r\",\"\"))))","v":""},"0.101","Schutz der Menschenrechte und Grundfreiheiten, Konvention zum ","783.100.000.000",783.1,"Federal Act of 17 December 2010 on the Organisation of Swiss Post (Post Organisation Act, POA)"]
[null,null,null,null,null,null,null,null,null,null,null,null,null,null,null,null,null,null,null,null,null,null,null,null,"EntG",null,"711","Enteignungsgesetz","784.100.000.000","784.10","Telecommunications Act of 30 April 1997 (TCA)"]
[null,null,null,null,null,null,null,null,null,null,null,null,null,null,null,null,null,null,null,null,null,null,null,null,"EntsG",{"$f":"IF(LEFT(AA231,2)=\"0.\",\"\",IF(AND(TEXT(AA231,\"000.000.000\")=LOOKUP(TEXT(AA231,\"000.000.000\"),_SRZitatE),TEXT(AA231,\"000.000.000\")=LOOKUP(TEXT(AA231,\"000.000.000\"),_SRZitatR)),\"e / r\",IF(TEXT(AA231,\"000.000.000\")=LOOKUP(TEXT(AA231,\"000.000.000\"),_SRZitatE),\"e\",IF(TEXT(AA231,\"000.000.000\")=LOOKUP(TEXT(AA231,\"000.000.000\"),_SRZitatR),\"r\",\"\"))))","v":""},"823.20","in die Schweiz entsandten Arbeitnehmerinnen und Arbeitnehmer, BG über die ","784.101.1","784.101.1","Ordinance of 9 March 2007 on Telecommunications Services (OTS)"]
[null,null,null,null,null,null,null,null,null,null,null,null,null,null,null,null,null,null,null,null,null,null,null,null,"EntsV",{"$f":"IF(LEFT(AA232,2)=\"0.\",\"\",IF(AND(TEXT(AA232,\"000.000.000\")=LOOKUP(TEXT(AA232,\"000.000.000\"),_SRZitatE),TEXT(AA232,\"000.000.000\")=LOOKUP(TEXT(AA232,\"000.000.000\"),_SRZitatR)),\"e / r\",IF(TEXT(AA232,\"000.000.000\")=LOOKUP(TEXT(AA232,\"000.000.000\"),_SRZitatE),\"e\",IF(TEXT(AA232,\"000.000.000\")=LOOKUP(TEXT(AA232,\"000.000.000\"),_SRZitatR),\"r\",\"\"))))","v":""},823.20100000000002,"in die Schweiz entsandten Arbeitnehmerinnen und Arbeitnehmer, VO über die ","784.101.2","784.101.2","Ordinance of 25 November 2015 on Telecommunications Installations (FAV)"]
[null,null,null,null,null,null,null,null,null,null,null,null,null,null,null,null,null,null,null,null,null,null,null,null,"EÖBV",null,"943.033","elektronische öffentliche Beurkundung, VO über die","784.104.2","784.104.2","Ordinance of 5 November 2014 on Internet Domains (OID)"]
[null,null,null,null,null,null,null,null,null,null,null,null,null,null,null,null,null,null,null,null,null,null,null,null,"EOG",{"$f":"IF(LEFT(AA234,2)=\"0.\",\"\",IF(AND(TEXT(AA234,\"000.000.000\")=LOOKUP(TEXT(AA234,\"000.000.000\"),_SRZitatE),TEXT(AA234,\"000.000.000\")=LOOKUP(TEXT(AA234,\"000.000.000\"),_SRZitatR)),\"e / r\",IF(TEXT(AA234,\"000.000.000\")=LOOKUP(TEXT(AA234,\"000.000.000\"),_SRZitatE),\"e\",IF(TEXT(AA234,\"000.000.000\")=LOOKUP(TEXT(AA234,\"000.000.000\"),_SRZitatR),\"r\",\"\"))))","v":""},834.1,"Erwerbsersatzgesetz","784.400.000.000","784.40","Federal Act of 24 March 2006 on Radio and Television (RTVA) "]
[null,null,null,null,null,null,null,null,null,null,null,null,null,null,null,null,null,null,null,null,null,null,null,null,"EOV",{"$f":"IF(LEFT(AA235,2)=\"0.\",\"\",IF(AND(TEXT(AA235,\"000.000.000\")=LOOKUP(TEXT(AA235,\"000.000.000\"),_SRZitatE),TEXT(AA235,\"000.000.000\")=LOOKUP(TEXT(AA235,\"000.000.000\"),_SRZitatR)),\"e / r\",IF(TEXT(AA235,\"000.000.000\")=LOOKUP(TEXT(AA235,\"000.000.000\"),_SRZitatE),\"e\",IF(TEXT(AA235,\"000.000.000\")=LOOKUP(TEXT(AA235,\"000.000.000\"),_SRZitatR),\"r\",\"\"))))","v":""},834.11,"Erwerbsersatzgesetz, VO zum","784.401.000.000","784.401","Ordinance of 9 March 2007 on Radio and Television (RTVO)"]
[null,null,null,null,null,null,null,null,null,null,null,null,null,null,null,null,null,null,null,null,null,null,null,null,"EpG",{"$f":"IF(LEFT(AA236,2)=\"0.\",\"\",IF(AND(TEXT(AA236,\"000.000.000\")=LOOKUP(TEXT(AA236,\"000.000.000\"),_SRZitatE),TEXT(AA236,\"000.000.000\")=LOOKUP(TEXT(AA236,\"000.000.000\"),_SRZitatR)),\"e / r\",IF(TEXT(AA236,\"000.000.000\")=LOOKUP(TEXT(AA236,\"000.000.000\"),_SRZitatE),\"e\",IF(TEXT(AA236,\"000.000.000\")=LOOKUP(TEXT(AA236,\"000.000.000\"),_SRZitatR),\"r\",\"\"))))","v":""},"818.101","Epidemiegesetz","810.110.000.000","810.11","Federal Act of 18 December 1998 on Medically Assisted Reproduction (Reproductive Medicine Act, RMA)"]
[null,null,null,null,null,null,null,null,null,null,null,null,null,null,null,null,null,null,null,null,null,null,null,null,"ESV",null,"814.912","Einschliessungsverordnung",{"$f":"TEXT(AD237,\"000.000.000.000\")","v":"810.112.2"},"810.112.2","Reproductive Medicine Ordinance of 4 December 2000 (RMO)"]
[null,null,null,null,null,null,null,null,null,null,null,null,null,null,null,null,null,null,null,null,null,null,null,null,"ETHG","e","414.110","Eidgenössischen Technischen Hochschulen, BG über die","810.120.000.000","810.12","Federal Act of 8 October 2004 on Human Genetic Testing (HGTA)"]
[null,null,null,null,null,null,null,null,null,null,null,null,null,null,null,null,null,null,null,null,null,null,null,null,"ExpaV",null,"642.118.3","Expatriates-Verordnung","810.210.000.000","810.21","Federal Act of 8 October 2004 on the Transplantation of Organs, Tissues and Cells (Transplantation Act)"]
[null,null,null,null,null,null,null,null,null,null,null,null,null,null,null,null,null,null,null,null,null,null,null,null,"FamZG","r",836.2,"Familienzulagengesetz","810.300.000.000","810.30","Federal Act of 30 September 2011 on Research involving Human Beings (Human Research Act, HRA)"]
[null,null,null,null,null,null,null,null,null,null,null,null,null,null,null,null,null,null,null,null,null,null,null,null,"FamZV",{"$f":"IF(LEFT(AA241,2)=\"0.\",\"\",IF(AND(TEXT(AA241,\"000.000.000\")=LOOKUP(TEXT(AA241,\"000.000.000\"),_SRZitatE),TEXT(AA241,\"000.000.000\")=LOOKUP(TEXT(AA241,\"000.000.000\"),_SRZitatR)),\"e / r\",IF(TEXT(AA241,\"000.000.000\")=LOOKUP(TEXT(AA241,\"000.000.000\"),_SRZitatE),\"e\",IF(TEXT(AA241,\"000.000.000\")=LOOKUP(TEXT(AA241,\"000.000.000\"),_SRZitatR),\"r\",\"\"))))","v":""},836.21,"Familienzulagenverordnung","810.301.000.000","810.301","Ordinance of 20 September 2013 on Human Research with the Exception of Clinical Trials (Human Research Ordinance, HRO)"]
[null,null,null,null,null,null,null,null,null,null,null,null,null,null,null,null,null,null,null,null,null,null,null,null,"FAV","e","784.101.2","Fernmeldeanlagenverordnung","810.305.000.000","810.305","Ordinance of 20 September 2013 on Clinical Trials in Human Research (Clinical Trials Ordinance; ClinO)"]
[null,null,null,null,null,null,null,null,null,null,null,null,null,null,null,null,null,null,null,null,null,null,null,null,"FDV","e","784.101.1","Fernmeldediensteverordnung","810.308.000.000","810.308","Ordinance of 20 September 2013 on Organisational Aspects of the Human Research Act (HRA Organisation Ordinance, OrgO-HRA)"]
[null,null,null,null,null,null,null,null,null,null,null,null,null,null,null,null,null,null,null,null,null,null,null,null,"FHG",{"$f":"IF(LEFT(AA244,2)=\"0.\",\"\",IF(AND(TEXT(AA244,\"000.000.000\")=LOOKUP(TEXT(AA244,\"000.000.000\"),_SRZitatE),TEXT(AA244,\"000.000.000\")=LOOKUP(TEXT(AA244,\"000.000.000\"),_SRZitatR)),\"e / r\",IF(TEXT(AA244,\"000.000.000\")=LOOKUP(TEXT(AA244,\"000.000.000\"),_SRZitatE),\"e\",IF(TEXT(AA244,\"000.000.000\")=LOOKUP(TEXT(AA244,\"000.000.000\"),_SRZitatR),\"r\",\"\"))))","v":""},"611.0","Finanzhaushaltgesetz","810.310.000.000","810.31","Federal Act of 19 December 2003 on Research Involving Embryonic Stem Cells (Stem Cell Research Act, StRA)"]
[null,null,null,null,null,null,null,null,null,null,null,null,null,null,null,null,null,null,null,null,null,null,null,null,"FIFG","e / r","420.1","Förderung der Forschung und der Innovation, BG über die","810.311.000.000","810.311","Ordinance of 2 February 2005 on Research involving Embryonic Stem Cells (Stem Cell Research Ordinance, SCRO)"]
[null,null,null,null,null,null,null,null,null,null,null,null,null,null,null,null,null,null,null,null,null,null,null,null,"FiG","e","443.1","Filmgesetz","812.121.000.000","812.121","Federal Act of 3 October 1951 on Narcotics and Psychotropic Substances (Narcotics Act, NarcA)"]
[null,null,null,null,null,null,null,null,null,null,null,null,null,null,null,null,null,null,null,null,null,null,null,null,"FINMAG",null,"956.1","Finanzmarktaufsichtsgesetz","812.210.000.000",812.21,"Federal Act of 15 December 2000 on Medicinal Products and Medical Devices (Therapeutic Products Act, TPA)"]
[null,null,null,null,null,null,null,null,null,null,null,null,null,null,null,null,null,null,null,null,null,null,null,null,"FLG",{"$f":"IF(LEFT(AA248,2)=\"0.\",\"\",IF(AND(TEXT(AA248,\"000.000.000\")=LOOKUP(TEXT(AA248,\"000.000.000\"),_SRZitatE),TEXT(AA248,\"000.000.000\")=LOOKUP(TEXT(AA248,\"000.000.000\"),_SRZitatR)),\"e / r\",IF(TEXT(AA248,\"000.000.000\")=LOOKUP(TEXT(AA248,\"000.000.000\"),_SRZitatE),\"e\",IF(TEXT(AA248,\"000.000.000\")=LOOKUP(TEXT(AA248,\"000.000.000\"),_SRZitatR),\"r\",\"\"))))","v":""},"836.1","Familienzulagen Landwirtschaft","812.213.000.000","812.213","Medical Devices Ordinance of 17 October 2001 (MedDO)"]
[null,null,null,null,null,null,null,null,null,null,null,null,null,null,null,null,null,null,null,null,null,null,null,null,"FlühHG","e","371","Aufhebung von Strafurteilen gegen Flüchtlingshelfer zur Nazi-Zeit, BG über","813.100.000.000","813.1","Federal Act of 15 December 2000 on Protection against Dangerous Substances and Preparations (Chemicals Act, ChemA)"]
[null,null,null,null,null,null,null,null,null,null,null,null,null,null,null,null,null,null,null,null,null,null,null,null,"FMedG","e","810.11","Fortpflanzungsmedizingesetz","813.110.000.000","813.11","Ordinance of 5 June 2015 on Protection against Dangerous Substances and Preparations (Chemicals Ordinance, ChemO)"]
[null,null,null,null,null,null,null,null,null,null,null,null,null,null,null,null,null,null,null,null,null,null,null,null,"FMedV","e","810.112.2","Fortpflanzungsmedizinverordnung","813.112.1","813.112.1","Ordinance of 18 May 2005 on Good Laboratory Practice (OGLP)"]
[null,null,null,null,null,null,null,null,null,null,null,null,null,null,null,null,null,null,null,null,null,null,null,null,"FMG","e","784.10","Fernmeldegesetz","813.120.000.000","813.12","Ordinance of 18 May 2005 on the Placing on the Market and Handling of Biocidal Products (Ordinance on Biocidal Products, OBP)"]
[null,null,null,null,null,null,null,null,null,null,null,null,null,null,null,null,null,null,null,null,null,null,null,null,"FoK",{"$f":"IF(LEFT(AA253,2)=\"0.\",\"\",IF(AND(TEXT(AA253,\"000.000.000\")=LOOKUP(TEXT(AA253,\"000.000.000\"),_SRZitatE),TEXT(AA253,\"000.000.000\")=LOOKUP(TEXT(AA253,\"000.000.000\"),_SRZitatR)),\"e / r\",IF(TEXT(AA253,\"000.000.000\")=LOOKUP(TEXT(AA253,\"000.000.000\"),_SRZitatE),\"e\",IF(TEXT(AA253,\"000.000.000\")=LOOKUP(TEXT(AA253,\"000.000.000\"),_SRZitatR),\"r\",\"\"))))","v":""},"0.105","UNO-Folterkonvention","814.010.000.000","814.01","Federal Act of 7 October 1983 on the Protection of the Environment (Environmental Protection Act, EPA)"]
[null,null,null,null,null,null,null,null,null,null,null,null,null,null,null,null,null,null,null,null,null,null,null,null,"FrSV","e","814.911","Freisetzungsverordnung","814.012.000.000","814.012","Ordinance of 27 February 1991 on Protection against Major Accidents (Major Accidents Ordinance, MAO)"]
[null,null,null,null,null,null,null,null,null,null,null,null,null,null,null,null,null,null,null,null,null,null,null,null,"FusG",{"$f":"IF(LEFT(AA255,2)=\"0.\",\"\",IF(AND(TEXT(AA255,\"000.000.000\")=LOOKUP(TEXT(AA255,\"000.000.000\"),_SRZitatE),TEXT(AA255,\"000.000.000\")=LOOKUP(TEXT(AA255,\"000.000.000\"),_SRZitatR)),\"e / r\",IF(TEXT(AA255,\"000.000.000\")=LOOKUP(TEXT(AA255,\"000.000.000\"),_SRZitatE),\"e\",IF(TEXT(AA255,\"000.000.000\")=LOOKUP(TEXT(AA255,\"000.000.000\"),_SRZitatR),\"r\",\"\"))))","v":""},221.30099999999999,"Fusionsgesetz","814.017.000.000","814.017","Ordinance of 15 December 2006 on the Register relating to Pollutant Release and the Transfer of Waste and of Pollutants in Waste Water (PRTR-V)"]
[null,null,null,null,null,null,null,null,null,null,null,null,null,null,null,null,null,null,null,null,null,null,null,null,"FZA","","0.142.112.681","Freizügigkeitsabkommen","814.018.000.000","814.018","Ordinance of 12 November 1997 on the Incentive Tax on Volatile Organic Compounds (OVOC)"]
[null,null,null,null,null,null,null,null,null,null,null,null,null,null,null,null,null,null,null,null,null,null,null,null,"FZG","",831.42,"Freizügigkeitsgesetz","814.200.000.000","814.20","Federal Act of 24 January 1991 on the Protection of Waters (Waters Protection Act, WPA)"]
[null,null,null,null,null,null,null,null,null,null,null,null,null,null,null,null,null,null,null,null,null,null,null,null,"FZV","","831.425","Freizügigkeitsverordnung","814.201.000.000","814.201","Waters Protection Ordinance of 28 October 1998 (WPO)"]
[null,null,null,null,null,null,null,null,null,null,null,null,null,null,null,null,null,null,null,null,null,null,null,null,"GBV","","211.432.1","Grundbuchverordnung","814.318.142.1","814.318.142.1","Ordinance of 16 December 1985 on Air Pollution Control (OAPC)"]
[null,null,null,null,null,null,null,null,null,null,null,null,null,null,null,null,null,null,null,null,null,null,null,null,"GeBüV","","221.431","Geschäftsbücherverordnung","814.410.000.000","814.41","Noise Abatement Ordinance of 15 December 1986 (NAO)"]
[null,null,null,null,null,null,null,null,null,null,null,null,null,null,null,null,null,null,null,null,null,null,null,null,"GebV EMK","e","941.319","Gebührenverordnung Edelmetallkontrolle","814.490.000.000","814.49","Ordinance of 28 February 2007 on the Protection of Audiences from Exposure to Hazard-ous Sound Levels and Laser Beams (Sound Levels and Laser Ordinance, SLO)"]
[null,null,null,null,null,null,null,null,null,null,null,null,null,null,null,null,null,null,null,null,null,null,null,null,"GebV HReg",{"$f":"IF(LEFT(AA262,2)=\"0.\",\"\",IF(AND(TEXT(AA262,\"000.000.000\")=LOOKUP(TEXT(AA262,\"000.000.000\"),_SRZitatE),TEXT(AA262,\"000.000.000\")=LOOKUP(TEXT(AA262,\"000.000.000\"),_SRZitatR)),\"e / r\",IF(TEXT(AA262,\"000.000.000\")=LOOKUP(TEXT(AA262,\"000.000.000\"),_SRZitatE),\"e\",IF(TEXT(AA262,\"000.000.000\")=LOOKUP(TEXT(AA262,\"000.000.000\"),_SRZitatR),\"r\",\"\"))))","v":""},"221.411.1","Gebühren des Handelsregisters, VO über die ","814.500.000.000","814.50","Radiological Protection Act of 22 March 1991 (RPA)"]
[null,null,null,null,null,null,null,null,null,null,null,null,null,null,null,null,null,null,null,null,null,null,null,null,"GebV SchKG",{"$f":"IF(LEFT(AA263,2)=\"0.\",\"\",IF(AND(TEXT(AA263,\"000.000.000\")=LOOKUP(TEXT(AA263,\"000.000.000\"),_SRZitatE),TEXT(AA263,\"000.000.000\")=LOOKUP(TEXT(AA263,\"000.000.000\"),_SRZitatR)),\"e / r\",IF(TEXT(AA263,\"000.000.000\")=LOOKUP(TEXT(AA263,\"000.000.000\"),_SRZitatE),\"e\",IF(TEXT(AA263,\"000.000.000\")=LOOKUP(TEXT(AA263,\"000.000.000\"),_SRZitatR),\"r\",\"\"))))","v":""},281.35000000000002,"Gebührenverordnung Schuldbetreibung- und Konkursgesetz","814.501.000.000","814.501","Radiological Protection Ordinance of 22 June 1994 (RPO)"]
[null,null,null,null,null,null,null,null,null,null,null,null,null,null,null,null,null,null,null,null,null,null,null,null,"GebV-AuG",{"$f":"IF(LEFT(AA264,2)=\"0.\",\"\",IF(AND(TEXT(AA264,\"000.000.000\")=LOOKUP(TEXT(AA264,\"000.000.000\"),_SRZitatE),TEXT(AA264,\"000.000.000\")=LOOKUP(TEXT(AA264,\"000.000.000\"),_SRZitatR)),\"e / r\",IF(TEXT(AA264,\"000.000.000\")=LOOKUP(TEXT(AA264,\"000.000.000\"),_SRZitatE),\"e\",IF(TEXT(AA264,\"000.000.000\")=LOOKUP(TEXT(AA264,\"000.000.000\"),_SRZitatR),\"r\",\"\"))))","v":""},"142.209","Gebührenverordnung Ausländergesetz","814.621.000.000","814.621","Ordinance of 5 July 2000 on Beverage Containers (Beverage Container Ordinance, BCO)"]
[null,null,null,null,null,null,null,null,null,null,null,null,null,null,null,null,null,null,null,null,null,null,null,null,"GebV-AVG",{"$f":"IF(LEFT(AA265,2)=\"0.\",\"\",IF(AND(TEXT(AA265,\"000.000.000\")=LOOKUP(TEXT(AA265,\"000.000.000\"),_SRZitatE),TEXT(AA265,\"000.000.000\")=LOOKUP(TEXT(AA265,\"000.000.000\"),_SRZitatR)),\"e / r\",IF(TEXT(AA265,\"000.000.000\")=LOOKUP(TEXT(AA265,\"000.000.000\"),_SRZitatE),\"e\",IF(TEXT(AA265,\"000.000.000\")=LOOKUP(TEXT(AA265,\"000.000.000\"),_SRZitatR),\"r\",\"\"))))","v":""},823.11300000000006,"Gebührenverordnung Arbeitsvermittlungsgesetz","814.680.000.000","814.680","Ordinance of 26 August 1998 on the Remediation of Polluted Sites (Contaminated Sites Ordinance, CSO)"]
[null,null,null,null,null,null,null,null,null,null,null,null,null,null,null,null,null,null,null,null,null,null,null,null,"GebV-BüG","e","141.21"," Gebühren zum Bürgerrechtsgesetz, VO über die","814.681.000.000","814.681","Ordinance of 26 September 2008 on the Charge for the Remediation of Contaminated Sites (OCRCS)"]
[null,null,null,null,null,null,null,null,null,null,null,null,null,null,null,null,null,null,null,null,null,null,null,null,"GeoIG","e","510.62","Geoinformationsgesetz","814.810.000.000","814.81","Ordinance of 18 May 2005 on the Reduction of Risks relating to the Use of Certain Particularly Dangerous Substances, Preparations and Articles (Chemical Risk Reduction Ordinance, ORRChem)"]
[null,null,null,null,null,null,null,null,null,null,null,null,null,null,null,null,null,null,null,null,null,null,null,null,"GeoIV",null,"510.620","Geoinformationsverordnung","814.820.000.000","814.82","Ordinance of 10 November 2004 on the Rotterdam Convention on the Prior Informed Consent Procedure for Certain Chemicals in International Trade (PIC Ordinance, ChemPICO)"]
[null,null,null,null,null,null,null,null,null,null,null,null,null,null,null,null,null,null,null,null,null,null,null,null,"GGUV",null,"930.111.4","Gefahrgutumschliessungsverordnung","814.910.000.000","814.91","Federal Act of 21 March 2003 on Non-Human Gene Technology (Gene Technology Act, GTA)"]
[null,null,null,null,null,null,null,null,null,null,null,null,null,null,null,null,null,null,null,null,null,null,null,null,"GKG","e","946.202","Güterkontrollgesetz","814.911.000.000","814.911","Ordinance of 10 September 2008 on the Handling of Organisms in the Environment (Release Ordinance, RO)"]
[null,null,null,null,null,null,null,null,null,null,null,null,null,null,null,null,null,null,null,null,null,null,null,null,"GlG","e / r",151.1,"Gleichstellungsgesetz","814.912.21","814.912.21","Ordinance of 3 November 2004 on the Transboundary Movements of Genetically Modified Organisms (Cartagena Ordinance, CartO)"]
[null,null,null,null,null,null,null,null,null,null,null,null,null,null,null,null,null,null,null,null,null,null,null,null,"GLPV","e","813.112.1","Gute Laborpraxis, VO über die","817.000.000.000","817.0","Federal Act of 9 October 1992 on Foodstuffs and Utility Articles (Foodstuffs Act, FSA)"]
[null,null,null,null,null,null,null,null,null,null,null,null,null,null,null,null,null,null,null,null,null,null,null,null,"GRN","e","171.13","Geschäftsreglement des Nationalrates","817.064.000.000","817.064","Ordinance of the FDHA of 10 December 2007 on Combined Warnings on Tobacco Products"]
[null,null,null,null,null,null,null,null,null,null,null,null,null,null,null,null,null,null,null,null,null,null,null,null,"GRS","e","171.14","Geschäftsreglement des Ständerates","910.100.000.000","910.1","Federal Act of 29 April 1998 on Agriculture (Agriculture Act, AgricA)"]
[null,null,null,null,null,null,null,null,null,null,null,null,null,null,null,null,null,null,null,null,null,null,null,null,"GschG","e / r","814.20","Gewässerschutzgesetz","910.120.000.000","910.12","Ordinance of 28 May 1997 on the Protection of Designations of Origin and Geographical Indications for Agricultural Products and Processed Agricultural Products (PDO/PGI Ordinance)"]
[null,null,null,null,null,null,null,null,null,null,null,null,null,null,null,null,null,null,null,null,null,null,null,null,"GschV","e","814.201","Gewässerschutzverordnung","910.124.000.000","910.124","Ordinance of the FDEA of 11 June 1999 on the Minimum Requirements for Control Procedures of Protected Designations of Origin and Geographical Indications (Ordinance on the Control of PDOs and PGIs)"]
[null,null,null,null,null,null,null,null,null,null,null,null,null,null,null,null,null,null,null,null,null,null,null,null,"GSG","e","192.12","Gaststaatgesetz","910.810.000.000","910.81","EAER Ordinance of 22 September 1997 on Organic Farming"]
[null,null,null,null,null,null,null,null,null,null,null,null,null,null,null,null,null,null,null,null,null,null,null,null,"GSV",{"$f":"IF(LEFT(AA278,2)=\"0.\",\"\",IF(AND(TEXT(AA278,\"000.000.000\")=LOOKUP(TEXT(AA278,\"000.000.000\"),_SRZitatE),TEXT(AA278,\"000.000.000\")=LOOKUP(TEXT(AA278,\"000.000.000\"),_SRZitatR)),\"e / r\",IF(TEXT(AA278,\"000.000.000\")=LOOKUP(TEXT(AA278,\"000.000.000\"),_SRZitatE),\"e\",IF(TEXT(AA278,\"000.000.000\")=LOOKUP(TEXT(AA278,\"000.000.000\"),_SRZitatR),\"r\",\"\"))))","v":""},"935.521.21","Glücksspielverordnung","921.000.000.000","921.0","Federal Act of 4 October 1991 on Forest (Forest Act, ForA)"]
[null,null,null,null,null,null,null,null,null,null,null,null,null,null,null,null,null,null,null,null,null,null,null,null,"GTG","e","814.91","Gentechnikgesetz","921.010.000.000","921.01","Ordinance of 30 November 1992 on Forest (Forest Ordinance, ForO)"]
[null,null,null,null,null,null,null,null,null,null,null,null,null,null,null,null,null,null,null,null,null,null,null,null,"GUB/GGA-KV","e","910.124","Mindestanforderungen Kontrolle Ursprungsbezeichnungen und geografischen Angaben, VO über","935.410.000.000","935.41","Federal Act of 27 September 2013 on Private Security Services provided Abroad (PSSA)"]
[null,null,null,null,null,null,null,null,null,null,null,null,null,null,null,null,null,null,null,null,null,null,null,null,"GUB/GGA-V","e","910.12","Ursprungsbezeichnungen und geographischen Angaben, landwirtschaftliche, VO über","935.411.000.000","935.411","Ordinance of 24 June 2015 on Private Security Services provided Abroad (OPSA)"]
[null,null,null,null,null,null,null,null,null,null,null,null,null,null,null,null,null,null,null,null,null,null,null,null,"GUMG","e","810.12","genetische Untersuchungen beim Menschen, BG über","935.620.000.000","935.62","Federal Act of 20 March 2009 on Patent Attorneys (Patent Attorney Act, PatAA)"]
[null,null,null,null,null,null,null,null,null,null,null,null,null,null,null,null,null,null,null,null,null,null,null,null,"GVG",{"$f":"IF(LEFT(AA283,2)=\"0.\",\"\",IF(AND(TEXT(AA283,\"000.000.000\")=LOOKUP(TEXT(AA283,\"000.000.000\"),_SRZitatE),TEXT(AA283,\"000.000.000\")=LOOKUP(TEXT(AA283,\"000.000.000\"),_SRZitatR)),\"e / r\",IF(TEXT(AA283,\"000.000.000\")=LOOKUP(TEXT(AA283,\"000.000.000\"),_SRZitatE),\"e\",IF(TEXT(AA283,\"000.000.000\")=LOOKUP(TEXT(AA283,\"000.000.000\"),_SRZitatR),\"r\",\"\"))))","v":""},"171.11","Geschäftsverkehrsgesetz","935.621.000.000","935.621","Patent Attorney Ordinance of 11 May 2011 (PatAO)"]
[null,null,null,null,null,null,null,null,null,null,null,null,null,null,null,null,null,null,null,null,null,null,null,null,"GwG","e","955.0","Geldwäschereigesetz","935.910.000.000","935.91","Federal Act of 17 December 2010 on Mountain Guides and Organisers of other High-Risk Activities"]
[null,null,null,null,null,null,null,null,null,null,null,null,null,null,null,null,null,null,null,null,null,null,null,null,"HArG",{"$f":"IF(LEFT(AA285,2)=\"0.\",\"\",IF(AND(TEXT(AA285,\"000.000.000\")=LOOKUP(TEXT(AA285,\"000.000.000\"),_SRZitatE),TEXT(AA285,\"000.000.000\")=LOOKUP(TEXT(AA285,\"000.000.000\"),_SRZitatR)),\"e / r\",IF(TEXT(AA285,\"000.000.000\")=LOOKUP(TEXT(AA285,\"000.000.000\"),_SRZitatE),\"e\",IF(TEXT(AA285,\"000.000.000\")=LOOKUP(TEXT(AA285,\"000.000.000\"),_SRZitatR),\"r\",\"\"))))","v":""},822.31,"Heimarbeitsgesetz","935.911.000.000","935.911","Ordinance of 30 November 2012 on Mountain Guides and Organisers of other High-Risk Activities (High-Risk Activities Ordinance)"]
[null,null,null,null,null,null,null,null,null,null,null,null,null,null,null,null,null,null,null,null,null,null,null,null,"HDekl EVD","e"," 944.021.1","Deklaration von Holz und Holzprodukten, EVD-VO über die","941.100.000.000","941.10","Federal Act of 22 December 1999 on Currency and Payment Instruments (CPIA)"]
[null,null,null,null,null,null,null,null,null,null,null,null,null,null,null,null,null,null,null,null,null,null,null,null,"HEntfÜ",{"$f":"IF(LEFT(AA287,2)=\"0.\",\"\",IF(AND(TEXT(AA287,\"000.000.000\")=LOOKUP(TEXT(AA287,\"000.000.000\"),_SRZitatE),TEXT(AA287,\"000.000.000\")=LOOKUP(TEXT(AA287,\"000.000.000\"),_SRZitatR)),\"e / r\",IF(TEXT(AA287,\"000.000.000\")=LOOKUP(TEXT(AA287,\"000.000.000\"),_SRZitatE),\"e\",IF(TEXT(AA287,\"000.000.000\")=LOOKUP(TEXT(AA287,\"000.000.000\"),_SRZitatR),\"r\",\"\"))))","v":""},"0.211.230.02","Übereinkommen über die zivilrechtlichen Aspekte internationaler Kindesentführung","941.310.000.000","941.31","Federal Act of 20 June 1933 on the Control of the Trade in Precious Metals and Precious Metal Articles (Precious Metals Control Act, PMCA)"]
[null,null,null,null,null,null,null,null,null,null,null,null,null,null,null,null,null,null,null,null,null,null,null,null,"HFG","e","810.30","Humanforschungsgesetz","941.311.000.000","941.311","Ordinance of 8 May 1934 on the Control of Trade in Precious Metals and Articles of Precious Metals (Precious Metals Control Ordinance, PMCO)"]
[null,null,null,null,null,null,null,null,null,null,null,null,null,null,null,null,null,null,null,null,null,null,null,null,"HFV","e","810.301","HumanforschungsVO","941.319.000.000","941.319","Ordinance of 17 August 2005 on the Fees for Precious Metals Control"]
[null,null,null,null,null,null,null,null,null,null,null,null,null,null,null,null,null,null,null,null,null,null,null,null,"HMG","e","812.21","Heilmittelgesetz","944.021.000.000","944.021","Ordinance of 4 June 2010 on the Declaration for Timber and Timber Products"]
[null,null,null,null,null,null,null,null,null,null,null,null,null,null,null,null,null,null,null,null,null,null,null,null,"HRegV",{"$f":"IF(LEFT(AA291,2)=\"0.\",\"\",IF(AND(TEXT(AA291,\"000.000.000\")=LOOKUP(TEXT(AA291,\"000.000.000\"),_SRZitatE),TEXT(AA291,\"000.000.000\")=LOOKUP(TEXT(AA291,\"000.000.000\"),_SRZitatR)),\"e / r\",IF(TEXT(AA291,\"000.000.000\")=LOOKUP(TEXT(AA291,\"000.000.000\"),_SRZitatE),\"e\",IF(TEXT(AA291,\"000.000.000\")=LOOKUP(TEXT(AA291,\"000.000.000\"),_SRZitatR),\"r\",\"\"))))","v":""},221.411,"Handelsregisterverordnung",{"$f":"TEXT(AD291,\"000.000.000.000\")","v":"944.021.1"},"944.021.1","FDEA Ordinance of 7 June 2010 on the Declaration for Timber and Timber Products"]
[null,null,null,null,null,null,null,null,null,null,null,null,null,null,null,null,null,null,null,null,null,null,null,null,"HRG","","943.1","Gewerbe der Reisenden, BG über das (Handelsreisendengesetz)","944.300.000.000","944.3","Federal Act of 18 June 1993 on Package Travel"]
[null,null,null,null,null,null,null,null,null,null,null,null,null,null,null,null,null,null,null,null,null,null,null,null,"HVA","","831.135.1","Hilfsmittelverordnung AV","946.150.000.000","946.15","Ordinance of 1 May 2013 on the Organisation of the National Contact Point for the OECD Guidelines for Multinational Enterprises and on its Advisory Board (NCPO-OECD) "]
[null,null,null,null,null,null,null,null,null,null,null,null,null,null,null,null,null,null,null,null,null,null,null,null,"HVI ","","831.232.51","Hilfsmittelverordnung IV","946.202.000.000","946.202","Federal Act of 13 December 1996 on the Control of Dual-Use Goods and of Specific Military Goods (Goods Control Act, GCA)"]
[null,null,null,null,null,null,null,null,null,null,null,null,null,null,null,null,null,null,null,null,null,null,null,null,"HVUV","","832.205.12","Hilfsmittelverordnung UV","946.202.1","946.202.1","Ordinance of 3 June 2016 on the Export, Import and Transit of Dual Use Goods, Specific Military Goods and Strategic Goods (Goods Control Ordinance, GCO) "]
[null,null,null,null,null,null,null,null,null,null,null,null,null,null,null,null,null,null,null,null,null,null,null,null,"IPRG","",291,"Internationale Privatrecht, BG über das ","946.231.000.000","946.231","Federal Act of 22 March 2002 on the Implementation of International Sanctions (Embargo Act, EmbA)"]
[null,null,null,null,null,null,null,null,null,null,null,null,null,null,null,null,null,null,null,null,null,null,null,null,"IQG","e / r","672.4"," internationale Quellenbesteuerung, BG über die","946.310.000.000","946.31","Ordinance of 9 April 2008 on the Certification of the Non-Preferential Origin of Goods (OCG)"]
[null,null,null,null,null,null,null,null,null,null,null,null,null,null,null,null,null,null,null,null,null,null,null,null,"IRSG","e","351.1","Rechtshilfegesetz, BG über Rechtshilfe in internationalen Strafsachen","946.311.000.000","946.311","Ordinance of the FDEA of 9 April 2008 on the Certification of the Non-Preferential Origin of Goods (OCG-FDEA)"]
[null,null,null,null,null,null,null,null,null,null,null,null,null,null,null,null,null,null,null,null,null,null,null,null,"IRSV",{"$f":"IF(LEFT(AA299,2)=\"0.\",\"\",IF(AND(TEXT(AA299,\"000.000.000\")=LOOKUP(TEXT(AA299,\"000.000.000\"),_SRZitatE),TEXT(AA299,\"000.000.000\")=LOOKUP(TEXT(AA299,\"000.000.000\"),_SRZitatR)),\"e / r\",IF(TEXT(AA299,\"000.000.000\")=LOOKUP(TEXT(AA299,\"000.000.000\"),_SRZitatE),\"e\",IF(TEXT(AA299,\"000.000.000\")=LOOKUP(TEXT(AA299,\"000.000.000\"),_SRZitatR),\"r\",\"\"))))","v":""},"351.11","Rechtshilfeverordnung, VO über Rechtshilfe in internationalen Strafsachen","951.110.000.000","951.11","Federal Act of 3 October 2003 on the Swiss National Bank (National Bank Act, NBA)"]
[null,null,null,null,null,null,null,null,null,null,null,null,null,null,null,null,null,null,null,null,null,null,null,null,"ISchV","e","510.411","Informationsschutzverordnung","951.131.000.000","951.131","Ordinance of 18 March 2004 on the Federal Act on the Swiss National Bank (National Bank Ordinance, NBO)"]
[null,null,null,null,null,null,null,null,null,null,null,null,null,null,null,null,null,null,null,null,null,null,null,null,"IVG",{"$f":"IF(LEFT(AA301,2)=\"0.\",\"\",IF(AND(TEXT(AA301,\"000.000.000\")=LOOKUP(TEXT(AA301,\"000.000.000\"),_SRZitatE),TEXT(AA301,\"000.000.000\")=LOOKUP(TEXT(AA301,\"000.000.000\"),_SRZitatR)),\"e / r\",IF(TEXT(AA301,\"000.000.000\")=LOOKUP(TEXT(AA301,\"000.000.000\"),_SRZitatE),\"e\",IF(TEXT(AA301,\"000.000.000\")=LOOKUP(TEXT(AA301,\"000.000.000\"),_SRZitatR),\"r\",\"\"))))","v":""},"831.20","Invalidenversicherungsgesetz","951.310.000.000","951.31","Federal Act of 23 June 2006 on Collective Investment Schemes (Collective Investment Schemes Act, CISA)"]
[null,null,null,null,null,null,null,null,null,null,null,null,null,null,null,null,null,null,null,null,null,null,null,null,"IVV",{"$f":"IF(LEFT(AA302,2)=\"0.\",\"\",IF(AND(TEXT(AA302,\"000.000.000\")=LOOKUP(TEXT(AA302,\"000.000.000\"),_SRZitatE),TEXT(AA302,\"000.000.000\")=LOOKUP(TEXT(AA302,\"000.000.000\"),_SRZitatR)),\"e / r\",IF(TEXT(AA302,\"000.000.000\")=LOOKUP(TEXT(AA302,\"000.000.000\"),_SRZitatE),\"e\",IF(TEXT(AA302,\"000.000.000\")=LOOKUP(TEXT(AA302,\"000.000.000\"),_SRZitatR),\"r\",\"\"))))","v":""},831.20100000000002,"Invalidenversicherungsverordnung","951.311.000.000","951.311","Ordinance of 22 November 2006 on Collective Investment Schemes Collective Investment Schemes Ordinance, CISO)"]
[null,null,null,null,null,null,null,null,null,null,null,null,null,null,null,null,null,null,null,null,null,null,null,null,"JStG",{"$f":"IF(LEFT(AA303,2)=\"0.\",\"\",IF(AND(TEXT(AA303,\"000.000.000\")=LOOKUP(TEXT(AA303,\"000.000.000\"),_SRZitatE),TEXT(AA303,\"000.000.000\")=LOOKUP(TEXT(AA303,\"000.000.000\"),_SRZitatR)),\"e / r\",IF(TEXT(AA303,\"000.000.000\")=LOOKUP(TEXT(AA303,\"000.000.000\"),_SRZitatE),\"e\",IF(TEXT(AA303,\"000.000.000\")=LOOKUP(TEXT(AA303,\"000.000.000\"),_SRZitatR),\"r\",\"\"))))","v":""},311.10000000000002,"Jugendstrafgesetz","951.312.000.000","951.312","Ordinance of 27 August 2014 of the Swiss Financial Market Supervisory Authority on Collective Investment Schemes (FINMA Collective Investment Schemes Ordinance, CISO-FINMA)"]
[null,null,null,null,null,null,null,null,null,null,null,null,null,null,null,null,null,null,null,null,null,null,null,null,"KAG",{"$f":"IF(LEFT(AA304,2)=\"0.\",\"\",IF(AND(TEXT(AA304,\"000.000.000\")=LOOKUP(TEXT(AA304,\"000.000.000\"),_SRZitatE),TEXT(AA304,\"000.000.000\")=LOOKUP(TEXT(AA304,\"000.000.000\"),_SRZitatR)),\"e / r\",IF(TEXT(AA304,\"000.000.000\")=LOOKUP(TEXT(AA304,\"000.000.000\"),_SRZitatE),\"e\",IF(TEXT(AA304,\"000.000.000\")=LOOKUP(TEXT(AA304,\"000.000.000\"),_SRZitatR),\"r\",\"\"))))","v":""},"951.31","Kollektivanlagengesetz","952.050.000.000",952.05,"Ordinance of 30 August 2012 of the Swiss Financial Market Supervisory Authority on the Insolvency of Banks and Securities Dealers (Banking Insolvency Ordinance, BIO-FINMA)"]
[null,null,null,null,null,null,null,null,null,null,null,null,null,null,null,null,null,null,null,null,null,null,null,null,"KEG","e","732.1","Kernenergiegesetz","955.000.000.000","955.0","Federal Act of 10 October 1997 on Combating Money Laundering and Terrorist Financing in the Financial Sector (Anti-Money Laundering Act, AMLA)"]
[null,null,null,null,null,null,null,null,null,null,null,null,null,null,null,null,null,null,null,null,null,null,null,null,"KEV","e","732.11","Kernenergieverordnung","956.100.000.000","956.1","Federal Act of 22 June 2007 on the Swiss Financial Market Supervisory Authority (Financial Market Supervision Act, FINMASA)"]
[null,null,null,null,null,null,null,null,null,null,null,null,null,null,null,null,null,null,null,null,null,null,null,null,"KFG","r","442.1","Kulturförderungsgesetz","957.100.000.000","957.1","Federal Act of 3 October 2008 on Intermediated Securities (Federal Intermediated Securities Act, FISA)"]
[null,null,null,null,null,null,null,null,null,null,null,null,null,null,null,null,null,null,null,null,null,null,null,null,"KFV","r","442.11","Kulturförderungverordnung","958.100.000.000","958.1","Federal Act of 19 June 2015 on Financial Market Infrastructures and Market Conduct in Securities and Derivatives Trading (Financial Market Infrastructure Act, FMIA)"]
[null,null,null,null,null,null,null,null,null,null,null,null,null,null,null,null,null,null,null,null,null,null,null,null,"KG","e",251,"Kartellgesetz","958.110.000.000","958.11","Ordinance of 25 November 2015 on Financial Market Infrastructures and Market Conduct in Securities and Derivatives Trading (Financial Market Infrastructure Ordinance, FMIO)"]
[null,null,null,null,null,null,null,null,null,null,null,null,null,null,null,null,null,null,null,null,null,null,null,null,"KKG",{"$f":"IF(LEFT(AA310,2)=\"0.\",\"\",IF(AND(TEXT(AA310,\"000.000.000\")=LOOKUP(TEXT(AA310,\"000.000.000\"),_SRZitatE),TEXT(AA310,\"000.000.000\")=LOOKUP(TEXT(AA310,\"000.000.000\"),_SRZitatR)),\"e / r\",IF(TEXT(AA310,\"000.000.000\")=LOOKUP(TEXT(AA310,\"000.000.000\"),_SRZitatE),\"e\",IF(TEXT(AA310,\"000.000.000\")=LOOKUP(TEXT(AA310,\"000.000.000\"),_SRZitatR),\"r\",\"\"))))","v":""},"221.214.1","Konsumkreditgesetz","958.111.000.000","958.111","Ordinance of 3 December 2015 of the Swiss Financial Market Supervisory Authority on Financial Market Infrastructures and Market Conduct in Securities and Derivatives Trading (FINMA Financial Market Infrastructure Ordinance, FMIO-FINMA)"]
[null,null,null,null,null,null,null,null,null,null,null,null,null,null,null,null,null,null,null,null,null,null,null,null,"KlinV","e","810.305","klinische Versuche, VO über"]
[null,null,null,null,null,null,null,null,null,null,null,null,null,null,null,null,null,null,null,null,null,null,null,null,"KMG","e","514.51","Kriegsmaterialgesetz"]
[null,null,null,null,null,null,null,null,null,null,null,null,null,null,null,null,null,null,null,null,null,null,null,null,"KMV","e","514.511","Kriegsmaterialverordnung"]
[null,null,null,null,null,null,null,null,null,null,null,null,null,null,null,null,null,null,null,null,null,null,null,null,"KOV",{"$f":"IF(LEFT(AA314,2)=\"0.\",\"\",IF(AND(TEXT(AA314,\"000.000.000\")=LOOKUP(TEXT(AA314,\"000.000.000\"),_SRZitatE),TEXT(AA314,\"000.000.000\")=LOOKUP(TEXT(AA314,\"000.000.000\"),_SRZitatR)),\"e / r\",IF(TEXT(AA314,\"000.000.000\")=LOOKUP(TEXT(AA314,\"000.000.000\"),_SRZitatE),\"e\",IF(TEXT(AA314,\"000.000.000\")=LOOKUP(TEXT(AA314,\"000.000.000\"),_SRZitatR),\"r\",\"\"))))","v":""},281.32,"Geschäftsführung der Konkursämter, VO Bundesgericht über die "]
[null,null,null,null,null,null,null,null,null,null,null,null,null,null,null,null,null,null,null,null,null,null,null,null,"KV GR","r","131.226","Kantonsverfassung Graubünden"]
[null,null,null,null,null,null,null,null,null,null,null,null,null,null,null,null,null,null,null,null,null,null,null,null,"KV ZH",{"$f":"IF(LEFT(AA316,2)=\"0.\",\"\",IF(AND(TEXT(AA316,\"000.000.000\")=LOOKUP(TEXT(AA316,\"000.000.000\"),_SRZitatE),TEXT(AA316,\"000.000.000\")=LOOKUP(TEXT(AA316,\"000.000.000\"),_SRZitatR)),\"e / r\",IF(TEXT(AA316,\"000.000.000\")=LOOKUP(TEXT(AA316,\"000.000.000\"),_SRZitatE),\"e\",IF(TEXT(AA316,\"000.000.000\")=LOOKUP(TEXT(AA316,\"000.000.000\"),_SRZitatR),\"r\",\"\"))))","v":""},131.21100000000001,"Kantonsverfassung Zürich"]
[null,null,null,null,null,null,null,null,null,null,null,null,null,null,null,null,null,null,null,null,null,null,null,null,"KVG",{"$f":"IF(LEFT(AA317,2)=\"0.\",\"\",IF(AND(TEXT(AA317,\"000.000.000\")=LOOKUP(TEXT(AA317,\"000.000.000\"),_SRZitatE),TEXT(AA317,\"000.000.000\")=LOOKUP(TEXT(AA317,\"000.000.000\"),_SRZitatR)),\"e / r\",IF(TEXT(AA317,\"000.000.000\")=LOOKUP(TEXT(AA317,\"000.000.000\"),_SRZitatE),\"e\",IF(TEXT(AA317,\"000.000.000\")=LOOKUP(TEXT(AA317,\"000.000.000\"),_SRZitatR),\"r\",\"\"))))","v":""},"832.10","Krankenversicherungsgesetz"]
[null,null,null,null,null,null,null,null,null,null,null,null,null,null,null,null,null,null,null,null,null,null,null,null,"KVV",{"$f":"IF(LEFT(AA318,2)=\"0.\",\"\",IF(AND(TEXT(AA318,\"000.000.000\")=LOOKUP(TEXT(AA318,\"000.000.000\"),_SRZitatE),TEXT(AA318,\"000.000.000\")=LOOKUP(TEXT(AA318,\"000.000.000\"),_SRZitatR)),\"e / r\",IF(TEXT(AA318,\"000.000.000\")=LOOKUP(TEXT(AA318,\"000.000.000\"),_SRZitatE),\"e\",IF(TEXT(AA318,\"000.000.000\")=LOOKUP(TEXT(AA318,\"000.000.000\"),_SRZitatR),\"r\",\"\"))))","v":""},832.10199999999998,"Krankenversicherungsverordnung"]
[null,null,null,null,null,null,null,null,null,null,null,null,null,null,null,null,null,null,null,null,null,null,null,null,"LFG",null,"748.0","Luftfahrtgesetz"]
[null,null,null,null,null,null,null,null,null,null,null,null,null,null,null,null,null,null,null,null,null,null,null,null,"LFV",null,"748.01","Luftfahrtverordung"]
[null,null,null,null,null,null,null,null,null,null,null,null,null,null,null,null,null,null,null,null,null,null,null,null,"LG",{"$f":"IF(LEFT(AA321,2)=\"0.\",\"\",IF(AND(TEXT(AA321,\"000.000.000\")=LOOKUP(TEXT(AA321,\"000.000.000\"),_SRZitatE),TEXT(AA321,\"000.000.000\")=LOOKUP(TEXT(AA321,\"000.000.000\"),_SRZitatR)),\"e / r\",IF(TEXT(AA321,\"000.000.000\")=LOOKUP(TEXT(AA321,\"000.000.000\"),_SRZitatE),\"e\",IF(TEXT(AA321,\"000.000.000\")=LOOKUP(TEXT(AA321,\"000.000.000\"),_SRZitatR),\"r\",\"\"))))","v":""},"935.51","Lotteriegesetz"]
[null,null,null,null,null,null,null,null,null,null,null,null,null,null,null,null,null,null,null,null,null,null,null,null,"LGV",{"$f":"IF(LEFT(AA322,2)=\"0.\",\"\",IF(AND(TEXT(AA322,\"000.000.000\")=LOOKUP(TEXT(AA322,\"000.000.000\"),_SRZitatE),TEXT(AA322,\"000.000.000\")=LOOKUP(TEXT(AA322,\"000.000.000\"),_SRZitatR)),\"e / r\",IF(TEXT(AA322,\"000.000.000\")=LOOKUP(TEXT(AA322,\"000.000.000\"),_SRZitatE),\"e\",IF(TEXT(AA322,\"000.000.000\")=LOOKUP(TEXT(AA322,\"000.000.000\"),_SRZitatR),\"r\",\"\"))))","v":""},"817.02","Lebensmittel- und Gebrauchsgegenständeverordnung"]
[null,null,null,null,null,null,null,null,null,null,null,null,null,null,null,null,null,null,null,null,null,null,null,null,"LMG","e","817.0","Lebensmittelgesetz"]
[null,null,null,null,null,null,null,null,null,null,null,null,null,null,null,null,null,null,null,null,null,null,null,null,"LRV","e","814.318.142.1","Luftreinhalte-Verordnung"]
[null,null,null,null,null,null,null,null,null,null,null,null,null,null,null,null,null,null,null,null,null,null,null,null,"LSV","e","814.41","Lärmschutz-Verordnung"]
[null,null,null,null,null,null,null,null,null,null,null,null,null,null,null,null,null,null,null,null,null,null,null,null,"LugÜ",{"$f":"IF(LEFT(AA326,2)=\"0.\",\"\",IF(AND(TEXT(AA326,\"000.000.000\")=LOOKUP(TEXT(AA326,\"000.000.000\"),_SRZitatE),TEXT(AA326,\"000.000.000\")=LOOKUP(TEXT(AA326,\"000.000.000\"),_SRZitatR)),\"e / r\",IF(TEXT(AA326,\"000.000.000\")=LOOKUP(TEXT(AA326,\"000.000.000\"),_SRZitatE),\"e\",IF(TEXT(AA326,\"000.000.000\")=LOOKUP(TEXT(AA326,\"000.000.000\"),_SRZitatR),\"r\",\"\"))))","v":""},"0.275.12","Lugano-Übereinkommen 2007"]
[null,null,null,null,null,null,null,null,null,null,null,null,null,null,null,null,null,null,null,null,null,null,null,null,"LV",{"$f":"IF(LEFT(AA327,2)=\"0.\",\"\",IF(AND(TEXT(AA327,\"000.000.000\")=LOOKUP(TEXT(AA327,\"000.000.000\"),_SRZitatE),TEXT(AA327,\"000.000.000\")=LOOKUP(TEXT(AA327,\"000.000.000\"),_SRZitatR)),\"e / r\",IF(TEXT(AA327,\"000.000.000\")=LOOKUP(TEXT(AA327,\"000.000.000\"),_SRZitatE),\"e\",IF(TEXT(AA327,\"000.000.000\")=LOOKUP(TEXT(AA327,\"000.000.000\"),_SRZitatR),\"r\",\"\"))))","v":""},"935.511","Lotterieverordnung"]
[null,null,null,null,null,null,null,null,null,null,null,null,null,null,null,null,null,null,null,null,null,null,null,null,"LVG","e","531","Landesversorungsgesetz"]
[null,null,null,null,null,null,null,null,null,null,null,null,null,null,null,null,null,null,null,null,null,null,null,null,"LwG","r","910.1","Landwirtschaftsgesetz"]
[null,null,null,null,null,null,null,null,null,null,null,null,null,null,null,null,null,null,null,null,null,null,null,null,"MaLV",null,"814.412.2","Maschinenlärmverordnung"]
[null,null,null,null,null,null,null,null,null,null,null,null,null,null,null,null,null,null,null,null,null,null,null,null,"MedBG",{"$f":"IF(LEFT(AA331,2)=\"0.\",\"\",IF(AND(TEXT(AA331,\"000.000.000\")=LOOKUP(TEXT(AA331,\"000.000.000\"),_SRZitatE),TEXT(AA331,\"000.000.000\")=LOOKUP(TEXT(AA331,\"000.000.000\"),_SRZitatR)),\"e / r\",IF(TEXT(AA331,\"000.000.000\")=LOOKUP(TEXT(AA331,\"000.000.000\"),_SRZitatE),\"e\",IF(TEXT(AA331,\"000.000.000\")=LOOKUP(TEXT(AA331,\"000.000.000\"),_SRZitatR),\"r\",\"\"))))","v":""},"811.11","Medizinalberufegesetz"]
[null,null,null,null,null,null,null,null,null,null,null,null,null,null,null,null,null,null,null,null,null,null,null,null,"MedBV",{"$f":"IF(LEFT(AA332,2)=\"0.\",\"\",IF(AND(TEXT(AA332,\"000.000.000\")=LOOKUP(TEXT(AA332,\"000.000.000\"),_SRZitatE),TEXT(AA332,\"000.000.000\")=LOOKUP(TEXT(AA332,\"000.000.000\"),_SRZitatR)),\"e / r\",IF(TEXT(AA332,\"000.000.000\")=LOOKUP(TEXT(AA332,\"000.000.000\"),_SRZitatE),\"e\",IF(TEXT(AA332,\"000.000.000\")=LOOKUP(TEXT(AA332,\"000.000.000\"),_SRZitatR),\"r\",\"\"))))","v":""},"811.112.0","Medizinalberufeverordnung"]
[null,null,null,null,null,null,null,null,null,null,null,null,null,null,null,null,null,null,null,null,null,null,null,null,"MepV","e","812.213","Medizinprodukteverordnung"]
[null,null,null,null,null,null,null,null,null,null,null,null,null,null,null,null,null,null,null,null,null,null,null,null,"MitwG",{"$f":"IF(LEFT(AA334,2)=\"0.\",\"\",IF(AND(TEXT(AA334,\"000.000.000\")=LOOKUP(TEXT(AA334,\"000.000.000\"),_SRZitatE),TEXT(AA334,\"000.000.000\")=LOOKUP(TEXT(AA334,\"000.000.000\"),_SRZitatR)),\"e / r\",IF(TEXT(AA334,\"000.000.000\")=LOOKUP(TEXT(AA334,\"000.000.000\"),_SRZitatE),\"e\",IF(TEXT(AA334,\"000.000.000\")=LOOKUP(TEXT(AA334,\"000.000.000\"),_SRZitatR),\"r\",\"\"))))","v":""},822.14,"Mitwirkungsgesetz"]
[{"$f":"\"Hinweis: Die Zeilen \"&ROW(CopyBGE)&\" - \"&ROW(CopyLSZHNummerOffice)&\" enthalten Formeln zum Kopieren der Hyperlinks + Namensfelder und dürfen nicht gelöscht werden!\"","v":"Hinweis: Die Zeilen 336 - 357 enthalten Formeln zum Kopieren der Hyperlinks + Namensfelder und dürfen nicht gelöscht werden!"},null,null,null,null,null,null,null,null,null,null,null,null,null,null,null,null,null,null,null,null,null,null,null,"MSchG","e","232.11","Markenschutzgesetz"]
["BGE",null,{"$f":"RBGE","v":""},null,null,null,null,null,null,null,null,null,null,null,null,"BGE",null,{"$f":"RBGEName","v":""},null,null,null,null,null,null,"MSchV",{"$f":"IF(LEFT(AA336,2)=\"0.\",\"\",IF(AND(TEXT(AA336,\"000.000.000\")=LOOKUP(TEXT(AA336,\"000.000.000\"),_SRZitatE),TEXT(AA336,\"000.000.000\")=LOOKUP(TEXT(AA336,\"000.000.000\"),_SRZitatR)),\"e / r\",IF(TEXT(AA336,\"000.000.000\")=LOOKUP(TEXT(AA336,\"000.000.000\"),_SRZitatE),\"e\",IF(TEXT(AA336,\"000.000.000\")=LOOKUP(TEXT(AA336,\"000.000.000\"),_SRZitatR),\"r\",\"\"))))","v":""},"232.111","Markenschutzverordnung"]
["BGEWL",null,{"$f":"RBGEWL","v":""},null,null,null,null,null,null,null,null,null,null,null,null,null,null,null,null,null,null,null,null,null,"MStG","","321.0","Militärstrafgesetz"]
["BGEExp HTML",null,{"$f":"RBGEExpHTML","v":""},null,null,null,null,null,null,null,null,null,null,null,null,null,null,null,null,null,null,null,null,null,"MStP","","322.1","Militärstrafprozess"]
["BGEExp PDF",null,{"$f":"RBGEExpPDF","v":""},null,null,null,null,null,null,null,null,null,null,null,null,null,null,null,null,null,null,null,null,null,"MStV","","322.2","Militärstrafrechtspflege, VO über die "]
["BGer HTML",null,{"$f":"RBGer","v":""},null,null,null,null,null,null,null,null,null,null,null,null,"BGer",null,{"$f":"RBGerName","v":""},null,null,null,null,null,null,"MVG","","833.1","Militärversicherungsgesetz"]
["BGer PDF",null,{"$f":"RBGerPDF","v":""},null,null,null,null,null,null,null,null,null,null,null,null,null,null,null,null,null,null,null,null,null,"MVV","","833.11","Militärversicherungsverordnung"]
["BGerWL",null,{"$f":"RBGerWL","v":""},null,null,null,null,null,null,null,null,null,null,null,null,null,null,null,null,null,null,null,null,null,"MWSTG","e","641.20","Mehrwertsteuergesetz"]
["BVGE HTML",null,{"$f":"RBVGEHTML","v":""},null,null,null,null,null,null,null,null,null,null,null,null,"BVGE",null,{"$f":"RBVGEName","v":""},null,null,null,null,null,null,"MWSTV","e","641.201","Mehrwertsteuerverordnung"]
["BVGEWL",null,{"$f":"RBVGEWL","v":""},null,null,null,null,null,null,null,null,null,null,null,null,null,null,null,null,null,null,null,null,null,"NagV","e","451.61","Nagoya-Verordnung"]
["BVGE PDF",null,{"$f":"RBVGEPDF","v":""},null,null,null,null,null,null,null,null,null,null,null,null,null,null,null,null,null,null,null,null,null,"NAV AÄrzte",{"$f":"IF(LEFT(AA345,2)=\"0.\",\"\",IF(AND(TEXT(AA345,\"000.000.000\")=LOOKUP(TEXT(AA345,\"000.000.000\"),_SRZitatE),TEXT(AA345,\"000.000.000\")=LOOKUP(TEXT(AA345,\"000.000.000\"),_SRZitatR)),\"e / r\",IF(TEXT(AA345,\"000.000.000\")=LOOKUP(TEXT(AA345,\"000.000.000\"),_SRZitatE),\"e\",IF(TEXT(AA345,\"000.000.000\")=LOOKUP(TEXT(AA345,\"000.000.000\"),_SRZitatR),\"r\",\"\"))))","v":""},"221.215.328.1","NAV für Assistenzärzte"]
["BVGer HTML",null,{"$f":"RBVGerHTML","v":""},null,null,null,null,null,null,null,null,null,null,null,null,"BVGer",null,{"$f":"RBVGerName","v":""},null,null,null,null,null,null,"NAV Erzieher","","221.215.324.1","NAV für die Erzieher in Heimen und Internaten"]
["BVGer PDF",null,{"$f":"RBVGerPDF","v":""},null,null,null,null,null,null,null,null,null,null,null,null,null,null,null,null,null,null,null,null,null,"NAV Hausw","","221.215.329.4","NAV Hauswirtschaft"]
["BVGerWL",null,{"$f":"RBVGerWL","v":""},null,null,null,null,null,null,null,null,null,null,null,null,null,null,null,null,null,null,null,null,null,"NAV Milchw","","221.215.329.2","NAV für milchwirtschaftliche Arbeitnehmer"]
["SR HTML",null,{"$f":"RSRHTML","v":""},null,null,null,null,null,null,null,null,null,null,null,null,"SRName",null,{"$f":"RSRName","v":""},null,null,null,null,null,null,"NAV Pflege","","221.215.328.4","NAV für das Pflegepersonal"]
["SR PDF",null,{"$f":"RSRPDF","v":""},null,null,null,null,null,null,null,null,null,null,null,null,"SRNummer",null,{"$f":"RSRNummer","v":""},null,null,null,null,null,null,"NAV Privatgärtner","","221.215.329.3","NAV für Privatgärtner"]
["SRWL",null,{"$f":"RSRWL","v":""},null,null,null,null,null,null,null,null,null,null,null,null,null,null,null,null,null,null,null,null,null,"NAV Strahlensch","","221.215.328.6","NAV über Versicherungsleistungen für das beruflich strahlenexponierte Personal"]
["AS",null,{"$f":"RASPDF","v":""},null,null,null,null,null,null,null,null,null,null,null,null,"AS",null,{"$f":"RASName","v":""},null,null,null,null,null,null,"NBG","e","951.11","Nationalbankgesetz"]
["ASWL",null,{"$f":"RASWL","v":""},null,null,null,null,null,null,null,null,null,null,null,null,null,null,null,null,null,null,null,null,null,"NBV","e","951.121","Nationalbankverordnung"]
["BBl",null,{"$f":"RBBlPDF","v":""},null,null,null,null,null,null,null,null,null,null,null,null,"BBl",null,{"$f":"RBBlName","v":""},null,null,null,null,null,null,"NEHR","e","641.712.2","nationales Emissionshandelsregister, UVEK-VO über das"]
["BBlWL",null,{"$f":"RBBlWL","v":""},null,null,null,null,null,null,null,null,null,null,null,null,null,null,null,null,null,null,null,null,null,"NHG","e / r","451","Natur- und Heimatschutzgesetz"]
["LSZH",null,{"$f":"RLSZH","v":""},null,null,null,null,null,null,null,null,null,null,null,null,"LSZHName",null,{"$f":"RLSZHName","v":""},null,null,null,null,null,null,"NHV","e / r","451.1","Natur- und Heimatschutzverordnung"]
[null,null,null,null,null,null,null,null,null,null,null,null,null,null,null,"LSZHNummer",null,{"$f":"RLSZHNummer","v":""},null,null,null,null,null,null,"NPG","e","454","Nationalparkgesetz"]
[null,null,null,null,null,null,null,null,null,null,null,null,null,null,null,null,null,null,null,null,null,null,null,null,"OBG",{"$f":"IF(LEFT(AA358,2)=\"0.\",\"\",IF(AND(TEXT(AA358,\"000.000.000\")=LOOKUP(TEXT(AA358,\"000.000.000\"),_SRZitatE),TEXT(AA358,\"000.000.000\")=LOOKUP(TEXT(AA358,\"000.000.000\"),_SRZitatR)),\"e / r\",IF(TEXT(AA358,\"000.000.000\")=LOOKUP(TEXT(AA358,\"000.000.000\"),_SRZitatE),\"e\",IF(TEXT(AA358,\"000.000.000\")=LOOKUP(TEXT(AA358,\"000.000.000\"),_SRZitatR),\"r\",\"\"))))","v":""},"741.03","Ordnungsbussengesetz"]
[null,null,null,null,null,null,null,null,null,null,null,null,null,null,null,null,null,null,null,null,null,null,null,null,"OBV",{"$f":"IF(LEFT(AA359,2)=\"0.\",\"\",IF(AND(TEXT(AA359,\"000.000.000\")=LOOKUP(TEXT(AA359,\"000.000.000\"),_SRZitatE),TEXT(AA359,\"000.000.000\")=LOOKUP(TEXT(AA359,\"000.000.000\"),_SRZitatR)),\"e / r\",IF(TEXT(AA359,\"000.000.000\")=LOOKUP(TEXT(AA359,\"000.000.000\"),_SRZitatE),\"e\",IF(TEXT(AA359,\"000.000.000\")=LOOKUP(TEXT(AA359,\"000.000.000\"),_SRZitatR),\"r\",\"\"))))","v":""},"741.031","Ordnungsbussenverordnung"]
[null,null,null,null,null,null,null,null,null,null,null,null,null,null,null,null,null,null,null,null,null,null,null,null,"OF-HFG","e","810.308","Organisationsverordnung Humanforschungsgesetz"]
[null,null,null,null,null,null,null,null,null,null,null,null,null,null,null,null,null,null,null,null,null,null,null,null,"OHG",{"$f":"IF(LEFT(AA361,2)=\"0.\",\"\",IF(AND(TEXT(AA361,\"000.000.000\")=LOOKUP(TEXT(AA361,\"000.000.000\"),_SRZitatE),TEXT(AA361,\"000.000.000\")=LOOKUP(TEXT(AA361,\"000.000.000\"),_SRZitatR)),\"e / r\",IF(TEXT(AA361,\"000.000.000\")=LOOKUP(TEXT(AA361,\"000.000.000\"),_SRZitatE),\"e\",IF(TEXT(AA361,\"000.000.000\")=LOOKUP(TEXT(AA361,\"000.000.000\"),_SRZitatR),\"r\",\"\"))))","v":""},312.5,"Opferhilfegesetz"]
[null,null,null,null,null,null,null,null,null,null,null,null,null,null,null,null,null,null,null,null,null,null,null,null,"OHV",{"$f":"IF(LEFT(AA362,2)=\"0.\",\"\",IF(AND(TEXT(AA362,\"000.000.000\")=LOOKUP(TEXT(AA362,\"000.000.000\"),_SRZitatE),TEXT(AA362,\"000.000.000\")=LOOKUP(TEXT(AA362,\"000.000.000\"),_SRZitatR)),\"e / r\",IF(TEXT(AA362,\"000.000.000\")=LOOKUP(TEXT(AA362,\"000.000.000\"),_SRZitatE),\"e\",IF(TEXT(AA362,\"000.000.000\")=LOOKUP(TEXT(AA362,\"000.000.000\"),_SRZitatR),\"r\",\"\"))))","v":""},312.51,"Opferhilfeverordnung"]
[null,null,null,null,null,null,null,null,null,null,null,null,null,null,null,null,null,null,null,null,null,null,null,null,"OR","e / r",220,"Obligationenrecht"]
[null,null,null,null,null,null,null,null,null,null,null,null,null,null,null,null,null,null,null,null,null,null,null,null,"OsthilfeG","r","974.1","Zusammenarbeit mit den Staaten Osteuropas, BG über die"]
[null,null,null,null,null,null,null,null,null,null,null,null,null,null,null,null,null,null,null,null,null,null,null,null,"OV-EDI",{"$f":"IF(LEFT(AA365,2)=\"0.\",\"\",IF(AND(TEXT(AA365,\"000.000.000\")=LOOKUP(TEXT(AA365,\"000.000.000\"),_SRZitatE),TEXT(AA365,\"000.000.000\")=LOOKUP(TEXT(AA365,\"000.000.000\"),_SRZitatR)),\"e / r\",IF(TEXT(AA365,\"000.000.000\")=LOOKUP(TEXT(AA365,\"000.000.000\"),_SRZitatE),\"e\",IF(TEXT(AA365,\"000.000.000\")=LOOKUP(TEXT(AA365,\"000.000.000\"),_SRZitatR),\"r\",\"\"))))","v":""},"172.212.1","Organisationsverordnung für das Eidgenössische Departement des Innern "]
[null,null,null,null,null,null,null,null,null,null,null,null,null,null,null,null,null,null,null,null,null,null,null,null,"PAG","e","935.62","Patentsanwaltsgesetz"]
[null,null,null,null,null,null,null,null,null,null,null,null,null,null,null,null,null,null,null,null,null,null,null,null,"PaRG",null,"831.31","Schutz vor Passivrauchen, BG zum"]
[null,null,null,null,null,null,null,null,null,null,null,null,null,null,null,null,null,null,null,null,null,null,null,null,"ParlG","e / r","171.10","Parlamentsgesetz"]
[null,null,null,null,null,null,null,null,null,null,null,null,null,null,null,null,null,null,null,null,null,null,null,null,"PartG",{"$f":"IF(LEFT(AA369,2)=\"0.\",\"\",IF(AND(TEXT(AA369,\"000.000.000\")=LOOKUP(TEXT(AA369,\"000.000.000\"),_SRZitatE),TEXT(AA369,\"000.000.000\")=LOOKUP(TEXT(AA369,\"000.000.000\"),_SRZitatR)),\"e / r\",IF(TEXT(AA369,\"000.000.000\")=LOOKUP(TEXT(AA369,\"000.000.000\"),_SRZitatE),\"e\",IF(TEXT(AA369,\"000.000.000\")=LOOKUP(TEXT(AA369,\"000.000.000\"),_SRZitatR),\"r\",\"\"))))","v":""},"211.231","Partnerschaftsgesetz"]
[null,null,null,null,null,null,null,null,null,null,null,null,null,null,null,null,null,null,null,null,null,null,null,null,"PaRV",{"$f":"IF(LEFT(AA370,2)=\"0.\",\"\",IF(AND(TEXT(AA370,\"000.000.000\")=LOOKUP(TEXT(AA370,\"000.000.000\"),_SRZitatE),TEXT(AA370,\"000.000.000\")=LOOKUP(TEXT(AA370,\"000.000.000\"),_SRZitatR)),\"e / r\",IF(TEXT(AA370,\"000.000.000\")=LOOKUP(TEXT(AA370,\"000.000.000\"),_SRZitatE),\"e\",IF(TEXT(AA370,\"000.000.000\")=LOOKUP(TEXT(AA370,\"000.000.000\"),_SRZitatR),\"r\",\"\"))))","v":""},"818.311","Passivrauchschutzverordnung"]
[null,null,null,null,null,null,null,null,null,null,null,null,null,null,null,null,null,null,null,null,null,null,null,null,"PatG","e","232.14","Patentgesetz"]
[null,null,null,null,null,null,null,null,null,null,null,null,null,null,null,null,null,null,null,null,null,null,null,null,"PatGG","e","173.41","Patentgerichtsgesetz"]
[null,null,null,null,null,null,null,null,null,null,null,null,null,null,null,null,null,null,null,null,null,null,null,null,"PatV",{"$f":"IF(LEFT(AA373,2)=\"0.\",\"\",IF(AND(TEXT(AA373,\"000.000.000\")=LOOKUP(TEXT(AA373,\"000.000.000\"),_SRZitatE),TEXT(AA373,\"000.000.000\")=LOOKUP(TEXT(AA373,\"000.000.000\"),_SRZitatR)),\"e / r\",IF(TEXT(AA373,\"000.000.000\")=LOOKUP(TEXT(AA373,\"000.000.000\"),_SRZitatE),\"e\",IF(TEXT(AA373,\"000.000.000\")=LOOKUP(TEXT(AA373,\"000.000.000\"),_SRZitatR),\"r\",\"\"))))","v":""},"232.141","Patentverordnung"]
[null,null,null,null,null,null,null,null,null,null,null,null,null,null,null,null,null,null,null,null,null,null,null,null,"PauRG",{"$f":"IF(LEFT(AA374,2)=\"0.\",\"\",IF(AND(TEXT(AA374,\"000.000.000\")=LOOKUP(TEXT(AA374,\"000.000.000\"),_SRZitatE),TEXT(AA374,\"000.000.000\")=LOOKUP(TEXT(AA374,\"000.000.000\"),_SRZitatR)),\"e / r\",IF(TEXT(AA374,\"000.000.000\")=LOOKUP(TEXT(AA374,\"000.000.000\"),_SRZitatE),\"e\",IF(TEXT(AA374,\"000.000.000\")=LOOKUP(TEXT(AA374,\"000.000.000\"),_SRZitatR),\"r\",\"\"))))","v":""},"944.3","Pauschalreisen, BG über die"]
[null,null,null,null,null,null,null,null,null,null,null,null,null,null,null,null,null,null,null,null,null,null,null,null,"PAV","e","935.621","Patentanwaltsverordnung"]
[null,null,null,null,null,null,null,null,null,null,null,null,null,null,null,null,null,null,null,null,null,null,null,null,"PäV","e","451.36","Pärkeverordnung"]
[null,null,null,null,null,null,null,null,null,null,null,null,null,null,null,null,null,null,null,null,null,null,null,null,"PAVO",{"$f":"IF(LEFT(AA377,2)=\"0.\",\"\",IF(AND(TEXT(AA377,\"000.000.000\")=LOOKUP(TEXT(AA377,\"000.000.000\"),_SRZitatE),TEXT(AA377,\"000.000.000\")=LOOKUP(TEXT(AA377,\"000.000.000\"),_SRZitatR)),\"e / r\",IF(TEXT(AA377,\"000.000.000\")=LOOKUP(TEXT(AA377,\"000.000.000\"),_SRZitatE),\"e\",IF(TEXT(AA377,\"000.000.000\")=LOOKUP(TEXT(AA377,\"000.000.000\"),_SRZitatR),\"r\",\"\"))))","v":""},"211.222.338","Aufnahme von Kindern zur Pflege und zur Adoption, VO über die"]
[null,null,null,null,null,null,null,null,null,null,null,null,null,null,null,null,null,null,null,null,null,null,null,null,"PBG",{"$f":"IF(LEFT(AA378,2)=\"0.\",\"\",IF(AND(TEXT(AA378,\"000.000.000\")=LOOKUP(TEXT(AA378,\"000.000.000\"),_SRZitatE),TEXT(AA378,\"000.000.000\")=LOOKUP(TEXT(AA378,\"000.000.000\"),_SRZitatR)),\"e / r\",IF(TEXT(AA378,\"000.000.000\")=LOOKUP(TEXT(AA378,\"000.000.000\"),_SRZitatE),\"e\",IF(TEXT(AA378,\"000.000.000\")=LOOKUP(TEXT(AA378,\"000.000.000\"),_SRZitatR),\"r\",\"\"))))","v":""},"745.1","Personenbeförderungsgesetz"]
[null,null,null,null,null,null,null,null,null,null,null,null,null,null,null,null,null,null,null,null,null,null,null,null,"PBV",{"$f":"IF(LEFT(AA379,2)=\"0.\",\"\",IF(AND(TEXT(AA379,\"000.000.000\")=LOOKUP(TEXT(AA379,\"000.000.000\"),_SRZitatE),TEXT(AA379,\"000.000.000\")=LOOKUP(TEXT(AA379,\"000.000.000\"),_SRZitatR)),\"e / r\",IF(TEXT(AA379,\"000.000.000\")=LOOKUP(TEXT(AA379,\"000.000.000\"),_SRZitatE),\"e\",IF(TEXT(AA379,\"000.000.000\")=LOOKUP(TEXT(AA379,\"000.000.000\"),_SRZitatR),\"r\",\"\"))))","v":""},"942.211","Preisbekanntgabeverordnung"]
[null,null,null,null,null,null,null,null,null,null,null,null,null,null,null,null,null,null,null,null,null,null,null,null,"PHV","e","192.126","privaten Hausangestellte, VO über die"]
[null,null,null,null,null,null,null,null,null,null,null,null,null,null,null,null,null,null,null,null,null,null,null,null,"POG","e / r","783.1","Postorganisationsgesetz,"]
[null,null,null,null,null,null,null,null,null,null,null,null,null,null,null,null,null,null,null,null,null,null,null,null,"PRG",{"$f":"IF(LEFT(AA382,2)=\"0.\",\"\",IF(AND(TEXT(AA382,\"000.000.000\")=LOOKUP(TEXT(AA382,\"000.000.000\"),_SRZitatE),TEXT(AA382,\"000.000.000\")=LOOKUP(TEXT(AA382,\"000.000.000\"),_SRZitatR)),\"e / r\",IF(TEXT(AA382,\"000.000.000\")=LOOKUP(TEXT(AA382,\"000.000.000\"),_SRZitatE),\"e\",IF(TEXT(AA382,\"000.000.000\")=LOOKUP(TEXT(AA382,\"000.000.000\"),_SRZitatR),\"r\",\"\"))))","v":""},"171.21","Parlamentsressourcengesetz"]
[null,null,null,null,null,null,null,null,null,null,null,null,null,null,null,null,null,null,null,null,null,null,null,null,"PrHG",{"$f":"IF(LEFT(AA383,2)=\"0.\",\"\",IF(AND(TEXT(AA383,\"000.000.000\")=LOOKUP(TEXT(AA383,\"000.000.000\"),_SRZitatE),TEXT(AA383,\"000.000.000\")=LOOKUP(TEXT(AA383,\"000.000.000\"),_SRZitatR)),\"e / r\",IF(TEXT(AA383,\"000.000.000\")=LOOKUP(TEXT(AA383,\"000.000.000\"),_SRZitatE),\"e\",IF(TEXT(AA383,\"000.000.000\")=LOOKUP(TEXT(AA383,\"000.000.000\"),_SRZitatR),\"r\",\"\"))))","v":""},"221.112.944","Produktehaftpflichtgesetz"]
[null,null,null,null,null,null,null,null,null,null,null,null,null,null,null,null,null,null,null,null,null,null,null,null,"PRTR.-V","e","814.017","Register Schadstoff-/Abfall-Freisetzung und -transfer"]
[null,null,null,null,null,null,null,null,null,null,null,null,null,null,null,null,null,null,null,null,null,null,null,null,"PublG","e","170.512","Publikationsgesetz"]
[null,null,null,null,null,null,null,null,null,null,null,null,null,null,null,null,null,null,null,null,null,null,null,null,"PublicaG","e","172.222.1","Pensionskasse des Bundes, G über die"]
[null,null,null,null,null,null,null,null,null,null,null,null,null,null,null,null,null,null,null,null,null,null,null,null,"PublV","e","170.512.1","Publikationsverordnung"]
[null,null,null,null,null,null,null,null,null,null,null,null,null,null,null,null,null,null,null,null,null,null,null,null,"PüG",{"$f":"IF(LEFT(AA388,2)=\"0.\",\"\",IF(AND(TEXT(AA388,\"000.000.000\")=LOOKUP(TEXT(AA388,\"000.000.000\"),_SRZitatE),TEXT(AA388,\"000.000.000\")=LOOKUP(TEXT(AA388,\"000.000.000\"),_SRZitatR)),\"e / r\",IF(TEXT(AA388,\"000.000.000\")=LOOKUP(TEXT(AA388,\"000.000.000\"),_SRZitatE),\"e\",IF(TEXT(AA388,\"000.000.000\")=LOOKUP(TEXT(AA388,\"000.000.000\"),_SRZitatR),\"r\",\"\"))))","v":""},"942.20","Preisüberwachungsgesetz"]
[null,null,null,null,null,null,null,null,null,null,null,null,null,null,null,null,null,null,null,null,null,null,null,null,"RA SNM","r","0.441.1","Schutz nationaler Minderheiten, Rahmenabkommen"]
[null,null,null,null,null,null,null,null,null,null,null,null,null,null,null,null,null,null,null,null,null,null,null,null,"RAG",{"$f":"IF(LEFT(AA390,2)=\"0.\",\"\",IF(AND(TEXT(AA390,\"000.000.000\")=LOOKUP(TEXT(AA390,\"000.000.000\"),_SRZitatE),TEXT(AA390,\"000.000.000\")=LOOKUP(TEXT(AA390,\"000.000.000\"),_SRZitatR)),\"e / r\",IF(TEXT(AA390,\"000.000.000\")=LOOKUP(TEXT(AA390,\"000.000.000\"),_SRZitatE),\"e\",IF(TEXT(AA390,\"000.000.000\")=LOOKUP(TEXT(AA390,\"000.000.000\"),_SRZitatR),\"r\",\"\"))))","v":""},"221.302","Revisionsaufsichtsgesetz"]
[null,null,null,null,null,null,null,null,null,null,null,null,null,null,null,null,null,null,null,null,null,null,null,null,"RDV",{"$f":"IF(LEFT(AA391,2)=\"0.\",\"\",IF(AND(TEXT(AA391,\"000.000.000\")=LOOKUP(TEXT(AA391,\"000.000.000\"),_SRZitatE),TEXT(AA391,\"000.000.000\")=LOOKUP(TEXT(AA391,\"000.000.000\"),_SRZitatR)),\"e / r\",IF(TEXT(AA391,\"000.000.000\")=LOOKUP(TEXT(AA391,\"000.000.000\"),_SRZitatE),\"e\",IF(TEXT(AA391,\"000.000.000\")=LOOKUP(TEXT(AA391,\"000.000.000\"),_SRZitatR),\"r\",\"\"))))","v":""},"143.5","Ausstellung von Reisedokumenten für ausländische Personen, VO über die"]
[null,null,null,null,null,null,null,null,null,null,null,null,null,null,null,null,null,null,null,null,null,null,null,null,"ReRBGer",{"$f":"IF(LEFT(AA392,2)=\"0.\",\"\",IF(AND(TEXT(AA392,\"000.000.000\")=LOOKUP(TEXT(AA392,\"000.000.000\"),_SRZitatE),TEXT(AA392,\"000.000.000\")=LOOKUP(TEXT(AA392,\"000.000.000\"),_SRZitatR)),\"e / r\",IF(TEXT(AA392,\"000.000.000\")=LOOKUP(TEXT(AA392,\"000.000.000\"),_SRZitatE),\"e\",IF(TEXT(AA392,\"000.000.000\")=LOOKUP(TEXT(AA392,\"000.000.000\"),_SRZitatR),\"r\",\"\"))))","v":""},"173.110.29","Reglement Bundesgericht elektronischer Rechtsverkehr"]
[null,null,null,null,null,null,null,null,null,null,null,null,null,null,null,null,null,null,null,null,null,null,null,null,"RHB","e","431.02","Registerharmonisierungsgesetz"]
[null,null,null,null,null,null,null,null,null,null,null,null,null,null,null,null,null,null,null,null,null,null,null,null,"RPG","r","700","Raumplanungsgesetz"]
[null,null,null,null,null,null,null,null,null,null,null,null,null,null,null,null,null,null,null,null,null,null,null,null,"RPV","r","700.1","Raumplanungsverordnung"]
[null,null,null,null,null,null,null,null,null,null,null,null,null,null,null,null,null,null,null,null,null,null,null,null,"RTVG","e / r","784.40","Radio und Fernsehen, BG über"]
[null,null,null,null,null,null,null,null,null,null,null,null,null,null,null,null,null,null,null,null,null,null,null,null,"RTVV","e","784.401","Radio- und Fernsehverordnung"]
[null,null,null,null,null,null,null,null,null,null,null,null,null,null,null,null,null,null,null,null,null,null,null,null,"RUVG","e","196.1","Rückerstattung unrechtmässig erworbener Vermögenswerte politisch exponierter Personen, BG"]
[null,null,null,null,null,null,null,null,null,null,null,null,null,null,null,null,null,null,null,null,null,null,null,null,"RV BPG",null,"172.220.11","Rahmenverordnung BPG"]
[null,null,null,null,null,null,null,null,null,null,null,null,null,null,null,null,null,null,null,null,null,null,null,null,"RVOG","e / r","172.010","Regierungs- und Verwaltungsorganisationsgesetz"]
[null,null,null,null,null,null,null,null,null,null,null,null,null,null,null,null,null,null,null,null,null,null,null,null,"RVOV",{"$f":"IF(LEFT(AA401,2)=\"0.\",\"\",IF(AND(TEXT(AA401,\"000.000.000\")=LOOKUP(TEXT(AA401,\"000.000.000\"),_SRZitatE),TEXT(AA401,\"000.000.000\")=LOOKUP(TEXT(AA401,\"000.000.000\"),_SRZitatR)),\"e / r\",IF(TEXT(AA401,\"000.000.000\")=LOOKUP(TEXT(AA401,\"000.000.000\"),_SRZitatE),\"e\",IF(TEXT(AA401,\"000.000.000\")=LOOKUP(TEXT(AA401,\"000.000.000\"),_SRZitatR),\"r\",\"\"))))","v":""},"172.010.1","Regierungs- und Verwaltungsorganisationsverordnung"]
[null,null,null,null,null,null,null,null,null,null,null,null,null,null,null,null,null,null,null,null,null,null,null,null,"SBG",{"$f":"IF(LEFT(AA402,2)=\"0.\",\"\",IF(AND(TEXT(AA402,\"000.000.000\")=LOOKUP(TEXT(AA402,\"000.000.000\"),_SRZitatE),TEXT(AA402,\"000.000.000\")=LOOKUP(TEXT(AA402,\"000.000.000\"),_SRZitatR)),\"e / r\",IF(TEXT(AA402,\"000.000.000\")=LOOKUP(TEXT(AA402,\"000.000.000\"),_SRZitatE),\"e\",IF(TEXT(AA402,\"000.000.000\")=LOOKUP(TEXT(AA402,\"000.000.000\"),_SRZitatR),\"r\",\"\"))))","v":""},"935.52","Spielbankengesetz"]
[null,null,null,null,null,null,null,null,null,null,null,null,null,null,null,null,null,null,null,null,null,null,null,null,"SBV",null,"747.201.7","Schiffsbauverordnung"]
[null,null,null,null,null,null,null,null,null,null,null,null,null,null,null,null,null,null,null,null,null,null,null,null,"SGG",{"$f":"IF(LEFT(AA404,2)=\"0.\",\"\",IF(AND(TEXT(AA404,\"000.000.000\")=LOOKUP(TEXT(AA404,\"000.000.000\"),_SRZitatE),TEXT(AA404,\"000.000.000\")=LOOKUP(TEXT(AA404,\"000.000.000\"),_SRZitatR)),\"e / r\",IF(TEXT(AA404,\"000.000.000\")=LOOKUP(TEXT(AA404,\"000.000.000\"),_SRZitatE),\"e\",IF(TEXT(AA404,\"000.000.000\")=LOOKUP(TEXT(AA404,\"000.000.000\"),_SRZitatR),\"r\",\"\"))))","v":""},173.71,"Strafgerichtsgesetz"]
[null,null,null,null,null,null,null,null,null,null,null,null,null,null,null,null,null,null,null,null,null,null,null,null,"SchKG","e / r","281.1","Schuldbetreibungs- und Konkursgesetz"]
[null,null,null,null,null,null,null,null,null,null,null,null,null,null,null,null,null,null,null,null,null,null,null,null,"SLV","e","814.49","Schall- und Laserverordnung"]
[null,null,null,null,null,null,null,null,null,null,null,null,null,null,null,null,null,null,null,null,null,null,null,null,"SpDV","e / r","172.081","Sprachediensteverordnung"]
[null,null,null,null,null,null,null,null,null,null,null,null,null,null,null,null,null,null,null,null,null,null,null,null,"SpG","e / r","441.1","Sprachengesetz"]
[null,null,null,null,null,null,null,null,null,null,null,null,null,null,null,null,null,null,null,null,null,null,null,null,"SpV","e / r","441.11","Sprachenverordnung"]
[null,null,null,null,null,null,null,null,null,null,null,null,null,null,null,null,null,null,null,null,null,null,null,null,"StAG","e","721.101","Stauanlagengesetz"]
[null,null,null,null,null,null,null,null,null,null,null,null,null,null,null,null,null,null,null,null,null,null,null,null,"StAhiG","e","651.1","Steueramtshilfegesetz"]
[null,null,null,null,null,null,null,null,null,null,null,null,null,null,null,null,null,null,null,null,null,null,null,null,"StAV","e","721.101.1","Stauanlagenverordnung"]
[null,null,null,null,null,null,null,null,null,null,null,null,null,null,null,null,null,null,null,null,null,null,null,null,"SterG",{"$f":"IF(LEFT(AA413,2)=\"0.\",\"\",IF(AND(TEXT(AA413,\"000.000.000\")=LOOKUP(TEXT(AA413,\"000.000.000\"),_SRZitatE),TEXT(AA413,\"000.000.000\")=LOOKUP(TEXT(AA413,\"000.000.000\"),_SRZitatR)),\"e / r\",IF(TEXT(AA413,\"000.000.000\")=LOOKUP(TEXT(AA413,\"000.000.000\"),_SRZitatE),\"e\",IF(TEXT(AA413,\"000.000.000\")=LOOKUP(TEXT(AA413,\"000.000.000\"),_SRZitatR),\"r\",\"\"))))","v":""},"211.111.1","Sterilisationsgesetz"]
[null,null,null,null,null,null,null,null,null,null,null,null,null,null,null,null,null,null,null,null,null,null,null,null,"StFG","e / r","810.31","Stammzellenforschungsgesetz"]
[null,null,null,null,null,null,null,null,null,null,null,null,null,null,null,null,null,null,null,null,null,null,null,null,"StFV","e","814.012","Störfallverordnung"]
[null,null,null,null,null,null,null,null,null,null,null,null,null,null,null,null,null,null,null,null,null,null,null,null,"StGB","e / r","311.0","Strafgesetzbuch"]
[null,null,null,null,null,null,null,null,null,null,null,null,null,null,null,null,null,null,null,null,null,null,null,null,"StPO","e / r","312.0","Strafprozessordnung"]
[null,null,null,null,null,null,null,null,null,null,null,null,null,null,null,null,null,null,null,null,null,null,null,null,"StSG","e","814.50","Strahlenschutzgesetz"]
[null,null,null,null,null,null,null,null,null,null,null,null,null,null,null,null,null,null,null,null,null,null,null,null,"StSV","e","814.501","Strahlenschutzverordnung"]
[null,null,null,null,null,null,null,null,null,null,null,null,null,null,null,null,null,null,null,null,null,null,null,null,"STUG",{"$f":"IF(LEFT(AA420,2)=\"0.\",\"\",IF(AND(TEXT(AA420,\"000.000.000\")=LOOKUP(TEXT(AA420,\"000.000.000\"),_SRZitatE),TEXT(AA420,\"000.000.000\")=LOOKUP(TEXT(AA420,\"000.000.000\"),_SRZitatR)),\"e / r\",IF(TEXT(AA420,\"000.000.000\")=LOOKUP(TEXT(AA420,\"000.000.000\"),_SRZitatE),\"e\",IF(TEXT(AA420,\"000.000.000\")=LOOKUP(TEXT(AA420,\"000.000.000\"),_SRZitatR),\"r\",\"\"))))","v":""},"744.10","Zulassung als Strassentransportunternehmen, BG über die"]
[null,null,null,null,null,null,null,null,null,null,null,null,null,null,null,null,null,null,null,null,null,null,null,null,"SuG",{"$f":"IF(LEFT(AA421,2)=\"0.\",\"\",IF(AND(TEXT(AA421,\"000.000.000\")=LOOKUP(TEXT(AA421,\"000.000.000\"),_SRZitatE),TEXT(AA421,\"000.000.000\")=LOOKUP(TEXT(AA421,\"000.000.000\"),_SRZitatR)),\"e / r\",IF(TEXT(AA421,\"000.000.000\")=LOOKUP(TEXT(AA421,\"000.000.000\"),_SRZitatE),\"e\",IF(TEXT(AA421,\"000.000.000\")=LOOKUP(TEXT(AA421,\"000.000.000\"),_SRZitatR),\"r\",\"\"))))","v":""},"616.1","Subventionsgesetz"]
[null,null,null,null,null,null,null,null,null,null,null,null,null,null,null,null,null,null,null,null,null,null,null,null,"SVG","r","741.01","Strassenverkehrsgesetz"]
[null,null,null,null,null,null,null,null,null,null,null,null,null,null,null,null,null,null,null,null,null,null,null,null,"SVKG","e","251.5","Sanktionen bei unzulässigen Wettbewerbsbeschränkungen, VO über"]
[null,null,null,null,null,null,null,null,null,null,null,null,null,null,null,null,null,null,null,null,null,null,null,null,"SVV",{"$f":"IF(LEFT(AA424,2)=\"0.\",\"\",IF(AND(TEXT(AA424,\"000.000.000\")=LOOKUP(TEXT(AA424,\"000.000.000\"),_SRZitatE),TEXT(AA424,\"000.000.000\")=LOOKUP(TEXT(AA424,\"000.000.000\"),_SRZitatR)),\"e / r\",IF(TEXT(AA424,\"000.000.000\")=LOOKUP(TEXT(AA424,\"000.000.000\"),_SRZitatE),\"e\",IF(TEXT(AA424,\"000.000.000\")=LOOKUP(TEXT(AA424,\"000.000.000\"),_SRZitatR),\"r\",\"\"))))","v":""},"741.21","Signalisationsverordnung"]
[null,null,null,null,null,null,null,null,null,null,null,null,null,null,null,null,null,null,null,null,null,null,null,null,"tkd-VO","e","641.714.11","Erhebung von Tonnenkilometerdaten aus Flugstrecken und die Berichterstattung darüber, VO über die"]
[null,null,null,null,null,null,null,null,null,null,null,null,null,null,null,null,null,null,null,null,null,null,null,null,"ToG",{"$f":"IF(LEFT(AA426,2)=\"0.\",\"\",IF(AND(TEXT(AA426,\"000.000.000\")=LOOKUP(TEXT(AA426,\"000.000.000\"),_SRZitatE),TEXT(AA426,\"000.000.000\")=LOOKUP(TEXT(AA426,\"000.000.000\"),_SRZitatR)),\"e / r\",IF(TEXT(AA426,\"000.000.000\")=LOOKUP(TEXT(AA426,\"000.000.000\"),_SRZitatE),\"e\",IF(TEXT(AA426,\"000.000.000\")=LOOKUP(TEXT(AA426,\"000.000.000\"),_SRZitatR),\"r\",\"\"))))","v":""},"231.2","Topographiengesetz"]
[null,null,null,null,null,null,null,null,null,null,null,null,null,null,null,null,null,null,null,null,null,null,null,null,"TpG","e","810.21","Transplantationsgesetz"]
[null,null,null,null,null,null,null,null,null,null,null,null,null,null,null,null,null,null,null,null,null,null,null,null,"TrÖbiV",null,"641.611.21","Treibstoffökobilanz-Verordnung"]
[null,null,null,null,null,null,null,null,null,null,null,null,null,null,null,null,null,null,null,null,null,null,null,null,"TschG","r","455","Tierschutzgesetz"]
[null,null,null,null,null,null,null,null,null,null,null,null,null,null,null,null,null,null,null,null,null,null,null,null,"TVAV","e","211.432.21","amtliche Vermessung, technische Verordnung des VBS über die "]
[null,null,null,null,null,null,null,null,null,null,null,null,null,null,null,null,null,null,null,null,null,null,null,null,"TWV","e","817.064"," kombinierte Warnhinweise auf Tabakprodukten, EDI-VO über"]
[null,null,null,null,null,null,null,null,null,null,null,null,null,null,null,null,null,null,null,null,null,null,null,null,"UEV",{"$f":"IF(LEFT(AA432,2)=\"0.\",\"\",IF(AND(TEXT(AA432,\"000.000.000\")=LOOKUP(TEXT(AA432,\"000.000.000\"),_SRZitatE),TEXT(AA432,\"000.000.000\")=LOOKUP(TEXT(AA432,\"000.000.000\"),_SRZitatR)),\"e / r\",IF(TEXT(AA432,\"000.000.000\")=LOOKUP(TEXT(AA432,\"000.000.000\"),_SRZitatE),\"e\",IF(TEXT(AA432,\"000.000.000\")=LOOKUP(TEXT(AA432,\"000.000.000\"),_SRZitatR),\"r\",\"\"))))","v":""},"954.195.1","Übernahmeverordnung"]
[null,null,null,null,null,null,null,null,null,null,null,null,null,null,null,null,null,null,null,null,null,null,null,null,"UN-KRK","r","0.107","Übereinkommen über die Rechte des Kindes"]
[null,null,null,null,null,null,null,null,null,null,null,null,null,null,null,null,null,null,null,null,null,null,null,null,"Uno-Pakt I",{"$f":"IF(LEFT(AA434,2)=\"0.\",\"\",IF(AND(TEXT(AA434,\"000.000.000\")=LOOKUP(TEXT(AA434,\"000.000.000\"),_SRZitatE),TEXT(AA434,\"000.000.000\")=LOOKUP(TEXT(AA434,\"000.000.000\"),_SRZitatR)),\"e / r\",IF(TEXT(AA434,\"000.000.000\")=LOOKUP(TEXT(AA434,\"000.000.000\"),_SRZitatE),\"e\",IF(TEXT(AA434,\"000.000.000\")=LOOKUP(TEXT(AA434,\"000.000.000\"),_SRZitatR),\"r\",\"\"))))","v":""},"0.103.1","Internationaler Pakt über wirtschaftliche, soziale und kulturelle Rechte"]
[null,null,null,null,null,null,null,null,null,null,null,null,null,null,null,null,null,null,null,null,null,null,null,null,"Uno-Pakt II",{"$f":"IF(LEFT(AA435,2)=\"0.\",\"\",IF(AND(TEXT(AA435,\"000.000.000\")=LOOKUP(TEXT(AA435,\"000.000.000\"),_SRZitatE),TEXT(AA435,\"000.000.000\")=LOOKUP(TEXT(AA435,\"000.000.000\"),_SRZitatR)),\"e / r\",IF(TEXT(AA435,\"000.000.000\")=LOOKUP(TEXT(AA435,\"000.000.000\"),_SRZitatE),\"e\",IF(TEXT(AA435,\"000.000.000\")=LOOKUP(TEXT(AA435,\"000.000.000\"),_SRZitatR),\"r\",\"\"))))","v":""},"0.103.2","Internationaler Pakt über bürgerliche und politische Rechte"]
[null,null,null,null,null,null,null,null,null,null,null,null,null,null,null,null,null,null,null,null,null,null,null,null,"URG","e",231.1,"Urheberrechtsgesetz"]
[null,null,null,null,null,null,null,null,null,null,null,null,null,null,null,null,null,null,null,null,null,null,null,null,"URV",{"$f":"IF(LEFT(AA437,2)=\"0.\",\"\",IF(AND(TEXT(AA437,\"000.000.000\")=LOOKUP(TEXT(AA437,\"000.000.000\"),_SRZitatE),TEXT(AA437,\"000.000.000\")=LOOKUP(TEXT(AA437,\"000.000.000\"),_SRZitatR)),\"e / r\",IF(TEXT(AA437,\"000.000.000\")=LOOKUP(TEXT(AA437,\"000.000.000\"),_SRZitatE),\"e\",IF(TEXT(AA437,\"000.000.000\")=LOOKUP(TEXT(AA437,\"000.000.000\"),_SRZitatR),\"r\",\"\"))))","v":""},231.11,"Urheberrechtsverordnung"]
[null,null,null,null,null,null,null,null,null,null,null,null,null,null,null,null,null,null,null,null,null,null,null,null,"USG","e",814.01,"Umweltschutzgesetz"]
[null,null,null,null,null,null,null,null,null,null,null,null,null,null,null,null,null,null,null,null,null,null,null,null,"UVG",{"$f":"IF(LEFT(AA439,2)=\"0.\",\"\",IF(AND(TEXT(AA439,\"000.000.000\")=LOOKUP(TEXT(AA439,\"000.000.000\"),_SRZitatE),TEXT(AA439,\"000.000.000\")=LOOKUP(TEXT(AA439,\"000.000.000\"),_SRZitatR)),\"e / r\",IF(TEXT(AA439,\"000.000.000\")=LOOKUP(TEXT(AA439,\"000.000.000\"),_SRZitatE),\"e\",IF(TEXT(AA439,\"000.000.000\")=LOOKUP(TEXT(AA439,\"000.000.000\"),_SRZitatR),\"r\",\"\"))))","v":""},"832.20","Unfallversicherungsgesetz"]
[null,null,null,null,null,null,null,null,null,null,null,null,null,null,null,null,null,null,null,null,null,null,null,null,"UVV",{"$f":"IF(LEFT(AA440,2)=\"0.\",\"\",IF(AND(TEXT(AA440,\"000.000.000\")=LOOKUP(TEXT(AA440,\"000.000.000\"),_SRZitatE),TEXT(AA440,\"000.000.000\")=LOOKUP(TEXT(AA440,\"000.000.000\"),_SRZitatR)),\"e / r\",IF(TEXT(AA440,\"000.000.000\")=LOOKUP(TEXT(AA440,\"000.000.000\"),_SRZitatE),\"e\",IF(TEXT(AA440,\"000.000.000\")=LOOKUP(TEXT(AA440,\"000.000.000\"),_SRZitatR),\"r\",\"\"))))","v":""},832.202,"Unfallversicherungsverordnung"]
[null,null,null,null,null,null,null,null,null,null,null,null,null,null,null,null,null,null,null,null,null,null,null,null,"UWG",{"$f":"IF(LEFT(AA441,2)=\"0.\",\"\",IF(AND(TEXT(AA441,\"000.000.000\")=LOOKUP(TEXT(AA441,\"000.000.000\"),_SRZitatE),TEXT(AA441,\"000.000.000\")=LOOKUP(TEXT(AA441,\"000.000.000\"),_SRZitatR)),\"e / r\",IF(TEXT(AA441,\"000.000.000\")=LOOKUP(TEXT(AA441,\"000.000.000\"),_SRZitatE),\"e\",IF(TEXT(AA441,\"000.000.000\")=LOOKUP(TEXT(AA441,\"000.000.000\"),_SRZitatR),\"r\",\"\"))))","v":""},241,"unlauteren Wettbewerb, BG gegen den "]
[null,null,null,null,null,null,null,null,null,null,null,null,null,null,null,null,null,null,null,null,null,null,null,null,"VAG",{"$f":"IF(LEFT(AA442,2)=\"0.\",\"\",IF(AND(TEXT(AA442,\"000.000.000\")=LOOKUP(TEXT(AA442,\"000.000.000\"),_SRZitatE),TEXT(AA442,\"000.000.000\")=LOOKUP(TEXT(AA442,\"000.000.000\"),_SRZitatR)),\"e / r\",IF(TEXT(AA442,\"000.000.000\")=LOOKUP(TEXT(AA442,\"000.000.000\"),_SRZitatE),\"e\",IF(TEXT(AA442,\"000.000.000\")=LOOKUP(TEXT(AA442,\"000.000.000\"),_SRZitatR),\"r\",\"\"))))","v":""},"961.01","Versicherungsaufsichtsgesetz"]
[null,null,null,null,null,null,null,null,null,null,null,null,null,null,null,null,null,null,null,null,null,null,null,null,"VASA","e","814.681","Abgabe zur Sanierung von Altlasten, VO über die"]
[null,null,null,null,null,null,null,null,null,null,null,null,null,null,null,null,null,null,null,null,null,null,null,null,"V-ASG","e","195.11","Auslandschweizerverordnung"]
[null,null,null,null,null,null,null,null,null,null,null,null,null,null,null,null,null,null,null,null,null,null,null,null,"VAV","e","211.432.2","amtliche Vermessung, VO über die"]
[null,null,null,null,null,null,null,null,null,null,null,null,null,null,null,null,null,null,null,null,null,null,null,null,"VBGA","e","152.11","Archivierungsverordnung"]
[null,null,null,null,null,null,null,null,null,null,null,null,null,null,null,null,null,null,null,null,null,null,null,null,"VBGF","r","923.01","Fischerei, VO zum BG über die"]
[null,null,null,null,null,null,null,null,null,null,null,null,null,null,null,null,null,null,null,null,null,null,null,null,"VBO",{"$f":"IF(LEFT(AA448,2)=\"0.\",\"\",IF(AND(TEXT(AA448,\"000.000.000\")=LOOKUP(TEXT(AA448,\"000.000.000\"),_SRZitatE),TEXT(AA448,\"000.000.000\")=LOOKUP(TEXT(AA448,\"000.000.000\"),_SRZitatR)),\"e / r\",IF(TEXT(AA448,\"000.000.000\")=LOOKUP(TEXT(AA448,\"000.000.000\"),_SRZitatE),\"e\",IF(TEXT(AA448,\"000.000.000\")=LOOKUP(TEXT(AA448,\"000.000.000\"),_SRZitatR),\"r\",\"\"))))","v":""},"814.076","Bezeichnung im US + NHS beschwerdeberechtigte Organisationen, VO über"]
[null,null,null,null,null,null,null,null,null,null,null,null,null,null,null,null,null,null,null,null,null,null,null,null,"VBP","e","813.12","Biozidprodukteverordnung"]
[null,null,null,null,null,null,null,null,null,null,null,null,null,null,null,null,null,null,null,null,null,null,null,null,"VBPV",null,"172.220.111.310.1","Verordnung des EFD zur Bundespersonalverordnung"]
[null,null,null,null,null,null,null,null,null,null,null,null,null,null,null,null,null,null,null,null,null,null,null,null,"VDSG","e",235.11,"Datenschutzverordnung"]
[null,null,null,null,null,null,null,null,null,null,null,null,null,null,null,null,null,null,null,null,null,null,null,null,"VDSZ","e","235.13","Datenschutzzertifizierungen, VO über die"]
[null,null,null,null,null,null,null,null,null,null,null,null,null,null,null,null,null,null,null,null,null,null,null,null,"VegüV",null,"221.331","übermässige Vergütungen bei börsenkotierten Aktiengesellschaften, VO gegen "]
[null,null,null,null,null,null,null,null,null,null,null,null,null,null,null,null,null,null,null,null,null,null,null,null,"VELes","e","161.116","elektronische Stimmabgabe, Verordnung der BK über die "]
[null,null,null,null,null,null,null,null,null,null,null,null,null,null,null,null,null,null,null,null,null,null,null,null,"VEMV","e","734.5","elektromagnetische Verträglichkeit, VO über die"]
[null,null,null,null,null,null,null,null,null,null,null,null,null,null,null,null,null,null,null,null,null,null,null,null,"VEP",{"$f":"IF(LEFT(AA456,2)=\"0.\",\"\",IF(AND(TEXT(AA456,\"000.000.000\")=LOOKUP(TEXT(AA456,\"000.000.000\"),_SRZitatE),TEXT(AA456,\"000.000.000\")=LOOKUP(TEXT(AA456,\"000.000.000\"),_SRZitatR)),\"e / r\",IF(TEXT(AA456,\"000.000.000\")=LOOKUP(TEXT(AA456,\"000.000.000\"),_SRZitatE),\"e\",IF(TEXT(AA456,\"000.000.000\")=LOOKUP(TEXT(AA456,\"000.000.000\"),_SRZitatR),\"r\",\"\"))))","v":""},142.203,"Einführung des freien Personenverkehrs, VO über die"]
[null,null,null,null,null,null,null,null,null,null,null,null,null,null,null,null,null,null,null,null,null,null,null,null,"VES","e","124","den Einsatz privater Sicherheitsfirmen, VO über "]
[null,null,null,null,null,null,null,null,null,null,null,null,null,null,null,null,null,null,null,null,null,null,null,null,"VeÜ-VwV",{"$f":"IF(LEFT(AA458,2)=\"0.\",\"\",IF(AND(TEXT(AA458,\"000.000.000\")=LOOKUP(TEXT(AA458,\"000.000.000\"),_SRZitatE),TEXT(AA458,\"000.000.000\")=LOOKUP(TEXT(AA458,\"000.000.000\"),_SRZitatR)),\"e / r\",IF(TEXT(AA458,\"000.000.000\")=LOOKUP(TEXT(AA458,\"000.000.000\"),_SRZitatE),\"e\",IF(TEXT(AA458,\"000.000.000\")=LOOKUP(TEXT(AA458,\"000.000.000\"),_SRZitatR),\"r\",\"\"))))","v":""},"172.021.2","Übermittlungsverordnung Verwaltungsverfahren"]
[null,null,null,null,null,null,null,null,null,null,null,null,null,null,null,null,null,null,null,null,null,null,null,null,"VeÜ-ZSSV",{"$f":"IF(LEFT(AA459,2)=\"0.\",\"\",IF(AND(TEXT(AA459,\"000.000.000\")=LOOKUP(TEXT(AA459,\"000.000.000\"),_SRZitatE),TEXT(AA459,\"000.000.000\")=LOOKUP(TEXT(AA459,\"000.000.000\"),_SRZitatR)),\"e / r\",IF(TEXT(AA459,\"000.000.000\")=LOOKUP(TEXT(AA459,\"000.000.000\"),_SRZitatE),\"e\",IF(TEXT(AA459,\"000.000.000\")=LOOKUP(TEXT(AA459,\"000.000.000\"),_SRZitatR),\"r\",\"\"))))","v":""},"272.1","Übermittlungsverordnung Zivil-, Straf- + SchK-Verfahren"]
[null,null,null,null,null,null,null,null,null,null,null,null,null,null,null,null,null,null,null,null,null,null,null,null,"VEV",{"$f":"IF(LEFT(AA460,2)=\"0.\",\"\",IF(AND(TEXT(AA460,\"000.000.000\")=LOOKUP(TEXT(AA460,\"000.000.000\"),_SRZitatE),TEXT(AA460,\"000.000.000\")=LOOKUP(TEXT(AA460,\"000.000.000\"),_SRZitatR)),\"e / r\",IF(TEXT(AA460,\"000.000.000\")=LOOKUP(TEXT(AA460,\"000.000.000\"),_SRZitatE),\"e\",IF(TEXT(AA460,\"000.000.000\")=LOOKUP(TEXT(AA460,\"000.000.000\"),_SRZitatR),\"r\",\"\"))))","v":""},"142.204","Einreise- und Visumverfahren, VO über das"]
[null,null,null,null,null,null,null,null,null,null,null,null,null,null,null,null,null,null,null,null,null,null,null,null,"V-FIFG","r","420.11","Forschungs- und Innovationsförderungsverordnung"]
[null,null,null,null,null,null,null,null,null,null,null,null,null,null,null,null,null,null,null,null,null,null,null,null,"VG",{"$f":"IF(LEFT(AA462,2)=\"0.\",\"\",IF(AND(TEXT(AA462,\"000.000.000\")=LOOKUP(TEXT(AA462,\"000.000.000\"),_SRZitatE),TEXT(AA462,\"000.000.000\")=LOOKUP(TEXT(AA462,\"000.000.000\"),_SRZitatR)),\"e / r\",IF(TEXT(AA462,\"000.000.000\")=LOOKUP(TEXT(AA462,\"000.000.000\"),_SRZitatE),\"e\",IF(TEXT(AA462,\"000.000.000\")=LOOKUP(TEXT(AA462,\"000.000.000\"),_SRZitatR),\"r\",\"\"))))","v":""},170.32,"Verantwortlichkeitsgesetz"]
[null,null,null,null,null,null,null,null,null,null,null,null,null,null,null,null,null,null,null,null,null,null,null,null,"VGG",{"$f":"IF(LEFT(AA463,2)=\"0.\",\"\",IF(AND(TEXT(AA463,\"000.000.000\")=LOOKUP(TEXT(AA463,\"000.000.000\"),_SRZitatE),TEXT(AA463,\"000.000.000\")=LOOKUP(TEXT(AA463,\"000.000.000\"),_SRZitatR)),\"e / r\",IF(TEXT(AA463,\"000.000.000\")=LOOKUP(TEXT(AA463,\"000.000.000\"),_SRZitatE),\"e\",IF(TEXT(AA463,\"000.000.000\")=LOOKUP(TEXT(AA463,\"000.000.000\"),_SRZitatR),\"r\",\"\"))))","v":""},173.32,"Verwaltungsgerichtsgesetz"]
[null,null,null,null,null,null,null,null,null,null,null,null,null,null,null,null,null,null,null,null,null,null,null,null,"V-GSG","e","192.121","Gaststaatverordnung"]
[null,null,null,null,null,null,null,null,null,null,null,null,null,null,null,null,null,null,null,null,null,null,null,null,"VGV","e","814.621","Getränkeverpackungen, VO über die"]
[null,null,null,null,null,null,null,null,null,null,null,null,null,null,null,null,null,null,null,null,null,null,null,null,"VID","e","784.104.2","Internetdomains, VO über"]
[null,null,null,null,null,null,null,null,null,null,null,null,null,null,null,null,null,null,null,null,null,null,null,null,"VIntA",{"$f":"IF(LEFT(AA467,2)=\"0.\",\"\",IF(AND(TEXT(AA467,\"000.000.000\")=LOOKUP(TEXT(AA467,\"000.000.000\"),_SRZitatE),TEXT(AA467,\"000.000.000\")=LOOKUP(TEXT(AA467,\"000.000.000\"),_SRZitatR)),\"e / r\",IF(TEXT(AA467,\"000.000.000\")=LOOKUP(TEXT(AA467,\"000.000.000\"),_SRZitatE),\"e\",IF(TEXT(AA467,\"000.000.000\")=LOOKUP(TEXT(AA467,\"000.000.000\"),_SRZitatR),\"r\",\"\"))))","v":""},"142.205","Integration von Ausländerinnen und Ausländern, VO über die"]
[null,null,null,null,null,null,null,null,null,null,null,null,null,null,null,null,null,null,null,null,null,null,null,null,"VISV","e","142.512","Visa-Informationssystem-Verordnung"]
[null,null,null,null,null,null,null,null,null,null,null,null,null,null,null,null,null,null,null,null,null,null,null,null,"VKKG",{"$f":"IF(LEFT(AA469,2)=\"0.\",\"\",IF(AND(TEXT(AA469,\"000.000.000\")=LOOKUP(TEXT(AA469,\"000.000.000\"),_SRZitatE),TEXT(AA469,\"000.000.000\")=LOOKUP(TEXT(AA469,\"000.000.000\"),_SRZitatR)),\"e / r\",IF(TEXT(AA469,\"000.000.000\")=LOOKUP(TEXT(AA469,\"000.000.000\"),_SRZitatE),\"e\",IF(TEXT(AA469,\"000.000.000\")=LOOKUP(TEXT(AA469,\"000.000.000\"),_SRZitatR),\"r\",\"\"))))","v":""},"221.214.11","Konsumkreditgesetz, VO zum "]
[null,null,null,null,null,null,null,null,null,null,null,null,null,null,null,null,null,null,null,null,null,null,null,null,"VKU","e","251.4","Kontrolle von Unternehmenszusammenschlüssen, VO über die"]
[null,null,null,null,null,null,null,null,null,null,null,null,null,null,null,null,null,null,null,null,null,null,null,null,"VlG","e","172.061","Vernehmlassungsgesetz,"]
[null,null,null,null,null,null,null,null,null,null,null,null,null,null,null,null,null,null,null,null,null,null,null,null,"VLK","e","748.941","Luftfahrzeuge besonderer Kategorien, VO des UVEK über"]
[null,null,null,null,null,null,null,null,null,null,null,null,null,null,null,null,null,null,null,null,null,null,null,null,"VMWG",{"$f":"IF(LEFT(AA473,2)=\"0.\",\"\",IF(AND(TEXT(AA473,\"000.000.000\")=LOOKUP(TEXT(AA473,\"000.000.000\"),_SRZitatE),TEXT(AA473,\"000.000.000\")=LOOKUP(TEXT(AA473,\"000.000.000\"),_SRZitatR)),\"e / r\",IF(TEXT(AA473,\"000.000.000\")=LOOKUP(TEXT(AA473,\"000.000.000\"),_SRZitatE),\"e\",IF(TEXT(AA473,\"000.000.000\")=LOOKUP(TEXT(AA473,\"000.000.000\"),_SRZitatR),\"r\",\"\"))))","v":""},"221.213.11","Miete und Pacht von Wohn- und Geschäftsräumen, VO über die "]
[null,null,null,null,null,null,null,null,null,null,null,null,null,null,null,null,null,null,null,null,null,null,null,null,"VöB",{"$f":"IF(LEFT(AA474,2)=\"0.\",\"\",IF(AND(TEXT(AA474,\"000.000.000\")=LOOKUP(TEXT(AA474,\"000.000.000\"),_SRZitatE),TEXT(AA474,\"000.000.000\")=LOOKUP(TEXT(AA474,\"000.000.000\"),_SRZitatR)),\"e / r\",IF(TEXT(AA474,\"000.000.000\")=LOOKUP(TEXT(AA474,\"000.000.000\"),_SRZitatE),\"e\",IF(TEXT(AA474,\"000.000.000\")=LOOKUP(TEXT(AA474,\"000.000.000\"),_SRZitatR),\"r\",\"\"))))","v":""},"172.056.11","öffentliche Beschaffungswesen, VO über das"]
[null,null,null,null,null,null,null,null,null,null,null,null,null,null,null,null,null,null,null,null,null,null,null,null,"VOBGÖ","e / r","152.31","Öffentlichkeitsverordnung"]
[null,null,null,null,null,null,null,null,null,null,null,null,null,null,null,null,null,null,null,null,null,null,null,null,"VOCV","e","814.018","Lenkungsabgabe auf flüchtigen organischen Verbindungen, VO über die"]
[null,null,null,null,null,null,null,null,null,null,null,null,null,null,null,null,null,null,null,null,null,null,null,null,"VOSA",{"$f":"IF(LEFT(AA477,2)=\"0.\",\"\",IF(AND(TEXT(AA477,\"000.000.000\")=LOOKUP(TEXT(AA477,\"000.000.000\"),_SRZitatE),TEXT(AA477,\"000.000.000\")=LOOKUP(TEXT(AA477,\"000.000.000\"),_SRZitatR)),\"e / r\",IF(TEXT(AA477,\"000.000.000\")=LOOKUP(TEXT(AA477,\"000.000.000\"),_SRZitatE),\"e\",IF(TEXT(AA477,\"000.000.000\")=LOOKUP(TEXT(AA477,\"000.000.000\"),_SRZitatR),\"r\",\"\"))))","v":""},822.41099999999994,"Schwarzarbeit, VO gegen die"]
[null,null,null,null,null,null,null,null,null,null,null,null,null,null,null,null,null,null,null,null,null,null,null,null,"VPB",{"$f":"IF(LEFT(AA478,2)=\"0.\",\"\",IF(AND(TEXT(AA478,\"000.000.000\")=LOOKUP(TEXT(AA478,\"000.000.000\"),_SRZitatE),TEXT(AA478,\"000.000.000\")=LOOKUP(TEXT(AA478,\"000.000.000\"),_SRZitatR)),\"e / r\",IF(TEXT(AA478,\"000.000.000\")=LOOKUP(TEXT(AA478,\"000.000.000\"),_SRZitatE),\"e\",IF(TEXT(AA478,\"000.000.000\")=LOOKUP(TEXT(AA478,\"000.000.000\"),_SRZitatR),\"r\",\"\"))))","v":""},"745.11","Personenbeförderung, VO über die"]
[null,null,null,null,null,null,null,null,null,null,null,null,null,null,null,null,null,null,null,null,null,null,null,null,"VPR","r","161.11","politische Rechte, VO über die"]
[null,null,null,null,null,null,null,null,null,null,null,null,null,null,null,null,null,null,null,null,null,null,null,null,"VRV",{"$f":"IF(LEFT(AA480,2)=\"0.\",\"\",IF(AND(TEXT(AA480,\"000.000.000\")=LOOKUP(TEXT(AA480,\"000.000.000\"),_SRZitatE),TEXT(AA480,\"000.000.000\")=LOOKUP(TEXT(AA480,\"000.000.000\"),_SRZitatR)),\"e / r\",IF(TEXT(AA480,\"000.000.000\")=LOOKUP(TEXT(AA480,\"000.000.000\"),_SRZitatE),\"e\",IF(TEXT(AA480,\"000.000.000\")=LOOKUP(TEXT(AA480,\"000.000.000\"),_SRZitatR),\"r\",\"\"))))","v":""},"741.11","Verkehrsregelnverordnung"]
[null,null,null,null,null,null,null,null,null,null,null,null,null,null,null,null,null,null,null,null,null,null,null,null,"VSBG",{"$f":"IF(LEFT(AA481,2)=\"0.\",\"\",IF(AND(TEXT(AA481,\"000.000.000\")=LOOKUP(TEXT(AA481,\"000.000.000\"),_SRZitatE),TEXT(AA481,\"000.000.000\")=LOOKUP(TEXT(AA481,\"000.000.000\"),_SRZitatR)),\"e / r\",IF(TEXT(AA481,\"000.000.000\")=LOOKUP(TEXT(AA481,\"000.000.000\"),_SRZitatE),\"e\",IF(TEXT(AA481,\"000.000.000\")=LOOKUP(TEXT(AA481,\"000.000.000\"),_SRZitatR),\"r\",\"\"))))","v":""},"935.521","Spielbankenverordnung"]
[null,null,null,null,null,null,null,null,null,null,null,null,null,null,null,null,null,null,null,null,null,null,null,null,"VST","e","745.21","Sicherheitsorgane der Transportunternehmen im öffentlichen Verkehr, VO über die"]
[null,null,null,null,null,null,null,null,null,null,null,null,null,null,null,null,null,null,null,null,null,null,null,null,"VStFG","e","810.311","Stammzellenforschungsverordnung"]
[null,null,null,null,null,null,null,null,null,null,null,null,null,null,null,null,null,null,null,null,null,null,null,null,"VStG",{"$f":"IF(LEFT(AA484,2)=\"0.\",\"\",IF(AND(TEXT(AA484,\"000.000.000\")=LOOKUP(TEXT(AA484,\"000.000.000\"),_SRZitatE),TEXT(AA484,\"000.000.000\")=LOOKUP(TEXT(AA484,\"000.000.000\"),_SRZitatR)),\"e / r\",IF(TEXT(AA484,\"000.000.000\")=LOOKUP(TEXT(AA484,\"000.000.000\"),_SRZitatE),\"e\",IF(TEXT(AA484,\"000.000.000\")=LOOKUP(TEXT(AA484,\"000.000.000\"),_SRZitatR),\"r\",\"\"))))","v":""},"642.21","Verrechnungssteuergesetz"]
[null,null,null,null,null,null,null,null,null,null,null,null,null,null,null,null,null,null,null,null,null,null,null,null,"V-StGB-MStG",{"$f":"IF(LEFT(AA485,2)=\"0.\",\"\",IF(AND(TEXT(AA485,\"000.000.000\")=LOOKUP(TEXT(AA485,\"000.000.000\"),_SRZitatE),TEXT(AA485,\"000.000.000\")=LOOKUP(TEXT(AA485,\"000.000.000\"),_SRZitatR)),\"e / r\",IF(TEXT(AA485,\"000.000.000\")=LOOKUP(TEXT(AA485,\"000.000.000\"),_SRZitatE),\"e\",IF(TEXT(AA485,\"000.000.000\")=LOOKUP(TEXT(AA485,\"000.000.000\"),_SRZitatR),\"r\",\"\"))))","v":""},"311.01","Strafgesetzbuch und Militärstrafgesetz, VO zum "]
[null,null,null,null,null,null,null,null,null,null,null,null,null,null,null,null,null,null,null,null,null,null,null,null,"VStrR","r","313.0","Verwaltungsstrafrecht"]
[null,null,null,null,null,null,null,null,null,null,null,null,null,null,null,null,null,null,null,null,null,null,null,null,"VSZV","e","742.161","Sicherheitsuntersuchung von Zwischenfällen im Verkehrswesen, VO über die"]
[null,null,null,null,null,null,null,null,null,null,null,null,null,null,null,null,null,null,null,null,null,null,null,null,"VTS",null,"741.41","technischen Anforderungen an Strassenfahrzeuge, VO über die"]
[null,null,null,null,null,null,null,null,null,null,null,null,null,null,null,null,null,null,null,null,null,null,null,null,"VUB","e","946.31","Beglaubigung des nichtpräferenziellen Ursprungs von Waren, VO über die"]
[null,null,null,null,null,null,null,null,null,null,null,null,null,null,null,null,null,null,null,null,null,null,null,null,"VUB-EVD","e","946.311","Beglaubigung des nichtpräferenziellen Ursprungs von Waren, EVD-VO über die"]
[null,null,null,null,null,null,null,null,null,null,null,null,null,null,null,null,null,null,null,null,null,null,null,null,"VUV",{"$f":"IF(LEFT(AA491,2)=\"0.\",\"\",IF(AND(TEXT(AA491,\"000.000.000\")=LOOKUP(TEXT(AA491,\"000.000.000\"),_SRZitatE),TEXT(AA491,\"000.000.000\")=LOOKUP(TEXT(AA491,\"000.000.000\"),_SRZitatR)),\"e / r\",IF(TEXT(AA491,\"000.000.000\")=LOOKUP(TEXT(AA491,\"000.000.000\"),_SRZitatE),\"e\",IF(TEXT(AA491,\"000.000.000\")=LOOKUP(TEXT(AA491,\"000.000.000\"),_SRZitatR),\"r\",\"\"))))","v":""},"832.30","Unfallverhütung, Verordnung über die "]
[null,null,null,null,null,null,null,null,null,null,null,null,null,null,null,null,null,null,null,null,null,null,null,null,"VVAG",{"$f":"IF(LEFT(AA492,2)=\"0.\",\"\",IF(AND(TEXT(AA492,\"000.000.000\")=LOOKUP(TEXT(AA492,\"000.000.000\"),_SRZitatE),TEXT(AA492,\"000.000.000\")=LOOKUP(TEXT(AA492,\"000.000.000\"),_SRZitatR)),\"e / r\",IF(TEXT(AA492,\"000.000.000\")=LOOKUP(TEXT(AA492,\"000.000.000\"),_SRZitatE),\"e\",IF(TEXT(AA492,\"000.000.000\")=LOOKUP(TEXT(AA492,\"000.000.000\"),_SRZitatR),\"r\",\"\"))))","v":""},"281.41","Pfändung und Verwertung von Anteilen an Gemeinschaftsvermögen, VO Bundesgericht über die "]
[null,null,null,null,null,null,null,null,null,null,null,null,null,null,null,null,null,null,null,null,null,null,null,null,"VVG",{"$f":"IF(LEFT(AA493,2)=\"0.\",\"\",IF(AND(TEXT(AA493,\"000.000.000\")=LOOKUP(TEXT(AA493,\"000.000.000\"),_SRZitatE),TEXT(AA493,\"000.000.000\")=LOOKUP(TEXT(AA493,\"000.000.000\"),_SRZitatR)),\"e / r\",IF(TEXT(AA493,\"000.000.000\")=LOOKUP(TEXT(AA493,\"000.000.000\"),_SRZitatE),\"e\",IF(TEXT(AA493,\"000.000.000\")=LOOKUP(TEXT(AA493,\"000.000.000\"),_SRZitatR),\"r\",\"\"))))","v":""},"221.229.1","Versicherungsvertragsgesetz"]
[null,null,null,null,null,null,null,null,null,null,null,null,null,null,null,null,null,null,null,null,null,null,null,null,"VVV",{"$f":"IF(LEFT(AA494,2)=\"0.\",\"\",IF(AND(TEXT(AA494,\"000.000.000\")=LOOKUP(TEXT(AA494,\"000.000.000\"),_SRZitatE),TEXT(AA494,\"000.000.000\")=LOOKUP(TEXT(AA494,\"000.000.000\"),_SRZitatR)),\"e / r\",IF(TEXT(AA494,\"000.000.000\")=LOOKUP(TEXT(AA494,\"000.000.000\"),_SRZitatE),\"e\",IF(TEXT(AA494,\"000.000.000\")=LOOKUP(TEXT(AA494,\"000.000.000\"),_SRZitatR),\"r\",\"\"))))","v":""},"741.31","Verkehrsversicherungsverordnung"]
[null,null,null,null,null,null,null,null,null,null,null,null,null,null,null,null,null,null,null,null,null,null,null,null,"VVWA",{"$f":"IF(LEFT(AA495,2)=\"0.\",\"\",IF(AND(TEXT(AA495,\"000.000.000\")=LOOKUP(TEXT(AA495,\"000.000.000\"),_SRZitatE),TEXT(AA495,\"000.000.000\")=LOOKUP(TEXT(AA495,\"000.000.000\"),_SRZitatR)),\"e / r\",IF(TEXT(AA495,\"000.000.000\")=LOOKUP(TEXT(AA495,\"000.000.000\"),_SRZitatE),\"e\",IF(TEXT(AA495,\"000.000.000\")=LOOKUP(TEXT(AA495,\"000.000.000\"),_SRZitatR),\"r\",\"\"))))","v":""},"142.281","Vollzug der Weg- und Ausweisung von ausländischen Personen, VO über den"]
[null,null,null,null,null,null,null,null,null,null,null,null,null,null,null,null,null,null,null,null,null,null,null,null,"VwVG","e / r",172.02099999999999,"Verwaltungsverfahrensgesetz"]
[null,null,null,null,null,null,null,null,null,null,null,null,null,null,null,null,null,null,null,null,null,null,null,null,"VZAE",{"$f":"IF(LEFT(AA497,2)=\"0.\",\"\",IF(AND(TEXT(AA497,\"000.000.000\")=LOOKUP(TEXT(AA497,\"000.000.000\"),_SRZitatE),TEXT(AA497,\"000.000.000\")=LOOKUP(TEXT(AA497,\"000.000.000\"),_SRZitatR)),\"e / r\",IF(TEXT(AA497,\"000.000.000\")=LOOKUP(TEXT(AA497,\"000.000.000\"),_SRZitatE),\"e\",IF(TEXT(AA497,\"000.000.000\")=LOOKUP(TEXT(AA497,\"000.000.000\"),_SRZitatR),\"r\",\"\"))))","v":""},"142.201","Zulassung, Aufenthalt + Erwerbstätigkeit, VO über "]
[null,null,null,null,null,null,null,null,null,null,null,null,null,null,null,null,null,null,null,null,null,null,null,null,"VZäG","e","431.112","Volkszählungsgesetz"]
[null,null,null,null,null,null,null,null,null,null,null,null,null,null,null,null,null,null,null,null,null,null,null,null,"VZertES",{"$f":"IF(LEFT(AA499,2)=\"0.\",\"\",IF(AND(TEXT(AA499,\"000.000.000\")=LOOKUP(TEXT(AA499,\"000.000.000\"),_SRZitatE),TEXT(AA499,\"000.000.000\")=LOOKUP(TEXT(AA499,\"000.000.000\"),_SRZitatR)),\"e / r\",IF(TEXT(AA499,\"000.000.000\")=LOOKUP(TEXT(AA499,\"000.000.000\"),_SRZitatE),\"e\",IF(TEXT(AA499,\"000.000.000\")=LOOKUP(TEXT(AA499,\"000.000.000\"),_SRZitatR),\"r\",\"\"))))","v":""},"943.032","VO über die elektronische Signatur"]
[null,null,null,null,null,null,null,null,null,null,null,null,null,null,null,null,null,null,null,null,null,null,null,null,"VZG",{"$f":"IF(LEFT(AA500,2)=\"0.\",\"\",IF(AND(TEXT(AA500,\"000.000.000\")=LOOKUP(TEXT(AA500,\"000.000.000\"),_SRZitatE),TEXT(AA500,\"000.000.000\")=LOOKUP(TEXT(AA500,\"000.000.000\"),_SRZitatR)),\"e / r\",IF(TEXT(AA500,\"000.000.000\")=LOOKUP(TEXT(AA500,\"000.000.000\"),_SRZitatE),\"e\",IF(TEXT(AA500,\"000.000.000\")=LOOKUP(TEXT(AA500,\"000.000.000\"),_SRZitatR),\"r\",\"\"))))","v":""},"281.42","Zwangsverwertung von Grundstücken, VO Bundesgericht über die "]
[null,null,null,null,null,null,null,null,null,null,null,null,null,null,null,null,null,null,null,null,null,null,null,null,"VZV",{"$f":"IF(LEFT(AA501,2)=\"0.\",\"\",IF(AND(TEXT(AA501,\"000.000.000\")=LOOKUP(TEXT(AA501,\"000.000.000\"),_SRZitatE),TEXT(AA501,\"000.000.000\")=LOOKUP(TEXT(AA501,\"000.000.000\"),_SRZitatR)),\"e / r\",IF(TEXT(AA501,\"000.000.000\")=LOOKUP(TEXT(AA501,\"000.000.000\"),_SRZitatE),\"e\",IF(TEXT(AA501,\"000.000.000\")=LOOKUP(TEXT(AA501,\"000.000.000\"),_SRZitatR),\"r\",\"\"))))","v":""},"741.51","Verkehrszulassungsverordnung"]
[null,null,null,null,null,null,null,null,null,null,null,null,null,null,null,null,null,null,null,null,null,null,null,null,"WaG","e","921.0","Waldgesetz"]
[null,null,null,null,null,null,null,null,null,null,null,null,null,null,null,null,null,null,null,null,null,null,null,null,"WaV","e","921.01","Waldverordnung"]
[null,null,null,null,null,null,null,null,null,null,null,null,null,null,null,null,null,null,null,null,null,null,null,null,"WBG","r","721.100","Wasserbau, BG über den"]
[null,null,null,null,null,null,null,null,null,null,null,null,null,null,null,null,null,null,null,null,null,null,null,null,"WBV","r","721.100.1","Wasserbau, VO über den"]
[null,null,null,null,null,null,null,null,null,null,null,null,null,null,null,null,null,null,null,null,null,null,null,null,"WEG",{"$f":"IF(LEFT(AA506,2)=\"0.\",\"\",IF(AND(TEXT(AA506,\"000.000.000\")=LOOKUP(TEXT(AA506,\"000.000.000\"),_SRZitatE),TEXT(AA506,\"000.000.000\")=LOOKUP(TEXT(AA506,\"000.000.000\"),_SRZitatR)),\"e / r\",IF(TEXT(AA506,\"000.000.000\")=LOOKUP(TEXT(AA506,\"000.000.000\"),_SRZitatE),\"e\",IF(TEXT(AA506,\"000.000.000\")=LOOKUP(TEXT(AA506,\"000.000.000\"),_SRZitatR),\"r\",\"\"))))","v":""},"843","Wohnbau- und Eigentumsförderungsgesetz"]
[null,null,null,null,null,null,null,null,null,null,null,null,null,null,null,null,null,null,null,null,null,null,null,null,"WG",{"$f":"IF(LEFT(AA507,2)=\"0.\",\"\",IF(AND(TEXT(AA507,\"000.000.000\")=LOOKUP(TEXT(AA507,\"000.000.000\"),_SRZitatE),TEXT(AA507,\"000.000.000\")=LOOKUP(TEXT(AA507,\"000.000.000\"),_SRZitatR)),\"e / r\",IF(TEXT(AA507,\"000.000.000\")=LOOKUP(TEXT(AA507,\"000.000.000\"),_SRZitatE),\"e\",IF(TEXT(AA507,\"000.000.000\")=LOOKUP(TEXT(AA507,\"000.000.000\"),_SRZitatR),\"r\",\"\"))))","v":""},"514.54","Waffengesetz"]
[null,null,null,null,null,null,null,null,null,null,null,null,null,null,null,null,null,null,null,null,null,null,null,null,"WPEG",{"$f":"IF(LEFT(AA508,2)=\"0.\",\"\",IF(AND(TEXT(AA508,\"000.000.000\")=LOOKUP(TEXT(AA508,\"000.000.000\"),_SRZitatE),TEXT(AA508,\"000.000.000\")=LOOKUP(TEXT(AA508,\"000.000.000\"),_SRZitatR)),\"e / r\",IF(TEXT(AA508,\"000.000.000\")=LOOKUP(TEXT(AA508,\"000.000.000\"),_SRZitatE),\"e\",IF(TEXT(AA508,\"000.000.000\")=LOOKUP(TEXT(AA508,\"000.000.000\"),_SRZitatR),\"r\",\"\"))))","v":""},"661","Wehrpflichtersatzabgabe, BG über die "]
[null,null,null,null,null,null,null,null,null,null,null,null,null,null,null,null,null,null,null,null,null,null,null,null,"WPEV",{"$f":"IF(LEFT(AA509,2)=\"0.\",\"\",IF(AND(TEXT(AA509,\"000.000.000\")=LOOKUP(TEXT(AA509,\"000.000.000\"),_SRZitatE),TEXT(AA509,\"000.000.000\")=LOOKUP(TEXT(AA509,\"000.000.000\"),_SRZitatR)),\"e / r\",IF(TEXT(AA509,\"000.000.000\")=LOOKUP(TEXT(AA509,\"000.000.000\"),_SRZitatE),\"e\",IF(TEXT(AA509,\"000.000.000\")=LOOKUP(TEXT(AA509,\"000.000.000\"),_SRZitatR),\"r\",\"\"))))","v":""},"661.1","Wehrpflichtersatzabgabe, VO über die "]
[null,null,null,null,null,null,null,null,null,null,null,null,null,null,null,null,null,null,null,null,null,null,null,null,"WRG",{"$f":"IF(LEFT(AA510,2)=\"0.\",\"\",IF(AND(TEXT(AA510,\"000.000.000\")=LOOKUP(TEXT(AA510,\"000.000.000\"),_SRZitatE),TEXT(AA510,\"000.000.000\")=LOOKUP(TEXT(AA510,\"000.000.000\"),_SRZitatR)),\"e / r\",IF(TEXT(AA510,\"000.000.000\")=LOOKUP(TEXT(AA510,\"000.000.000\"),_SRZitatE),\"e\",IF(TEXT(AA510,\"000.000.000\")=LOOKUP(TEXT(AA510,\"000.000.000\"),_SRZitatR),\"r\",\"\"))))","v":""},"721.80","Wasserrechtsgesetz"]
[null,null,null,null,null,null,null,null,null,null,null,null,null,null,null,null,null,null,null,null,null,null,null,null,"WSchG","e","232.21","Wappenschutzgesetz"]
[null,null,null,null,null,null,null,null,null,null,null,null,null,null,null,null,null,null,null,null,null,null,null,null,"WZG","e","941.10","Währung und die Zahlungsmittel. BG über die"]
[null,null,null,null,null,null,null,null,null,null,null,null,null,null,null,null,null,null,null,null,null,null,null,null,"ZertES",{"$f":"IF(LEFT(AA513,2)=\"0.\",\"\",IF(AND(TEXT(AA513,\"000.000.000\")=LOOKUP(TEXT(AA513,\"000.000.000\"),_SRZitatE),TEXT(AA513,\"000.000.000\")=LOOKUP(TEXT(AA513,\"000.000.000\"),_SRZitatR)),\"e / r\",IF(TEXT(AA513,\"000.000.000\")=LOOKUP(TEXT(AA513,\"000.000.000\"),_SRZitatE),\"e\",IF(TEXT(AA513,\"000.000.000\")=LOOKUP(TEXT(AA513,\"000.000.000\"),_SRZitatR),\"r\",\"\"))))","v":""},"943.03","BG über die elektronische Signatur"]
[null,null,null,null,null,null,null,null,null,null,null,null,null,null,null,null,null,null,null,null,null,null,null,null,"ZG",{"$f":"IF(LEFT(AA514,2)=\"0.\",\"\",IF(AND(TEXT(AA514,\"000.000.000\")=LOOKUP(TEXT(AA514,\"000.000.000\"),_SRZitatE),TEXT(AA514,\"000.000.000\")=LOOKUP(TEXT(AA514,\"000.000.000\"),_SRZitatR)),\"e / r\",IF(TEXT(AA514,\"000.000.000\")=LOOKUP(TEXT(AA514,\"000.000.000\"),_SRZitatE),\"e\",IF(TEXT(AA514,\"000.000.000\")=LOOKUP(TEXT(AA514,\"000.000.000\"),_SRZitatR),\"r\",\"\"))))","v":""},"631.0","Zollgesetz"]
[null,null,null,null,null,null,null,null,null,null,null,null,null,null,null,null,null,null,null,null,null,null,null,null,"ZGB","e / r",210,"Zivilgesetzbuch"]
[null,null,null,null,null,null,null,null,null,null,null,null,null,null,null,null,null,null,null,null,null,null,null,null,"ZPO","e / r","272","Zivilprozessordnung"]
[null,null,null,null,null,null,null,null,null,null,null,null,null,null,null,null,null,null,null,null,null,null,null,null,"ZStV",{"$f":"IF(LEFT(AA517,2)=\"0.\",\"\",IF(AND(TEXT(AA517,\"000.000.000\")=LOOKUP(TEXT(AA517,\"000.000.000\"),_SRZitatE),TEXT(AA517,\"000.000.000\")=LOOKUP(TEXT(AA517,\"000.000.000\"),_SRZitatR)),\"e / r\",IF(TEXT(AA517,\"000.000.000\")=LOOKUP(TEXT(AA517,\"000.000.000\"),_SRZitatE),\"e\",IF(TEXT(AA517,\"000.000.000\")=LOOKUP(TEXT(AA517,\"000.000.000\"),_SRZitatR),\"r\",\"\"))))","v":""},"211.112.2","Zivilstandsverordnung"]
[null,null,null,null,null,null,null,null,null,null,null,null,null,null,null,null,null,null,null,null,null,null,null,null,"ZTG","e","632.10","Zolltarifgesetz"]
[null,null,null,null,null,null,null,null,null,null,null,null,null,null,null,null,null,null,null,null,null,null,null,null,"ZUG",null,"851.1","Zuständigkeitsgesetz"]
[null,null,null,null,null,null,null,null,null,null,null,null,null,null,null,null,null,null,null,null,null,null,null,null,"ZV",{"$f":"IF(LEFT(AA520,2)=\"0.\",\"\",IF(AND(TEXT(AA520,\"000.000.000\")=LOOKUP(TEXT(AA520,\"000.000.000\"),_SRZitatE),TEXT(AA520,\"000.000.000\")=LOOKUP(TEXT(AA520,\"000.000.000\"),_SRZitatR)),\"e / r\",IF(TEXT(AA520,\"000.000.000\")=LOOKUP(TEXT(AA520,\"000.000.000\"),_SRZitatE),\"e\",IF(TEXT(AA520,\"000.000.000\")=LOOKUP(TEXT(AA520,\"000.000.000\"),_SRZitatR),\"r\",\"\"))))","v":""},"631.01","Zollverordnung"]
[null,null,null,null,null,null,null,null,null,null,null,null,null,null,null,null,null,null,null,null,null,null,null,null,"ZV-EFD",{"$f":"IF(LEFT(AA521,2)=\"0.\",\"\",IF(AND(TEXT(AA521,\"000.000.000\")=LOOKUP(TEXT(AA521,\"000.000.000\"),_SRZitatE),TEXT(AA521,\"000.000.000\")=LOOKUP(TEXT(AA521,\"000.000.000\"),_SRZitatR)),\"e / r\",IF(TEXT(AA521,\"000.000.000\")=LOOKUP(TEXT(AA521,\"000.000.000\"),_SRZitatE),\"e\",IF(TEXT(AA521,\"000.000.000\")=LOOKUP(TEXT(AA521,\"000.000.000\"),_SRZitatR),\"r\",\"\"))))","v":""},"631.011","Zollverordnung des EFD"]
[null,null,null,null,null,null,null,null,null,null,null,null,null,null,null,null,null,null,null,null,null,null,null,null,"ZWG","r","702","Zweitwohnungsgesetz"]
[null,null,null,null,null,null,null,null,null,null,null,null,null,null,null,null,null,null,null,null,null,null,null,null,"ZWV","r","702.1","Zweitwohnungverordnung"]
[]
[]
[]
[]
[null,null,null,null,null,null,null,null,null,null,null,null,null,null,null,null,null,null,null,null,null,null,null,null,null," "]
[null,null,null,null,null,null,null,null,null,null,null,null,null,null,null,null,null,null,null,null,null,null,null,null,null," "]
[null,null,null,null,null,null,null,null,null,null,null,null,null,null,null,null,null,null,null,null,null,null,null,null,null," "]
[null,null,null,null,null,null,null,null,null,null,null,null,null,null,null,null,null,null,null,null,null,null,null,null,null," "]
[null,null,null,null,null,null,null,null,null,null,null,null,null,null,null,null,null,null,null,null,null,null,null,null,null," "]
[null,null,null,null,null,null,null,null,null,null,null,null,null,null,null,null,null,null,null,null,null,null,null,null,null," "]
[null,null,null,null,null,null,null,null,null,null,null,null,null,null,null,null,null,null,null,null,null,null,null,null,null," "]
[null,null,null,null,null,null,null,null,null,null,null,null,null,null,null,null,null,null,null,null,null,null,null,null,null," "]
[null,null,null,null,null,null,null,null,null,null,null,null,null,null,null,null,null,null,null,null,null,null,null,null,null," "]
[null,null,null,null,null,null,null,null,null,null,null,null,null,null,null,null,null,null,null,null,null,null,null,null,null," "]
[null,null,null,null,null,null,null,null,null,null,null,null,null,null,null,null,null,null,null,null,null,null,null,null,null," "]
[null,null,null,null,null,null,null,null,null,null,null,null,null,null,null,null,null,null,null,null,null,null,null,null,null," "]
[null,null,null,null,null,null,null,null,null,null,null,null,null,null,null,null,null,null,null,null,null,null,null,null,null," "]
[null,null,null,null,null,null,null,null,null,null,null,null,null,null,null,null,null,null,null,null,null,null,null,null,null," "]
[null,null,null,null,null,null,null,null,null,null,null,null,null,null,null,null,null,null,null,null,null,null,null,null,null," "]
[null,null,null,null,null,null,null,null,null,null,null,null,null,null,null,null,null,null,null,null,null,null,null,null,null," "]
[null,null,null,null,null,null,null,null,null,null,null,null,null,null,null,null,null,null,null,null,null,null,null,null,null," "]

{"sheet":"SR Abk.","index":1,"n_rows":590,"n_cols":5,"rows_kept":590,"cut":false,"hidden":false,"merged":[]}
[null,"Abkürzungen Bundesvorschriften (SR)"]
[{"$f":"COUNTA(A3:A402)-COUNTBLANK(A3:A402)","v":390},"e / r","Abk.","SR-Nummer","Kurzbezeichnung                  (e = in Englisch,  r = in Romanisch abrufbar, Stand 12.2017, ohne Gewähr)"]
[{"$f":"IF(D3=\"\",\"\",HYPERLINK(\"http://www.admin.ch/ch/d/sr/c\"&SUBSTITUTE(D3,\".\",\"_\")&\".html\",\"SR-Link\"))","v":"SR-Link"},{"$f":"IF(Linkwahl!Z134=\"\",\"\",Linkwahl!Z134)","v":"e"},{"$f":"IF(Linkwahl!Y134=\"\",\"\",Linkwahl!Y134)","v":"AdoV"},{"$f":"IF(Linkwahl!AA134=\"\",\"\",Linkwahl!AA134)","v":"211.221.36"},{"$f":"IF(Linkwahl!AB134=\"\",\"\",Linkwahl!AB134)","v":"Adoptionsverordnung"}]
[{"$f":"IF(D4=\"\",\"\",HYPERLINK(\"http://www.admin.ch/ch/d/sr/c\"&SUBSTITUTE(D4,\".\",\"_\")&\".html\",\"SR-Link\"))","v":"SR-Link"},{"$f":"IF(Linkwahl!Z135=\"\",\"\",Linkwahl!Z135)","v":""},{"$f":"IF(Linkwahl!Y135=\"\",\"\",Linkwahl!Y135)","v":"AHVG"},{"$f":"IF(Linkwahl!AA135=\"\",\"\",Linkwahl!AA135)","v":"831.10"},{"$f":"IF(Linkwahl!AB135=\"\",\"\",Linkwahl!AB135)","v":"Alters- und Hinterlassenenversicherungsgesetz"}]
["SR-Link",{"$f":"IF(Linkwahl!Z136=\"\",\"\",Linkwahl!Z136)","v":""},{"$f":"IF(Linkwahl!Y136=\"\",\"\",Linkwahl!Y136)","v":"AHVV"},{"$f":"IF(Linkwahl!AA136=\"\",\"\",Linkwahl!AA136)","v":831.101},{"$f":"IF(Linkwahl!AB136=\"\",\"\",Linkwahl!AB136)","v":"Alters- und Hinterlassenenversicherungsverordnung"}]
["SR-Link",{"$f":"IF(Linkwahl!Z138=\"\",\"\",Linkwahl!Z138)","v":"e"},{"$f":"IF(Linkwahl!Y138=\"\",\"\",Linkwahl!Y138)","v":"AltlV"},{"$f":"IF(Linkwahl!AA138=\"\",\"\",Linkwahl!AA138)","v":"814.680"},{"$f":"IF(Linkwahl!AB138=\"\",\"\",Linkwahl!AB138)","v":"Altlasten-Verordnung"}]
["SR-Link",{"$f":"IF(Linkwahl!Z139=\"\",\"\",Linkwahl!Z139)","v":""},{"$f":"IF(Linkwahl!Y139=\"\",\"\",Linkwahl!Y139)","v":"ArG"},{"$f":"IF(Linkwahl!AA139=\"\",\"\",Linkwahl!AA139)","v":822.11},{"$f":"IF(Linkwahl!AB139=\"\",\"\",Linkwahl!AB139)","v":"Arbeitsgesetz"}]
["SR-Link",{"$f":"IF(Linkwahl!Z140=\"\",\"\",Linkwahl!Z140)","v":""},{"$f":"IF(Linkwahl!Y140=\"\",\"\",Linkwahl!Y140)","v":"ArGV 1"},{"$f":"IF(Linkwahl!AA140=\"\",\"\",Linkwahl!AA140)","v":822.11099999999999},{"$f":"IF(Linkwahl!AB140=\"\",\"\",Linkwahl!AB140)","v":"Verordnung 1 zum Arbeitsgesetz"}]
["SR-Link",{"$f":"IF(Linkwahl!Z141=\"\",\"\",Linkwahl!Z141)","v":""},{"$f":"IF(Linkwahl!Y141=\"\",\"\",Linkwahl!Y141)","v":"ArGV 2"},{"$f":"IF(Linkwahl!AA141=\"\",\"\",Linkwahl!AA141)","v":822.11199999999997},{"$f":"IF(Linkwahl!AB141=\"\",\"\",Linkwahl!AB141)","v":"Verordnung 2 zum Arbeitsgesetz (Sonderbestimmungen)"}]
["SR-Link",{"$f":"IF(Linkwahl!Z142=\"\",\"\",Linkwahl!Z142)","v":""},{"$f":"IF(Linkwahl!Y142=\"\",\"\",Linkwahl!Y142)","v":"ArGV 3"},{"$f":"IF(Linkwahl!AA142=\"\",\"\",Linkwahl!AA142)","v":822.11300000000006},{"$f":"IF(Linkwahl!AB142=\"\",\"\",Linkwahl!AB142)","v":"Verordnung 3 zum Arbeitsgesetz (Gesundheitsvorsorge)"}]
["SR-Link",{"$f":"IF(Linkwahl!Z143=\"\",\"\",Linkwahl!Z143)","v":""},{"$f":"IF(Linkwahl!Y143=\"\",\"\",Linkwahl!Y143)","v":"ArGV 4"},{"$f":"IF(Linkwahl!AA143=\"\",\"\",Linkwahl!AA143)","v":822.11400000000003},{"$f":"IF(Linkwahl!AB143=\"\",\"\",Linkwahl!AB143)","v":"Verordnung 4 zum Arbeitsgesetz (Industrielle Betriebe)"}]
["SR-Link",{"$f":"IF(Linkwahl!Z144=\"\",\"\",Linkwahl!Z144)","v":""},{"$f":"IF(Linkwahl!Y144=\"\",\"\",Linkwahl!Y144)","v":"ArGV 5"},{"$f":"IF(Linkwahl!AA144=\"\",\"\",Linkwahl!AA144)","v":822.11500000000001},{"$f":"IF(Linkwahl!AB144=\"\",\"\",Linkwahl!AB144)","v":"Verordnung 5 zum Arbeitsgesetz (Jugendarbeitsschutzverordnung)"}]
["SR-Link",{"$f":"IF(Linkwahl!Z145=\"\",\"\",Linkwahl!Z145)","v":""},{"$f":"IF(Linkwahl!Y145=\"\",\"\",Linkwahl!Y145)","v":"ARV 1"},{"$f":"IF(Linkwahl!AA145=\"\",\"\",Linkwahl!AA145)","v":"822.221"},{"$f":"IF(Linkwahl!AB145=\"\",\"\",Linkwahl!AB145)","v":"Chauffeurverordnung"}]
["SR-Link",{"$f":"IF(Linkwahl!Z146=\"\",\"\",Linkwahl!Z146)","v":""},{"$f":"IF(Linkwahl!Y146=\"\",\"\",Linkwahl!Y146)","v":"ARV 2"},{"$f":"IF(Linkwahl!AA146=\"\",\"\",Linkwahl!AA146)","v":"822.222"},{"$f":"IF(Linkwahl!AB146=\"\",\"\",Linkwahl!AB146)","v":"Arbeits- und Ruhezeit berufsmässiger Motorfahrzeugführer (Personentransport)"}]
["SR-Link",{"$f":"IF(Linkwahl!Z147=\"\",\"\",Linkwahl!Z147)","v":"e"},{"$f":"IF(Linkwahl!Y147=\"\",\"\",Linkwahl!Y147)","v":"ASG"},{"$f":"IF(Linkwahl!AA147=\"\",\"\",Linkwahl!AA147)","v":"195.1"},{"$f":"IF(Linkwahl!AB147=\"\",\"\",Linkwahl!AB147)","v":"Auslandschweizergesetz"}]
["SR-Link",{"$f":"IF(Linkwahl!Z148=\"\",\"\",Linkwahl!Z148)","v":"e / r"},{"$f":"IF(Linkwahl!Y148=\"\",\"\",Linkwahl!Y148)","v":"AsylG"},{"$f":"IF(Linkwahl!AA148=\"\",\"\",Linkwahl!AA148)","v":"142.31"},{"$f":"IF(Linkwahl!AB148=\"\",\"\",Linkwahl!AB148)","v":"Asylgesetz"}]
["SR-Link",{"$f":"IF(Linkwahl!Z149=\"\",\"\",Linkwahl!Z149)","v":""},{"$f":"IF(Linkwahl!Y149=\"\",\"\",Linkwahl!Y149)","v":"ATSG"},{"$f":"IF(Linkwahl!AA149=\"\",\"\",Linkwahl!AA149)","v":"830.1"},{"$f":"IF(Linkwahl!AB149=\"\",\"\",Linkwahl!AB149)","v":"Allgemeiner Teil Sozialversicherungsrecht"}]
["SR-Link",{"$f":"IF(Linkwahl!Z150=\"\",\"\",Linkwahl!Z150)","v":""},{"$f":"IF(Linkwahl!Y150=\"\",\"\",Linkwahl!Y150)","v":"ATSV"},{"$f":"IF(Linkwahl!AA150=\"\",\"\",Linkwahl!AA150)","v":"830.11"},{"$f":"IF(Linkwahl!AB150=\"\",\"\",Linkwahl!AB150)","v":"VO Allgemeiner Teil Sozialversicherungsrecht"}]
["SR-Link",{"$f":"IF(Linkwahl!Z137=\"\",\"\",Linkwahl!Z137)","v":"e / r"},{"$f":"IF(Linkwahl!Y137=\"\",\"\",Linkwahl!Y137)","v":"AIG"},{"$f":"IF(Linkwahl!AA137=\"\",\"\",Linkwahl!AA137)","v":"142.20"},{"$f":"IF(Linkwahl!AB137=\"\",\"\",Linkwahl!AB137)","v":"Ausländer- und Integrationsgesetz"}]
["SR-Link",{"$f":"IF(Linkwahl!Z151=\"\",\"\",Linkwahl!Z151)","v":""},{"$f":"IF(Linkwahl!Y151=\"\",\"\",Linkwahl!Y151)","v":"AVEG"},{"$f":"IF(Linkwahl!AA151=\"\",\"\",Linkwahl!AA151)","v":"221.215.311"},{"$f":"IF(Linkwahl!AB151=\"\",\"\",Linkwahl!AB151)","v":"Allgemeinverbindlicherklärung von Gesamtarbeitsverträgen, BG über die "}]
["SR-Link",{"$f":"IF(Linkwahl!Z152=\"\",\"\",Linkwahl!Z152)","v":""},{"$f":"IF(Linkwahl!Y152=\"\",\"\",Linkwahl!Y152)","v":"AVG"},{"$f":"IF(Linkwahl!AA152=\"\",\"\",Linkwahl!AA152)","v":823.11},{"$f":"IF(Linkwahl!AB152=\"\",\"\",Linkwahl!AB152)","v":"Arbeitsvermittlungsgesetz"}]
["SR-Link",{"$f":"IF(Linkwahl!Z153=\"\",\"\",Linkwahl!Z153)","v":""},{"$f":"IF(Linkwahl!Y153=\"\",\"\",Linkwahl!Y153)","v":"AVIG"},{"$f":"IF(Linkwahl!AA153=\"\",\"\",Linkwahl!AA153)","v":"837.0"},{"$f":"IF(Linkwahl!AB153=\"\",\"\",Linkwahl!AB153)","v":"Arbeitslosenversicherungsgesetz"}]
["SR-Link",{"$f":"IF(Linkwahl!Z154=\"\",\"\",Linkwahl!Z154)","v":""},{"$f":"IF(Linkwahl!Y154=\"\",\"\",Linkwahl!Y154)","v":"AVIV"},{"$f":"IF(Linkwahl!AA154=\"\",\"\",Linkwahl!AA154)","v":837.02},{"$f":"IF(Linkwahl!AB154=\"\",\"\",Linkwahl!AB154)","v":"Arbeitslosenversicherungsverordnung"}]
["SR-Link",{"$f":"IF(Linkwahl!Z155=\"\",\"\",Linkwahl!Z155)","v":""},{"$f":"IF(Linkwahl!Y155=\"\",\"\",Linkwahl!Y155)","v":"AVV"},{"$f":"IF(Linkwahl!AA155=\"\",\"\",Linkwahl!AA155)","v":823.11099999999999},{"$f":"IF(Linkwahl!AB155=\"\",\"\",Linkwahl!AB155)","v":"Arbeitsvermittlungsverordnung"}]
["SR-Link",{"$f":"IF(Linkwahl!Z156=\"\",\"\",Linkwahl!Z156)","v":"r"},{"$f":"IF(Linkwahl!Y156=\"\",\"\",Linkwahl!Y156)","v":"AwG"},{"$f":"IF(Linkwahl!AA156=\"\",\"\",Linkwahl!AA156)","v":"143.1"},{"$f":"IF(Linkwahl!AB156=\"\",\"\",Linkwahl!AB156)","v":"Ausweisgesetz"}]
["SR-Link",{"$f":"IF(Linkwahl!Z157=\"\",\"\",Linkwahl!Z157)","v":""},{"$f":"IF(Linkwahl!Y157=\"\",\"\",Linkwahl!Y157)","v":"AZG"},{"$f":"IF(Linkwahl!AA157=\"\",\"\",Linkwahl!AA157)","v":822.21},{"$f":"IF(Linkwahl!AB157=\"\",\"\",Linkwahl!AB157)","v":"Arbeitszeitgesetz (öffentlicher Verkehr)"}]
["SR-Link",{"$f":"IF(Linkwahl!Z158=\"\",\"\",Linkwahl!Z158)","v":""},{"$f":"IF(Linkwahl!Y158=\"\",\"\",Linkwahl!Y158)","v":"AZGV"},{"$f":"IF(Linkwahl!AA158=\"\",\"\",Linkwahl!AA158)","v":822.21100000000001},{"$f":"IF(Linkwahl!AB158=\"\",\"\",Linkwahl!AB158)","v":"Arbeitszeitgesetz, VO zum (öffentlicher Verkehr)"}]
["SR-Link",{"$f":"IF(Linkwahl!Z159=\"\",\"\",Linkwahl!Z159)","v":""},{"$f":"IF(Linkwahl!Y159=\"\",\"\",Linkwahl!Y159)","v":"BankG"},{"$f":"IF(Linkwahl!AA159=\"\",\"\",Linkwahl!AA159)","v":"952.0"},{"$f":"IF(Linkwahl!AB159=\"\",\"\",Linkwahl!AB159)","v":"Bankengesesetz"}]
["SR-Link",{"$f":"IF(Linkwahl!Z160=\"\",\"\",Linkwahl!Z160)","v":""},{"$f":"IF(Linkwahl!Y160=\"\",\"\",Linkwahl!Y160)","v":"BankV"},{"$f":"IF(Linkwahl!AA160=\"\",\"\",Linkwahl!AA160)","v":"952.02"},{"$f":"IF(Linkwahl!AB160=\"\",\"\",Linkwahl!AB160)","v":"Bankenverordnung"}]
["SR-Link",{"$f":"IF(Linkwahl!Z161=\"\",\"\",Linkwahl!Z161)","v":"r"},{"$f":"IF(Linkwahl!Y161=\"\",\"\",Linkwahl!Y161)","v":"BB ScheA"},{"$f":"IF(Linkwahl!AA161=\"\",\"\",Linkwahl!AA161)","v":"362"},{"$f":"IF(Linkwahl!AB161=\"\",\"\",Linkwahl!AB161)","v":"Genehmigung/Umsetzung Schengen-/Dublin-Abkommen, BB über"}]
["SR-Link",{"$f":"IF(Linkwahl!Z162=\"\",\"\",Linkwahl!Z162)","v":"e / r"},{"$f":"IF(Linkwahl!Y162=\"\",\"\",Linkwahl!Y162)","v":"BBG"},{"$f":"IF(Linkwahl!AA162=\"\",\"\",Linkwahl!AA162)","v":"412.10"},{"$f":"IF(Linkwahl!AB162=\"\",\"\",Linkwahl!AB162)","v":"Berufsbildungsgesetz"}]
["SR-Link",{"$f":"IF(Linkwahl!Z163=\"\",\"\",Linkwahl!Z163)","v":"e / r"},{"$f":"IF(Linkwahl!Y163=\"\",\"\",Linkwahl!Y163)","v":"BBV"},{"$f":"IF(Linkwahl!AA163=\"\",\"\",Linkwahl!AA163)","v":"412.101"},{"$f":"IF(Linkwahl!AB163=\"\",\"\",Linkwahl!AB163)","v":"Berufsbildungsverordnung"}]
["SR-Link",{"$f":"IF(Linkwahl!Z164=\"\",\"\",Linkwahl!Z164)","v":"e"},{"$f":"IF(Linkwahl!Y164=\"\",\"\",Linkwahl!Y164)","v":"BEG"},{"$f":"IF(Linkwahl!AA164=\"\",\"\",Linkwahl!AA164)","v":"957.1"},{"$f":"IF(Linkwahl!AB164=\"\",\"\",Linkwahl!AB164)","v":"Bucheffektengesetz"}]
["SR-Link",{"$f":"IF(Linkwahl!Z165=\"\",\"\",Linkwahl!Z165)","v":""},{"$f":"IF(Linkwahl!Y165=\"\",\"\",Linkwahl!Y165)","v":"BEHG"},{"$f":"IF(Linkwahl!AA165=\"\",\"\",Linkwahl!AA165)","v":"954.1"},{"$f":"IF(Linkwahl!AB165=\"\",\"\",Linkwahl!AB165)","v":"Börsengesetz"}]
["SR-Link",{"$f":"IF(Linkwahl!Z166=\"\",\"\",Linkwahl!Z166)","v":""},{"$f":"IF(Linkwahl!Y166=\"\",\"\",Linkwahl!Y166)","v":"BehiG"},{"$f":"IF(Linkwahl!AA166=\"\",\"\",Linkwahl!AA166)","v":"151.3"},{"$f":"IF(Linkwahl!AB166=\"\",\"\",Linkwahl!AB166)","v":"Behindertengleichstellungsgesetz"}]
["SR-Link",{"$f":"IF(Linkwahl!Z167=\"\",\"\",Linkwahl!Z167)","v":""},{"$f":"IF(Linkwahl!Y167=\"\",\"\",Linkwahl!Y167)","v":"BEHV"},{"$f":"IF(Linkwahl!AA167=\"\",\"\",Linkwahl!AA167)","v":"954.11"},{"$f":"IF(Linkwahl!AB167=\"\",\"\",Linkwahl!AB167)","v":"Börsenverordnung"}]
["SR-Link",{"$f":"IF(Linkwahl!Z168=\"\",\"\",Linkwahl!Z168)","v":""},{"$f":"IF(Linkwahl!Y168=\"\",\"\",Linkwahl!Y168)","v":"BEHV-FINMA"},{"$f":"IF(Linkwahl!AA168=\"\",\"\",Linkwahl!AA168)","v":"954.193"},{"$f":"IF(Linkwahl!AB168=\"\",\"\",Linkwahl!AB168)","v":"Börsenverordnung-FINMA"}]
["SR-Link",{"$f":"IF(Linkwahl!Z169=\"\",\"\",Linkwahl!Z169)","v":"e"},{"$f":"IF(Linkwahl!Y169=\"\",\"\",Linkwahl!Y169)","v":"BetmG"},{"$f":"IF(Linkwahl!AA169=\"\",\"\",Linkwahl!AA169)","v":812.12099999999998},{"$f":"IF(Linkwahl!AB169=\"\",\"\",Linkwahl!AB169)","v":"Betäubungsmittelgesetz"}]
["SR-Link",{"$f":"IF(Linkwahl!Z170=\"\",\"\",Linkwahl!Z170)","v":""},{"$f":"IF(Linkwahl!Y170=\"\",\"\",Linkwahl!Y170)","v":"BetmV"},{"$f":"IF(Linkwahl!AA170=\"\",\"\",Linkwahl!AA170)","v":"812.121.1"},{"$f":"IF(Linkwahl!AB170=\"\",\"\",Linkwahl!AB170)","v":"Betäubungsmittelverordnung"}]
["SR-Link",{"$f":"IF(Linkwahl!Z171=\"\",\"\",Linkwahl!Z171)","v":""},{"$f":"IF(Linkwahl!Y171=\"\",\"\",Linkwahl!Y171)","v":"BewG"},{"$f":"IF(Linkwahl!AA171=\"\",\"\",Linkwahl!AA171)","v":"211.412.41"},{"$f":"IF(Linkwahl!AB171=\"\",\"\",Linkwahl!AB171)","v":"Erwerb von Grundstücken durch Personen im Ausland, BG über den "}]
["SR-Link",{"$f":"IF(Linkwahl!Z172=\"\",\"\",Linkwahl!Z172)","v":""},{"$f":"IF(Linkwahl!Y172=\"\",\"\",Linkwahl!Y172)","v":"BewV"},{"$f":"IF(Linkwahl!AA172=\"\",\"\",Linkwahl!AA172)","v":"211.412.411"},{"$f":"IF(Linkwahl!AB172=\"\",\"\",Linkwahl!AB172)","v":"Erwerb von Grundstücken durch Personen im Ausland, VO über den "}]
["SR-Link",{"$f":"IF(Linkwahl!Z173=\"\",\"\",Linkwahl!Z173)","v":"e"},{"$f":"IF(Linkwahl!Y173=\"\",\"\",Linkwahl!Y173)","v":"BGA"},{"$f":"IF(Linkwahl!AA173=\"\",\"\",Linkwahl!AA173)","v":"152.1"},{"$f":"IF(Linkwahl!AB173=\"\",\"\",Linkwahl!AB173)","v":"Archivierungsgesetz"}]
["SR-Link",{"$f":"IF(Linkwahl!Z174=\"\",\"\",Linkwahl!Z174)","v":""},{"$f":"IF(Linkwahl!Y174=\"\",\"\",Linkwahl!Y174)","v":"BGBB"},{"$f":"IF(Linkwahl!AA174=\"\",\"\",Linkwahl!AA174)","v":"211.412.11"},{"$f":"IF(Linkwahl!AB174=\"\",\"\",Linkwahl!AB174)","v":"bäuerliche Bodenrecht, BG über das "}]
["SR-Link",{"$f":"IF(Linkwahl!Z175=\"\",\"\",Linkwahl!Z175)","v":""},{"$f":"IF(Linkwahl!Y175=\"\",\"\",Linkwahl!Y175)","v":"BGerR"},{"$f":"IF(Linkwahl!AA175=\"\",\"\",Linkwahl!AA175)","v":"173.110.131"},{"$f":"IF(Linkwahl!AB175=\"\",\"\",Linkwahl!AB175)","v":"Bundesgericht, Reglement für das "}]
["SR-Link",{"$f":"IF(Linkwahl!Z176=\"\",\"\",Linkwahl!Z176)","v":"r"},{"$f":"IF(Linkwahl!Y176=\"\",\"\",Linkwahl!Y176)","v":"BGF"},{"$f":"IF(Linkwahl!AA176=\"\",\"\",Linkwahl!AA176)","v":"923.0"},{"$f":"IF(Linkwahl!AB176=\"\",\"\",Linkwahl!AB176)","v":"Fischerei, BG über die"}]
["SR-Link",{"$f":"IF(Linkwahl!Z177=\"\",\"\",Linkwahl!Z177)","v":""},{"$f":"IF(Linkwahl!Y177=\"\",\"\",Linkwahl!Y177)","v":"BGFA"},{"$f":"IF(Linkwahl!AA177=\"\",\"\",Linkwahl!AA177)","v":935.61},{"$f":"IF(Linkwahl!AB177=\"\",\"\",Linkwahl!AB177)","v":"Anwaltsgesetz"}]
["SR-Link",{"$f":"IF(Linkwahl!Z178=\"\",\"\",Linkwahl!Z178)","v":"r"},{"$f":"IF(Linkwahl!Y178=\"\",\"\",Linkwahl!Y178)","v":"BGG"},{"$f":"IF(Linkwahl!AA178=\"\",\"\",Linkwahl!AA178)","v":"173.110"},{"$f":"IF(Linkwahl!AB178=\"\",\"\",Linkwahl!AB178)","v":"Bundesgerichtsgesetz"}]
["SR-Link",{"$f":"IF(Linkwahl!Z179=\"\",\"\",Linkwahl!Z179)","v":""},{"$f":"IF(Linkwahl!Y179=\"\",\"\",Linkwahl!Y179)","v":"BG-HAÜ"},{"$f":"IF(Linkwahl!AA179=\"\",\"\",Linkwahl!AA179)","v":"211.221.31"},{"$f":"IF(Linkwahl!AB179=\"\",\"\",Linkwahl!AB179)","v":"Haager Adoptionsübereink. + Massn. zum Schutz des Kindes bei internat. Adoptionen, BG zum"}]
["SR-Link",{"$f":"IF(Linkwahl!Z180=\"\",\"\",Linkwahl!Z180)","v":"e"},{"$f":"IF(Linkwahl!Y180=\"\",\"\",Linkwahl!Y180)","v":"BG-KKE"},{"$f":"IF(Linkwahl!AA180=\"\",\"\",Linkwahl!AA180)","v":"211.222.32"},{"$f":"IF(Linkwahl!AB180=\"\",\"\",Linkwahl!AB180)","v":"internationale Kindesentführung und die Haager Übereinkommen zum Schutz von Kindern und Erwachsenen, Bezirksgericht über"}]
["SR-Link",{"$f":"IF(Linkwahl!Z181=\"\",\"\",Linkwahl!Z181)","v":"e / r"},{"$f":"IF(Linkwahl!Y181=\"\",\"\",Linkwahl!Y181)","v":"BGÖ"},{"$f":"IF(Linkwahl!AA181=\"\",\"\",Linkwahl!AA181)","v":"152.3"},{"$f":"IF(Linkwahl!AB181=\"\",\"\",Linkwahl!AB181)","v":"Öffentlichkeitsgesetz"}]
["SR-Link",{"$f":"IF(Linkwahl!Z182=\"\",\"\",Linkwahl!Z182)","v":""},{"$f":"IF(Linkwahl!Y182=\"\",\"\",Linkwahl!Y182)","v":"BGSA"},{"$f":"IF(Linkwahl!AA182=\"\",\"\",Linkwahl!AA182)","v":822.41},{"$f":"IF(Linkwahl!AB182=\"\",\"\",Linkwahl!AB182)","v":"Schwarzarbeit, BG gegen die "}]
["SR-Link",{"$f":"IF(Linkwahl!Z183=\"\",\"\",Linkwahl!Z183)","v":"e"},{"$f":"IF(Linkwahl!Y183=\"\",\"\",Linkwahl!Y183)","v":"BGST"},{"$f":"IF(Linkwahl!AA183=\"\",\"\",Linkwahl!AA183)","v":"745.2"},{"$f":"IF(Linkwahl!AB183=\"\",\"\",Linkwahl!AB183)","v":"Sicherheitsorgane der Transportunternehmen im öffentlichen Verkehr, BG über die"}]
["SR-Link",{"$f":"IF(Linkwahl!Z184=\"\",\"\",Linkwahl!Z184)","v":"e"},{"$f":"IF(Linkwahl!Y184=\"\",\"\",Linkwahl!Y184)","v":"BiGV"},{"$f":"IF(Linkwahl!AA184=\"\",\"\",Linkwahl!AA184)","v":"432.22"},{"$f":"IF(Linkwahl!AB184=\"\",\"\",Linkwahl!AB184)","v":"Bibliothek am Guisanplatz, Verordnung über die "}]
["SR-Link",{"$f":"IF(Linkwahl!Z185=\"\",\"\",Linkwahl!Z185)","v":"e"},{"$f":"IF(Linkwahl!Y185=\"\",\"\",Linkwahl!Y185)","v":"BIV-FINMA"},{"$f":"IF(Linkwahl!AA185=\"\",\"\",Linkwahl!AA185)","v":"952.05"},{"$f":"IF(Linkwahl!AB185=\"\",\"\",Linkwahl!AB185)","v":"Bankeninsolvenzverordnung-FINMA"}]
["SR-Link",{"$f":"IF(Linkwahl!Z186=\"\",\"\",Linkwahl!Z186)","v":""},{"$f":"IF(Linkwahl!Y186=\"\",\"\",Linkwahl!Y186)","v":"BöB"},{"$f":"IF(Linkwahl!AA186=\"\",\"\",Linkwahl!AA186)","v":"172.056.1"},{"$f":"IF(Linkwahl!AB186=\"\",\"\",Linkwahl!AB186)","v":"öffentliche Beschaffungswesen, BG über das"}]
["SR-Link",{"$f":"IF(Linkwahl!Z187=\"\",\"\",Linkwahl!Z187)","v":"r"},{"$f":"IF(Linkwahl!Y187=\"\",\"\",Linkwahl!Y187)","v":"BPG"},{"$f":"IF(Linkwahl!AA187=\"\",\"\",Linkwahl!AA187)","v":"172.220.1"},{"$f":"IF(Linkwahl!AB187=\"\",\"\",Linkwahl!AB187)","v":"Bundespersonalgesetz"}]
["SR-Link",{"$f":"IF(Linkwahl!Z188=\"\",\"\",Linkwahl!Z188)","v":"e / r"},{"$f":"IF(Linkwahl!Y188=\"\",\"\",Linkwahl!Y188)","v":"BPR"},{"$f":"IF(Linkwahl!AA188=\"\",\"\",Linkwahl!AA188)","v":"161.1"},{"$f":"IF(Linkwahl!AB188=\"\",\"\",Linkwahl!AB188)","v":"BG über die politischen Rechte"}]
["SR-Link",{"$f":"IF(Linkwahl!Z189=\"\",\"\",Linkwahl!Z189)","v":""},{"$f":"IF(Linkwahl!Y189=\"\",\"\",Linkwahl!Y189)","v":"BPV"},{"$f":"IF(Linkwahl!AA189=\"\",\"\",Linkwahl!AA189)","v":"172.220.111.3"},{"$f":"IF(Linkwahl!AB189=\"\",\"\",Linkwahl!AB189)","v":"Bundespersonalverordnung"}]
["SR-Link",{"$f":"IF(Linkwahl!Z190=\"\",\"\",Linkwahl!Z190)","v":""},{"$f":"IF(Linkwahl!Y190=\"\",\"\",Linkwahl!Y190)","v":"BSDA"},{"$f":"IF(Linkwahl!AA190=\"\",\"\",Linkwahl!AA190)","v":"852.1"},{"$f":"IF(Linkwahl!AB190=\"\",\"\",Linkwahl!AB190)","v":"Sozialhilfe + Darlehen an Auslandschweizer, BG über"}]
["SR-Link",{"$f":"IF(Linkwahl!Z191=\"\",\"\",Linkwahl!Z191)","v":""},{"$f":"IF(Linkwahl!Y191=\"\",\"\",Linkwahl!Y191)","v":"BSG"},{"$f":"IF(Linkwahl!AA191=\"\",\"\",Linkwahl!AA191)","v":"747.201"},{"$f":"IF(Linkwahl!AB191=\"\",\"\",Linkwahl!AB191)","v":"Binnenschifffahrtsgesetz"}]
["SR-Link",{"$f":"IF(Linkwahl!Z192=\"\",\"\",Linkwahl!Z192)","v":"e"},{"$f":"IF(Linkwahl!Y192=\"\",\"\",Linkwahl!Y192)","v":"BStatG"},{"$f":"IF(Linkwahl!AA192=\"\",\"\",Linkwahl!AA192)","v":"431.01"},{"$f":"IF(Linkwahl!AB192=\"\",\"\",Linkwahl!AB192)","v":"Bundesstatistikgesetz "}]
["SR-Link",{"$f":"IF(Linkwahl!Z193=\"\",\"\",Linkwahl!Z193)","v":"e"},{"$f":"IF(Linkwahl!Y193=\"\",\"\",Linkwahl!Y193)","v":"BStatOV"},{"$f":"IF(Linkwahl!AA193=\"\",\"\",Linkwahl!AA193)","v":"431.011"},{"$f":"IF(Linkwahl!AB193=\"\",\"\",Linkwahl!AB193)","v":"Organisation der Bundesstatistik, VO über "}]
["SR-Link",{"$f":"IF(Linkwahl!Z194=\"\",\"\",Linkwahl!Z194)","v":""},{"$f":"IF(Linkwahl!Y194=\"\",\"\",Linkwahl!Y194)","v":"BSV"},{"$f":"IF(Linkwahl!AA194=\"\",\"\",Linkwahl!AA194)","v":"747.201.1"},{"$f":"IF(Linkwahl!AB194=\"\",\"\",Linkwahl!AB194)","v":"Binnenschifffahrtsverordnung"}]
["SR-Link",{"$f":"IF(Linkwahl!Z195=\"\",\"\",Linkwahl!Z195)","v":"e / r"},{"$f":"IF(Linkwahl!Y195=\"\",\"\",Linkwahl!Y195)","v":"BüG"},{"$f":"IF(Linkwahl!AA195=\"\",\"\",Linkwahl!AA195)","v":"141.0"},{"$f":"IF(Linkwahl!AB195=\"\",\"\",Linkwahl!AB195)","v":"Bürgerrechtsgesetz"}]
["SR-Link",{"$f":"IF(Linkwahl!Z196=\"\",\"\",Linkwahl!Z196)","v":"e / r"},{"$f":"IF(Linkwahl!Y196=\"\",\"\",Linkwahl!Y196)","v":"BV"},{"$f":"IF(Linkwahl!AA196=\"\",\"\",Linkwahl!AA196)","v":"101"},{"$f":"IF(Linkwahl!AB196=\"\",\"\",Linkwahl!AB196)","v":"Bundesverfassung"}]
["SR-Link",{"$f":"IF(Linkwahl!Z197=\"\",\"\",Linkwahl!Z197)","v":""},{"$f":"IF(Linkwahl!Y197=\"\",\"\",Linkwahl!Y197)","v":"BVG"},{"$f":"IF(Linkwahl!AA197=\"\",\"\",Linkwahl!AA197)","v":"831.40"},{"$f":"IF(Linkwahl!AB197=\"\",\"\",Linkwahl!AB197)","v":"berufliche Alters-, Hinterlassenen- und Invalidenvorsorge, BG über die "}]
["SR-Link",{"$f":"IF(Linkwahl!Z198=\"\",\"\",Linkwahl!Z198)","v":""},{"$f":"IF(Linkwahl!Y198=\"\",\"\",Linkwahl!Y198)","v":"BVV 1"},{"$f":"IF(Linkwahl!AA198=\"\",\"\",Linkwahl!AA198)","v":"831.435.1"},{"$f":"IF(Linkwahl!AB198=\"\",\"\",Linkwahl!AB198)","v":"Beaufsichtigung und die Registrierung der Vorsorgeeinrichtungen, VO über die "}]
[{"$f":"IF(D68=\"\",\"\",HYPERLINK(\"http://www.admin.ch/ch/d/sr/c\"&SUBSTITUTE(D68,\".\",\"_\")&\".html\",\"SR-Link\"))","v":"SR-Link"},{"$f":"IF(Linkwahl!Z199=\"\",\"\",Linkwahl!Z199)","v":""},{"$f":"IF(Linkwahl!Y199=\"\",\"\",Linkwahl!Y199)","v":"BVV 2"},{"$f":"IF(Linkwahl!AA199=\"\",\"\",Linkwahl!AA199)","v":"831.441.1"},{"$f":"IF(Linkwahl!AB199=\"\",\"\",Linkwahl!AB199)","v":"berufliche Alters-, Hinterlassenen- und Invalidenvorsorge, VO über die "}]
["SR-Link",{"$f":"IF(Linkwahl!Z200=\"\",\"\",Linkwahl!Z200)","v":""},{"$f":"IF(Linkwahl!Y200=\"\",\"\",Linkwahl!Y200)","v":"BVV 3"},{"$f":"IF(Linkwahl!AA200=\"\",\"\",Linkwahl!AA200)","v":"831.461.3"},{"$f":"IF(Linkwahl!AB200=\"\",\"\",Linkwahl!AB200)","v":"steuerliche Abzugsberechtigung für Beiträge an anerkannte Vorsorgeformen, VO über die "}]
["SR-Link",{"$f":"IF(Linkwahl!Z201=\"\",\"\",Linkwahl!Z201)","v":""},{"$f":"IF(Linkwahl!Y201=\"\",\"\",Linkwahl!Y201)","v":"BWIS"},{"$f":"IF(Linkwahl!AA201=\"\",\"\",Linkwahl!AA201)","v":"120"},{"$f":"IF(Linkwahl!AB201=\"\",\"\",Linkwahl!AB201)","v":"Massnahmen zur Wahrung der inneren Sicherheit, BG über"}]
["SR-Link",{"$f":"IF(Linkwahl!Z202=\"\",\"\",Linkwahl!Z202)","v":"r"},{"$f":"IF(Linkwahl!Y202=\"\",\"\",Linkwahl!Y202)","v":"BZG"},{"$f":"IF(Linkwahl!AA202=\"\",\"\",Linkwahl!AA202)","v":"520.1"},{"$f":"IF(Linkwahl!AB202=\"\",\"\",Linkwahl!AB202)","v":"Bevölkerungs- und Zivilschutzgesetz"}]
["SR-Link",{"$f":"IF(Linkwahl!Z203=\"\",\"\",Linkwahl!Z203)","v":""},{"$f":"IF(Linkwahl!Y203=\"\",\"\",Linkwahl!Y203)","v":"BZP"},{"$f":"IF(Linkwahl!AA203=\"\",\"\",Linkwahl!AA203)","v":"273"},{"$f":"IF(Linkwahl!AB203=\"\",\"\",Linkwahl!AB203)","v":"Bundeszivilprozess, BG über den"}]
["SR-Link",{"$f":"IF(Linkwahl!Z204=\"\",\"\",Linkwahl!Z204)","v":"e"},{"$f":"IF(Linkwahl!Y204=\"\",\"\",Linkwahl!Y204)","v":"CartV"},{"$f":"IF(Linkwahl!AA204=\"\",\"\",Linkwahl!AA204)","v":"814.912.21"},{"$f":"IF(Linkwahl!AB204=\"\",\"\",Linkwahl!AB204)","v":"Cartagena-Verordnung"}]
["SR-Link",{"$f":"IF(Linkwahl!Z205=\"\",\"\",Linkwahl!Z205)","v":""},{"$f":"IF(Linkwahl!Y205=\"\",\"\",Linkwahl!Y205)","v":"CEDAW"},{"$f":"IF(Linkwahl!AA205=\"\",\"\",Linkwahl!AA205)","v":"0.108"},{"$f":"IF(Linkwahl!AB205=\"\",\"\",Linkwahl!AB205)","v":"Übereinkommen zur Beseitigung jeder Form von Diskriminierung der Frau"}]
["SR-Link",{"$f":"IF(Linkwahl!Z206=\"\",\"\",Linkwahl!Z206)","v":"e"},{"$f":"IF(Linkwahl!Y206=\"\",\"\",Linkwahl!Y206)","v":"ChemG"},{"$f":"IF(Linkwahl!AA206=\"\",\"\",Linkwahl!AA206)","v":"813.1"},{"$f":"IF(Linkwahl!AB206=\"\",\"\",Linkwahl!AB206)","v":"Chemikaliengesetz"}]
["SR-Link",{"$f":"IF(Linkwahl!Z207=\"\",\"\",Linkwahl!Z207)","v":"e"},{"$f":"IF(Linkwahl!Y207=\"\",\"\",Linkwahl!Y207)","v":"ChemPICV"},{"$f":"IF(Linkwahl!AA207=\"\",\"\",Linkwahl!AA207)","v":"814.82"},{"$f":"IF(Linkwahl!AB207=\"\",\"\",Linkwahl!AB207)","v":"PIC-Verordnung"}]
["SR-Link",{"$f":"IF(Linkwahl!Z208=\"\",\"\",Linkwahl!Z208)","v":"e"},{"$f":"IF(Linkwahl!Y208=\"\",\"\",Linkwahl!Y208)","v":"ChemRRV"},{"$f":"IF(Linkwahl!AA208=\"\",\"\",Linkwahl!AA208)","v":"814.81"},{"$f":"IF(Linkwahl!AB208=\"\",\"\",Linkwahl!AB208)","v":"Chemikalien-Risikoreduktions-Verordnung"}]
["SR-Link",{"$f":"IF(Linkwahl!Z209=\"\",\"\",Linkwahl!Z209)","v":"e"},{"$f":"IF(Linkwahl!Y209=\"\",\"\",Linkwahl!Y209)","v":"ChemV"},{"$f":"IF(Linkwahl!AA209=\"\",\"\",Linkwahl!AA209)","v":"813.11"},{"$f":"IF(Linkwahl!AB209=\"\",\"\",Linkwahl!AB209)","v":"Chemikalienverordnung"}]
["SR-Link",{"$f":"IF(Linkwahl!Z210=\"\",\"\",Linkwahl!Z210)","v":""},{"$f":"IF(Linkwahl!Y210=\"\",\"\",Linkwahl!Y210)","v":"CISG"},{"$f":"IF(Linkwahl!AA210=\"\",\"\",Linkwahl!AA210)","v":"0.221.211.1"},{"$f":"IF(Linkwahl!AB210=\"\",\"\",Linkwahl!AB210)","v":"UN-Übereinkommen über Verträge über den internationalen Warenkauf (Convention of International Sale of Goods)"}]
["SR-Link",{"$f":"IF(Linkwahl!Z211=\"\",\"\",Linkwahl!Z211)","v":""},{"$f":"IF(Linkwahl!Y211=\"\",\"\",Linkwahl!Y211)","v":"CMR"},{"$f":"IF(Linkwahl!AA211=\"\",\"\",Linkwahl!AA211)","v":"0.741.611"},{"$f":"IF(Linkwahl!AB211=\"\",\"\",Linkwahl!AB211)","v":"Übereinkommen über den Beförderungsvertrag im internationalen Strassengüterverkehr"}]
["SR-Link",{"$f":"IF(Linkwahl!Z212=\"\",\"\",Linkwahl!Z212)","v":"e"},{"$f":"IF(Linkwahl!Y212=\"\",\"\",Linkwahl!Y212)","v":"CO2AV"},{"$f":"IF(Linkwahl!AA212=\"\",\"\",Linkwahl!AA212)","v":"641.711.1"},{"$f":"IF(Linkwahl!AB212=\"\",\"\",Linkwahl!AB212)","v":"CO2-Anrechnungsverordnung"}]
["SR-Link",{"$f":"IF(Linkwahl!Z213=\"\",\"\",Linkwahl!Z213)","v":"e"},{"$f":"IF(Linkwahl!Y213=\"\",\"\",Linkwahl!Y213)","v":"CO2-G"},{"$f":"IF(Linkwahl!AA213=\"\",\"\",Linkwahl!AA213)","v":"641.71"},{"$f":"IF(Linkwahl!AB213=\"\",\"\",Linkwahl!AB213)","v":"Reduktion der CO2-Emissionen, BG über die"}]
["SR-Link",{"$f":"IF(Linkwahl!Z214=\"\",\"\",Linkwahl!Z214)","v":"e"},{"$f":"IF(Linkwahl!Y214=\"\",\"\",Linkwahl!Y214)","v":"CO2-V"},{"$f":"IF(Linkwahl!AA214=\"\",\"\",Linkwahl!AA214)","v":"641.711"},{"$f":"IF(Linkwahl!AB214=\"\",\"\",Linkwahl!AB214)","v":" Reduktion der CO2-Emissionen, VO über die"}]
["SR-Link",{"$f":"IF(Linkwahl!Z215=\"\",\"\",Linkwahl!Z215)","v":""},{"$f":"IF(Linkwahl!Y215=\"\",\"\",Linkwahl!Y215)","v":"DBG"},{"$f":"IF(Linkwahl!AA215=\"\",\"\",Linkwahl!AA215)","v":"642.11"},{"$f":"IF(Linkwahl!AB215=\"\",\"\",Linkwahl!AB215)","v":"direkte Bundessteuer, BG über die "}]
["SR-Link",{"$f":"IF(Linkwahl!Z216=\"\",\"\",Linkwahl!Z216)","v":"e"},{"$f":"IF(Linkwahl!Y216=\"\",\"\",Linkwahl!Y216)","v":"DesG"},{"$f":"IF(Linkwahl!AA216=\"\",\"\",Linkwahl!AA216)","v":"232.12"},{"$f":"IF(Linkwahl!AB216=\"\",\"\",Linkwahl!AB216)","v":"Designgesetz"}]
["SR-Link",{"$f":"IF(Linkwahl!Z217=\"\",\"\",Linkwahl!Z217)","v":"e"},{"$f":"IF(Linkwahl!Y217=\"\",\"\",Linkwahl!Y217)","v":"DSG"},{"$f":"IF(Linkwahl!AA217=\"\",\"\",Linkwahl!AA217)","v":235.1},{"$f":"IF(Linkwahl!AB217=\"\",\"\",Linkwahl!AB217)","v":"Datenschutzgesetz"}]
["SR-Link",{"$f":"IF(Linkwahl!Z218=\"\",\"\",Linkwahl!Z218)","v":"r"},{"$f":"IF(Linkwahl!Y218=\"\",\"\",Linkwahl!Y218)","v":"ECRMS"},{"$f":"IF(Linkwahl!AA218=\"\",\"\",Linkwahl!AA218)","v":"0.441.2"},{"$f":"IF(Linkwahl!AB218=\"\",\"\",Linkwahl!AB218)","v":"Europäische Charta der Regional- oder Minderheitensprachen"}]
["SR-Link",{"$f":"IF(Linkwahl!Z219=\"\",\"\",Linkwahl!Z219)","v":"e"},{"$f":"IF(Linkwahl!Y219=\"\",\"\",Linkwahl!Y219)","v":"EHB-V"},{"$f":"IF(Linkwahl!AA219=\"\",\"\",Linkwahl!AA219)","v":"412.106.1"},{"$f":"IF(Linkwahl!AB219=\"\",\"\",Linkwahl!AB219)","v":"Eidgenössische Hochschulinstitut für Berufsbildung, VO über das"}]
["SR-Link",{"$f":"IF(Linkwahl!Z220=\"\",\"\",Linkwahl!Z220)","v":""},{"$f":"IF(Linkwahl!Y220=\"\",\"\",Linkwahl!Y220)","v":"EHG"},{"$f":"IF(Linkwahl!AA220=\"\",\"\",Linkwahl!AA220)","v":"221.112.742"},{"$f":"IF(Linkwahl!AB220=\"\",\"\",Linkwahl!AB220)","v":" Haftpflicht der Eisenbahn- und Dampfschifffahrtsunternehmungen + der CH-Post.  BG über"}]
["SR-Link",{"$f":"IF(Linkwahl!Z221=\"\",\"\",Linkwahl!Z221)","v":""},{"$f":"IF(Linkwahl!Y221=\"\",\"\",Linkwahl!Y221)","v":"EigVV"},{"$f":"IF(Linkwahl!AA221=\"\",\"\",Linkwahl!AA221)","v":"211.413.1"},{"$f":"IF(Linkwahl!AB221=\"\",\"\",Linkwahl!AB221)","v":"Eintragung der Eigentumsvorbehalte, VO betreffend die "}]
["SR-Link",{"$f":"IF(Linkwahl!Z222=\"\",\"\",Linkwahl!Z222)","v":"e"},{"$f":"IF(Linkwahl!Y222=\"\",\"\",Linkwahl!Y222)","v":"ElDI-V"},{"$f":"IF(Linkwahl!AA222=\"\",\"\",Linkwahl!AA222)","v":"641.201.511"},{"$f":"IF(Linkwahl!AB222=\"\",\"\",Linkwahl!AB222)","v":"elektronische Daten und Informationen, Verordnung des EFD über "}]
["SR-Link",{"$f":"IF(Linkwahl!Z223=\"\",\"\",Linkwahl!Z223)","v":""},{"$f":"IF(Linkwahl!Y223=\"\",\"\",Linkwahl!Y223)","v":"EleG"},{"$f":"IF(Linkwahl!AA223=\"\",\"\",Linkwahl!AA223)","v":"734.0"},{"$f":"IF(Linkwahl!AB223=\"\",\"\",Linkwahl!AB223)","v":"Elektrizitätsgesetz"}]
["SR-Link",{"$f":"IF(Linkwahl!Z224=\"\",\"\",Linkwahl!Z224)","v":""},{"$f":"IF(Linkwahl!Y224=\"\",\"\",Linkwahl!Y224)","v":"ELG"},{"$f":"IF(Linkwahl!AA224=\"\",\"\",Linkwahl!AA224)","v":"831.30"},{"$f":"IF(Linkwahl!AB224=\"\",\"\",Linkwahl!AB224)","v":"Ergänzungsleistungen zur AHV, BG über "}]
["SR-Link",{"$f":"IF(Linkwahl!Z225=\"\",\"\",Linkwahl!Z225)","v":""},{"$f":"IF(Linkwahl!Y225=\"\",\"\",Linkwahl!Y225)","v":"ELV"},{"$f":"IF(Linkwahl!AA225=\"\",\"\",Linkwahl!AA225)","v":"831.301"},{"$f":"IF(Linkwahl!AB225=\"\",\"\",Linkwahl!AB225)","v":"Ergänzungsleistungen zur AHV, VO über "}]
["SR-Link",{"$f":"IF(Linkwahl!Z226=\"\",\"\",Linkwahl!Z226)","v":"e"},{"$f":"IF(Linkwahl!Y226=\"\",\"\",Linkwahl!Y226)","v":"EmbG"},{"$f":"IF(Linkwahl!AA226=\"\",\"\",Linkwahl!AA226)","v":"946.231"},{"$f":"IF(Linkwahl!AB226=\"\",\"\",Linkwahl!AB226)","v":"Embargogesetz"}]
["SR-Link",{"$f":"IF(Linkwahl!Z227=\"\",\"\",Linkwahl!Z227)","v":"e"},{"$f":"IF(Linkwahl!Y227=\"\",\"\",Linkwahl!Y227)","v":"EMKG"},{"$f":"IF(Linkwahl!AA227=\"\",\"\",Linkwahl!AA227)","v":"941.31"},{"$f":"IF(Linkwahl!AB227=\"\",\"\",Linkwahl!AB227)","v":"Edelmetallkontrollgesetz"}]
["SR-Link",{"$f":"IF(Linkwahl!Z228=\"\",\"\",Linkwahl!Z228)","v":"e"},{"$f":"IF(Linkwahl!Y228=\"\",\"\",Linkwahl!Y228)","v":"EMKV"},{"$f":"IF(Linkwahl!AA228=\"\",\"\",Linkwahl!AA228)","v":"941.311"},{"$f":"IF(Linkwahl!AB228=\"\",\"\",Linkwahl!AB228)","v":"Edelmetallkontrollverordnung"}]
["SR-Link",{"$f":"IF(Linkwahl!Z229=\"\",\"\",Linkwahl!Z229)","v":""},{"$f":"IF(Linkwahl!Y229=\"\",\"\",Linkwahl!Y229)","v":"EMRK"},{"$f":"IF(Linkwahl!AA229=\"\",\"\",Linkwahl!AA229)","v":"0.101"},{"$f":"IF(Linkwahl!AB229=\"\",\"\",Linkwahl!AB229)","v":"Schutz der Menschenrechte und Grundfreiheiten, Konvention zum "}]
["SR-Link",{"$f":"IF(Linkwahl!Z230=\"\",\"\",Linkwahl!Z230)","v":""},{"$f":"IF(Linkwahl!Y230=\"\",\"\",Linkwahl!Y230)","v":"EntG"},{"$f":"IF(Linkwahl!AA230=\"\",\"\",Linkwahl!AA230)","v":"711"},{"$f":"IF(Linkwahl!AB230=\"\",\"\",Linkwahl!AB230)","v":"Enteignungsgesetz"}]
["SR-Link",{"$f":"IF(Linkwahl!Z231=\"\",\"\",Linkwahl!Z231)","v":""},{"$f":"IF(Linkwahl!Y231=\"\",\"\",Linkwahl!Y231)","v":"EntsG"},{"$f":"IF(Linkwahl!AA231=\"\",\"\",Linkwahl!AA231)","v":"823.20"},{"$f":"IF(Linkwahl!AB231=\"\",\"\",Linkwahl!AB231)","v":"in die Schweiz entsandten Arbeitnehmerinnen und Arbeitnehmer, BG über die "}]
["SR-Link",{"$f":"IF(Linkwahl!Z232=\"\",\"\",Linkwahl!Z232)","v":""},{"$f":"IF(Linkwahl!Y232=\"\",\"\",Linkwahl!Y232)","v":"EntsV"},{"$f":"IF(Linkwahl!AA232=\"\",\"\",Linkwahl!AA232)","v":823.20100000000002},{"$f":"IF(Linkwahl!AB232=\"\",\"\",Linkwahl!AB232)","v":"in die Schweiz entsandten Arbeitnehmerinnen und Arbeitnehmer, VO über die "}]
["SR-Link",{"$f":"IF(Linkwahl!Z233=\"\",\"\",Linkwahl!Z233)","v":""},{"$f":"IF(Linkwahl!Y233=\"\",\"\",Linkwahl!Y233)","v":"EÖBV"},{"$f":"IF(Linkwahl!AA233=\"\",\"\",Linkwahl!AA233)","v":"943.033"},{"$f":"IF(Linkwahl!AB233=\"\",\"\",Linkwahl!AB233)","v":"elektronische öffentliche Beurkundung, VO über die"}]
["SR-Link",{"$f":"IF(Linkwahl!Z234=\"\",\"\",Linkwahl!Z234)","v":""},{"$f":"IF(Linkwahl!Y234=\"\",\"\",Linkwahl!Y234)","v":"EOG"},{"$f":"IF(Linkwahl!AA234=\"\",\"\",Linkwahl!AA234)","v":834.1},{"$f":"IF(Linkwahl!AB234=\"\",\"\",Linkwahl!AB234)","v":"Erwerbsersatzgesetz"}]
["SR-Link",{"$f":"IF(Linkwahl!Z235=\"\",\"\",Linkwahl!Z235)","v":""},{"$f":"IF(Linkwahl!Y235=\"\",\"\",Linkwahl!Y235)","v":"EOV"},{"$f":"IF(Linkwahl!AA235=\"\",\"\",Linkwahl!AA235)","v":834.11},{"$f":"IF(Linkwahl!AB235=\"\",\"\",Linkwahl!AB235)","v":"Erwerbsersatzgesetz, VO zum"}]
["SR-Link",{"$f":"IF(Linkwahl!Z236=\"\",\"\",Linkwahl!Z236)","v":""},{"$f":"IF(Linkwahl!Y236=\"\",\"\",Linkwahl!Y236)","v":"EpG"},{"$f":"IF(Linkwahl!AA236=\"\",\"\",Linkwahl!AA236)","v":"818.101"},{"$f":"IF(Linkwahl!AB236=\"\",\"\",Linkwahl!AB236)","v":"Epidemiegesetz"}]
["SR-Link",{"$f":"IF(Linkwahl!Z237=\"\",\"\",Linkwahl!Z237)","v":""},{"$f":"IF(Linkwahl!Y237=\"\",\"\",Linkwahl!Y237)","v":"ESV"},{"$f":"IF(Linkwahl!AA237=\"\",\"\",Linkwahl!AA237)","v":"814.912"},{"$f":"IF(Linkwahl!AB237=\"\",\"\",Linkwahl!AB237)","v":"Einschliessungsverordnung"}]
["SR-Link",{"$f":"IF(Linkwahl!Z238=\"\",\"\",Linkwahl!Z238)","v":"e"},{"$f":"IF(Linkwahl!Y238=\"\",\"\",Linkwahl!Y238)","v":"ETHG"},{"$f":"IF(Linkwahl!AA238=\"\",\"\",Linkwahl!AA238)","v":"414.110"},{"$f":"IF(Linkwahl!AB238=\"\",\"\",Linkwahl!AB238)","v":"Eidgenössischen Technischen Hochschulen, BG über die"}]
["SR-Link",{"$f":"IF(Linkwahl!Z239=\"\",\"\",Linkwahl!Z239)","v":""},{"$f":"IF(Linkwahl!Y239=\"\",\"\",Linkwahl!Y239)","v":"ExpaV"},{"$f":"IF(Linkwahl!AA239=\"\",\"\",Linkwahl!AA239)","v":"642.118.3"},{"$f":"IF(Linkwahl!AB239=\"\",\"\",Linkwahl!AB239)","v":"Expatriates-Verordnung"}]
["SR-Link",{"$f":"IF(Linkwahl!Z240=\"\",\"\",Linkwahl!Z240)","v":"r"},{"$f":"IF(Linkwahl!Y240=\"\",\"\",Linkwahl!Y240)","v":"FamZG"},{"$f":"IF(Linkwahl!AA240=\"\",\"\",Linkwahl!AA240)","v":836.2},{"$f":"IF(Linkwahl!AB240=\"\",\"\",Linkwahl!AB240)","v":"Familienzulagengesetz"}]
["SR-Link",{"$f":"IF(Linkwahl!Z241=\"\",\"\",Linkwahl!Z241)","v":""},{"$f":"IF(Linkwahl!Y241=\"\",\"\",Linkwahl!Y241)","v":"FamZV"},{"$f":"IF(Linkwahl!AA241=\"\",\"\",Linkwahl!AA241)","v":836.21},{"$f":"IF(Linkwahl!AB241=\"\",\"\",Linkwahl!AB241)","v":"Familienzulagenverordnung"}]
["SR-Link",{"$f":"IF(Linkwahl!Z242=\"\",\"\",Linkwahl!Z242)","v":"e"},{"$f":"IF(Linkwahl!Y242=\"\",\"\",Linkwahl!Y242)","v":"FAV"},{"$f":"IF(Linkwahl!AA242=\"\",\"\",Linkwahl!AA242)","v":"784.101.2"},{"$f":"IF(Linkwahl!AB242=\"\",\"\",Linkwahl!AB242)","v":"Fernmeldeanlagenverordnung"}]
["SR-Link",{"$f":"IF(Linkwahl!Z243=\"\",\"\",Linkwahl!Z243)","v":"e"},{"$f":"IF(Linkwahl!Y243=\"\",\"\",Linkwahl!Y243)","v":"FDV"},{"$f":"IF(Linkwahl!AA243=\"\",\"\",Linkwahl!AA243)","v":"784.101.1"},{"$f":"IF(Linkwahl!AB243=\"\",\"\",Linkwahl!AB243)","v":"Fernmeldediensteverordnung"}]
["SR-Link",{"$f":"IF(Linkwahl!Z244=\"\",\"\",Linkwahl!Z244)","v":""},{"$f":"IF(Linkwahl!Y244=\"\",\"\",Linkwahl!Y244)","v":"FHG"},{"$f":"IF(Linkwahl!AA244=\"\",\"\",Linkwahl!AA244)","v":"611.0"},{"$f":"IF(Linkwahl!AB244=\"\",\"\",Linkwahl!AB244)","v":"Finanzhaushaltgesetz"}]
["SR-Link",{"$f":"IF(Linkwahl!Z245=\"\",\"\",Linkwahl!Z245)","v":"e / r"},{"$f":"IF(Linkwahl!Y245=\"\",\"\",Linkwahl!Y245)","v":"FIFG"},{"$f":"IF(Linkwahl!AA245=\"\",\"\",Linkwahl!AA245)","v":"420.1"},{"$f":"IF(Linkwahl!AB245=\"\",\"\",Linkwahl!AB245)","v":"Förderung der Forschung und der Innovation, BG über die"}]
["SR-Link",{"$f":"IF(Linkwahl!Z246=\"\",\"\",Linkwahl!Z246)","v":"e"},{"$f":"IF(Linkwahl!Y246=\"\",\"\",Linkwahl!Y246)","v":"FiG"},{"$f":"IF(Linkwahl!AA246=\"\",\"\",Linkwahl!AA246)","v":"443.1"},{"$f":"IF(Linkwahl!AB246=\"\",\"\",Linkwahl!AB246)","v":"Filmgesetz"}]
["SR-Link",{"$f":"IF(Linkwahl!Z247=\"\",\"\",Linkwahl!Z247)","v":""},{"$f":"IF(Linkwahl!Y247=\"\",\"\",Linkwahl!Y247)","v":"FINMAG"},{"$f":"IF(Linkwahl!AA247=\"\",\"\",Linkwahl!AA247)","v":"956.1"},{"$f":"IF(Linkwahl!AB247=\"\",\"\",Linkwahl!AB247)","v":"Finanzmarktaufsichtsgesetz"}]
["SR-Link",{"$f":"IF(Linkwahl!Z248=\"\",\"\",Linkwahl!Z248)","v":""},{"$f":"IF(Linkwahl!Y248=\"\",\"\",Linkwahl!Y248)","v":"FLG"},{"$f":"IF(Linkwahl!AA248=\"\",\"\",Linkwahl!AA248)","v":"836.1"},{"$f":"IF(Linkwahl!AB248=\"\",\"\",Linkwahl!AB248)","v":"Familienzulagen Landwirtschaft"}]
["SR-Link",{"$f":"IF(Linkwahl!Z249=\"\",\"\",Linkwahl!Z249)","v":"e"},{"$f":"IF(Linkwahl!Y249=\"\",\"\",Linkwahl!Y249)","v":"FlühHG"},{"$f":"IF(Linkwahl!AA249=\"\",\"\",Linkwahl!AA249)","v":"371"},{"$f":"IF(Linkwahl!AB249=\"\",\"\",Linkwahl!AB249)","v":"Aufhebung von Strafurteilen gegen Flüchtlingshelfer zur Nazi-Zeit, BG über"}]
["SR-Link",{"$f":"IF(Linkwahl!Z250=\"\",\"\",Linkwahl!Z250)","v":"e"},{"$f":"IF(Linkwahl!Y250=\"\",\"\",Linkwahl!Y250)","v":"FMedG"},{"$f":"IF(Linkwahl!AA250=\"\",\"\",Linkwahl!AA250)","v":"810.11"},{"$f":"IF(Linkwahl!AB250=\"\",\"\",Linkwahl!AB250)","v":"Fortpflanzungsmedizingesetz"}]
["SR-Link",{"$f":"IF(Linkwahl!Z251=\"\",\"\",Linkwahl!Z251)","v":"e"},{"$f":"IF(Linkwahl!Y251=\"\",\"\",Linkwahl!Y251)","v":"FMedV"},{"$f":"IF(Linkwahl!AA251=\"\",\"\",Linkwahl!AA251)","v":"810.112.2"},{"$f":"IF(Linkwahl!AB251=\"\",\"\",Linkwahl!AB251)","v":"Fortpflanzungsmedizinverordnung"}]
["SR-Link",{"$f":"IF(Linkwahl!Z252=\"\",\"\",Linkwahl!Z252)","v":"e"},{"$f":"IF(Linkwahl!Y252=\"\",\"\",Linkwahl!Y252)","v":"FMG"},{"$f":"IF(Linkwahl!AA252=\"\",\"\",Linkwahl!AA252)","v":"784.10"},{"$f":"IF(Linkwahl!AB252=\"\",\"\",Linkwahl!AB252)","v":"Fernmeldegesetz"}]
["SR-Link",{"$f":"IF(Linkwahl!Z253=\"\",\"\",Linkwahl!Z253)","v":""},{"$f":"IF(Linkwahl!Y253=\"\",\"\",Linkwahl!Y253)","v":"FoK"},{"$f":"IF(Linkwahl!AA253=\"\",\"\",Linkwahl!AA253)","v":"0.105"},{"$f":"IF(Linkwahl!AB253=\"\",\"\",Linkwahl!AB253)","v":"UNO-Folterkonvention"}]
["SR-Link",{"$f":"IF(Linkwahl!Z254=\"\",\"\",Linkwahl!Z254)","v":"e"},{"$f":"IF(Linkwahl!Y254=\"\",\"\",Linkwahl!Y254)","v":"FrSV"},{"$f":"IF(Linkwahl!AA254=\"\",\"\",Linkwahl!AA254)","v":"814.911"},{"$f":"IF(Linkwahl!AB254=\"\",\"\",Linkwahl!AB254)","v":"Freisetzungsverordnung"}]
["SR-Link",{"$f":"IF(Linkwahl!Z255=\"\",\"\",Linkwahl!Z255)","v":""},{"$f":"IF(Linkwahl!Y255=\"\",\"\",Linkwahl!Y255)","v":"FusG"},{"$f":"IF(Linkwahl!AA255=\"\",\"\",Linkwahl!AA255)","v":221.30099999999999},{"$f":"IF(Linkwahl!AB255=\"\",\"\",Linkwahl!AB255)","v":"Fusionsgesetz"}]
["SR-Link",{"$f":"IF(Linkwahl!Z256=\"\",\"\",Linkwahl!Z256)","v":""},{"$f":"IF(Linkwahl!Y256=\"\",\"\",Linkwahl!Y256)","v":"FZA"},{"$f":"IF(Linkwahl!AA256=\"\",\"\",Linkwahl!AA256)","v":"0.142.112.681"},{"$f":"IF(Linkwahl!AB256=\"\",\"\",Linkwahl!AB256)","v":"Freizügigkeitsabkommen"}]
["SR-Link",{"$f":"IF(Linkwahl!Z257=\"\",\"\",Linkwahl!Z257)","v":""},{"$f":"IF(Linkwahl!Y257=\"\",\"\",Linkwahl!Y257)","v":"FZG"},{"$f":"IF(Linkwahl!AA257=\"\",\"\",Linkwahl!AA257)","v":831.42},{"$f":"IF(Linkwahl!AB257=\"\",\"\",Linkwahl!AB257)","v":"Freizügigkeitsgesetz"}]
["SR-Link",{"$f":"IF(Linkwahl!Z258=\"\",\"\",Linkwahl!Z258)","v":""},{"$f":"IF(Linkwahl!Y258=\"\",\"\",Linkwahl!Y258)","v":"FZV"},{"$f":"IF(Linkwahl!AA258=\"\",\"\",Linkwahl!AA258)","v":"831.425"},{"$f":"IF(Linkwahl!AB258=\"\",\"\",Linkwahl!AB258)","v":"Freizügigkeitsverordnung"}]
["SR-Link",{"$f":"IF(Linkwahl!Z259=\"\",\"\",Linkwahl!Z259)","v":""},{"$f":"IF(Linkwahl!Y259=\"\",\"\",Linkwahl!Y259)","v":"GBV"},{"$f":"IF(Linkwahl!AA259=\"\",\"\",Linkwahl!AA259)","v":"211.432.1"},{"$f":"IF(Linkwahl!AB259=\"\",\"\",Linkwahl!AB259)","v":"Grundbuchverordnung"}]
["SR-Link",{"$f":"IF(Linkwahl!Z260=\"\",\"\",Linkwahl!Z260)","v":""},{"$f":"IF(Linkwahl!Y260=\"\",\"\",Linkwahl!Y260)","v":"GeBüV"},{"$f":"IF(Linkwahl!AA260=\"\",\"\",Linkwahl!AA260)","v":"221.431"},{"$f":"IF(Linkwahl!AB260=\"\",\"\",Linkwahl!AB260)","v":"Geschäftsbücherverordnung"}]
["SR-Link",{"$f":"IF(Linkwahl!Z261=\"\",\"\",Linkwahl!Z261)","v":"e"},{"$f":"IF(Linkwahl!Y261=\"\",\"\",Linkwahl!Y261)","v":"GebV EMK"},{"$f":"IF(Linkwahl!AA261=\"\",\"\",Linkwahl!AA261)","v":"941.319"},{"$f":"IF(Linkwahl!AB261=\"\",\"\",Linkwahl!AB261)","v":"Gebührenverordnung Edelmetallkontrolle"}]
["SR-Link",{"$f":"IF(Linkwahl!Z262=\"\",\"\",Linkwahl!Z262)","v":""},{"$f":"IF(Linkwahl!Y262=\"\",\"\",Linkwahl!Y262)","v":"GebV HReg"},{"$f":"IF(Linkwahl!AA262=\"\",\"\",Linkwahl!AA262)","v":"221.411.1"},{"$f":"IF(Linkwahl!AB262=\"\",\"\",Linkwahl!AB262)","v":"Gebühren des Handelsregisters, VO über die "}]
[{"$f":"IF(D132=\"\",\"\",HYPERLINK(\"http://www.admin.ch/ch/d/sr/c\"&SUBSTITUTE(D132,\".\",\"_\")&\".html\",\"SR-Link\"))","v":"SR-Link"},{"$f":"IF(Linkwahl!Z263=\"\",\"\",Linkwahl!Z263)","v":""},{"$f":"IF(Linkwahl!Y263=\"\",\"\",Linkwahl!Y263)","v":"GebV SchKG"},{"$f":"IF(Linkwahl!AA263=\"\",\"\",Linkwahl!AA263)","v":281.35000000000002},{"$f":"IF(Linkwahl!AB263=\"\",\"\",Linkwahl!AB263)","v":"Gebührenverordnung Schuldbetreibung- und Konkursgesetz"}]
["SR-Link",{"$f":"IF(Linkwahl!Z264=\"\",\"\",Linkwahl!Z264)","v":""},{"$f":"IF(Linkwahl!Y264=\"\",\"\",Linkwahl!Y264)","v":"GebV-AuG"},{"$f":"IF(Linkwahl!AA264=\"\",\"\",Linkwahl!AA264)","v":"142.209"},{"$f":"IF(Linkwahl!AB264=\"\",\"\",Linkwahl!AB264)","v":"Gebührenverordnung Ausländergesetz"}]
["SR-Link",{"$f":"IF(Linkwahl!Z265=\"\",\"\",Linkwahl!Z265)","v":""},{"$f":"IF(Linkwahl!Y265=\"\",\"\",Linkwahl!Y265)","v":"GebV-AVG"},{"$f":"IF(Linkwahl!AA265=\"\",\"\",Linkwahl!AA265)","v":823.11300000000006},{"$f":"IF(Linkwahl!AB265=\"\",\"\",Linkwahl!AB265)","v":"Gebührenverordnung Arbeitsvermittlungsgesetz"}]
["SR-Link",{"$f":"IF(Linkwahl!Z266=\"\",\"\",Linkwahl!Z266)","v":"e"},{"$f":"IF(Linkwahl!Y266=\"\",\"\",Linkwahl!Y266)","v":"GebV-BüG"},{"$f":"IF(Linkwahl!AA266=\"\",\"\",Linkwahl!AA266)","v":"141.21"},{"$f":"IF(Linkwahl!AB266=\"\",\"\",Linkwahl!AB266)","v":" Gebühren zum Bürgerrechtsgesetz, VO über die"}]
["SR-Link",{"$f":"IF(Linkwahl!Z267=\"\",\"\",Linkwahl!Z267)","v":"e"},{"$f":"IF(Linkwahl!Y267=\"\",\"\",Linkwahl!Y267)","v":"GeoIG"},{"$f":"IF(Linkwahl!AA267=\"\",\"\",Linkwahl!AA267)","v":"510.62"},{"$f":"IF(Linkwahl!AB267=\"\",\"\",Linkwahl!AB267)","v":"Geoinformationsgesetz"}]
["SR-Link",{"$f":"IF(Linkwahl!Z268=\"\",\"\",Linkwahl!Z268)","v":""},{"$f":"IF(Linkwahl!Y268=\"\",\"\",Linkwahl!Y268)","v":"GeoIV"},{"$f":"IF(Linkwahl!AA268=\"\",\"\",Linkwahl!AA268)","v":"510.620"},{"$f":"IF(Linkwahl!AB268=\"\",\"\",Linkwahl!AB268)","v":"Geoinformationsverordnung"}]
["SR-Link",{"$f":"IF(Linkwahl!Z269=\"\",\"\",Linkwahl!Z269)","v":""},{"$f":"IF(Linkwahl!Y269=\"\",\"\",Linkwahl!Y269)","v":"GGUV"},{"$f":"IF(Linkwahl!AA269=\"\",\"\",Linkwahl!AA269)","v":"930.111.4"},{"$f":"IF(Linkwahl!AB269=\"\",\"\",Linkwahl!AB269)","v":"Gefahrgutumschliessungsverordnung"}]
["SR-Link",{"$f":"IF(Linkwahl!Z270=\"\",\"\",Linkwahl!Z270)","v":"e"},{"$f":"IF(Linkwahl!Y270=\"\",\"\",Linkwahl!Y270)","v":"GKG"},{"$f":"IF(Linkwahl!AA270=\"\",\"\",Linkwahl!AA270)","v":"946.202"},{"$f":"IF(Linkwahl!AB270=\"\",\"\",Linkwahl!AB270)","v":"Güterkontrollgesetz"}]
["SR-Link",{"$f":"IF(Linkwahl!Z271=\"\",\"\",Linkwahl!Z271)","v":"e / r"},{"$f":"IF(Linkwahl!Y271=\"\",\"\",Linkwahl!Y271)","v":"GlG"},{"$f":"IF(Linkwahl!AA271=\"\",\"\",Linkwahl!AA271)","v":151.1},{"$f":"IF(Linkwahl!AB271=\"\",\"\",Linkwahl!AB271)","v":"Gleichstellungsgesetz"}]
["SR-Link",{"$f":"IF(Linkwahl!Z272=\"\",\"\",Linkwahl!Z272)","v":"e"},{"$f":"IF(Linkwahl!Y272=\"\",\"\",Linkwahl!Y272)","v":"GLPV"},{"$f":"IF(Linkwahl!AA272=\"\",\"\",Linkwahl!AA272)","v":"813.112.1"},{"$f":"IF(Linkwahl!AB272=\"\",\"\",Linkwahl!AB272)","v":"Gute Laborpraxis, VO über die"}]
["SR-Link",{"$f":"IF(Linkwahl!Z273=\"\",\"\",Linkwahl!Z273)","v":"e"},{"$f":"IF(Linkwahl!Y273=\"\",\"\",Linkwahl!Y273)","v":"GRN"},{"$f":"IF(Linkwahl!AA273=\"\",\"\",Linkwahl!AA273)","v":"171.13"},{"$f":"IF(Linkwahl!AB273=\"\",\"\",Linkwahl!AB273)","v":"Geschäftsreglement des Nationalrates"}]
["SR-Link",{"$f":"IF(Linkwahl!Z274=\"\",\"\",Linkwahl!Z274)","v":"e"},{"$f":"IF(Linkwahl!Y274=\"\",\"\",Linkwahl!Y274)","v":"GRS"},{"$f":"IF(Linkwahl!AA274=\"\",\"\",Linkwahl!AA274)","v":"171.14"},{"$f":"IF(Linkwahl!AB274=\"\",\"\",Linkwahl!AB274)","v":"Geschäftsreglement des Ständerates"}]
["SR-Link",{"$f":"IF(Linkwahl!Z275=\"\",\"\",Linkwahl!Z275)","v":"e / r"},{"$f":"IF(Linkwahl!Y275=\"\",\"\",Linkwahl!Y275)","v":"GschG"},{"$f":"IF(Linkwahl!AA275=\"\",\"\",Linkwahl!AA275)","v":"814.20"},{"$f":"IF(Linkwahl!AB275=\"\",\"\",Linkwahl!AB275)","v":"Gewässerschutzgesetz"}]
["SR-Link",{"$f":"IF(Linkwahl!Z276=\"\",\"\",Linkwahl!Z276)","v":"e"},{"$f":"IF(Linkwahl!Y276=\"\",\"\",Linkwahl!Y276)","v":"GschV"},{"$f":"IF(Linkwahl!AA276=\"\",\"\",Linkwahl!AA276)","v":"814.201"},{"$f":"IF(Linkwahl!AB276=\"\",\"\",Linkwahl!AB276)","v":"Gewässerschutzverordnung"}]
["SR-Link",{"$f":"IF(Linkwahl!Z277=\"\",\"\",Linkwahl!Z277)","v":"e"},{"$f":"IF(Linkwahl!Y277=\"\",\"\",Linkwahl!Y277)","v":"GSG"},{"$f":"IF(Linkwahl!AA277=\"\",\"\",Linkwahl!AA277)","v":"192.12"},{"$f":"IF(Linkwahl!AB277=\"\",\"\",Linkwahl!AB277)","v":"Gaststaatgesetz"}]
["SR-Link",{"$f":"IF(Linkwahl!Z278=\"\",\"\",Linkwahl!Z278)","v":""},{"$f":"IF(Linkwahl!Y278=\"\",\"\",Linkwahl!Y278)","v":"GSV"},{"$f":"IF(Linkwahl!AA278=\"\",\"\",Linkwahl!AA278)","v":"935.521.21"},{"$f":"IF(Linkwahl!AB278=\"\",\"\",Linkwahl!AB278)","v":"Glücksspielverordnung"}]
["SR-Link",{"$f":"IF(Linkwahl!Z279=\"\",\"\",Linkwahl!Z279)","v":"e"},{"$f":"IF(Linkwahl!Y279=\"\",\"\",Linkwahl!Y279)","v":"GTG"},{"$f":"IF(Linkwahl!AA279=\"\",\"\",Linkwahl!AA279)","v":"814.91"},{"$f":"IF(Linkwahl!AB279=\"\",\"\",Linkwahl!AB279)","v":"Gentechnikgesetz"}]
["SR-Link",{"$f":"IF(Linkwahl!Z280=\"\",\"\",Linkwahl!Z280)","v":"e"},{"$f":"IF(Linkwahl!Y280=\"\",\"\",Linkwahl!Y280)","v":"GUB/GGA-KV"},{"$f":"IF(Linkwahl!AA280=\"\",\"\",Linkwahl!AA280)","v":"910.124"},{"$f":"IF(Linkwahl!AB280=\"\",\"\",Linkwahl!AB280)","v":"Mindestanforderungen Kontrolle Ursprungsbezeichnungen und geografischen Angaben, VO über"}]
["SR-Link",{"$f":"IF(Linkwahl!Z281=\"\",\"\",Linkwahl!Z281)","v":"e"},{"$f":"IF(Linkwahl!Y281=\"\",\"\",Linkwahl!Y281)","v":"GUB/GGA-V"},{"$f":"IF(Linkwahl!AA281=\"\",\"\",Linkwahl!AA281)","v":"910.12"},{"$f":"IF(Linkwahl!AB281=\"\",\"\",Linkwahl!AB281)","v":"Ursprungsbezeichnungen und geographischen Angaben, landwirtschaftliche, VO über"}]
["SR-Link",{"$f":"IF(Linkwahl!Z282=\"\",\"\",Linkwahl!Z282)","v":"e"},{"$f":"IF(Linkwahl!Y282=\"\",\"\",Linkwahl!Y282)","v":"GUMG"},{"$f":"IF(Linkwahl!AA282=\"\",\"\",Linkwahl!AA282)","v":"810.12"},{"$f":"IF(Linkwahl!AB282=\"\",\"\",Linkwahl!AB282)","v":"genetische Untersuchungen beim Menschen, BG über"}]
["SR-Link",{"$f":"IF(Linkwahl!Z283=\"\",\"\",Linkwahl!Z283)","v":""},{"$f":"IF(Linkwahl!Y283=\"\",\"\",Linkwahl!Y283)","v":"GVG"},{"$f":"IF(Linkwahl!AA283=\"\",\"\",Linkwahl!AA283)","v":"171.11"},{"$f":"IF(Linkwahl!AB283=\"\",\"\",Linkwahl!AB283)","v":"Geschäftsverkehrsgesetz"}]
["SR-Link",{"$f":"IF(Linkwahl!Z284=\"\",\"\",Linkwahl!Z284)","v":"e"},{"$f":"IF(Linkwahl!Y284=\"\",\"\",Linkwahl!Y284)","v":"GwG"},{"$f":"IF(Linkwahl!AA284=\"\",\"\",Linkwahl!AA284)","v":"955.0"},{"$f":"IF(Linkwahl!AB284=\"\",\"\",Linkwahl!AB284)","v":"Geldwäschereigesetz"}]
["SR-Link",{"$f":"IF(Linkwahl!Z285=\"\",\"\",Linkwahl!Z285)","v":""},{"$f":"IF(Linkwahl!Y285=\"\",\"\",Linkwahl!Y285)","v":"HArG"},{"$f":"IF(Linkwahl!AA285=\"\",\"\",Linkwahl!AA285)","v":822.31},{"$f":"IF(Linkwahl!AB285=\"\",\"\",Linkwahl!AB285)","v":"Heimarbeitsgesetz"}]
["SR-Link",{"$f":"IF(Linkwahl!Z286=\"\",\"\",Linkwahl!Z286)","v":"e"},{"$f":"IF(Linkwahl!Y286=\"\",\"\",Linkwahl!Y286)","v":"HDekl EVD"},{"$f":"IF(Linkwahl!AA286=\"\",\"\",Linkwahl!AA286)","v":" 944.021.1"},{"$f":"IF(Linkwahl!AB286=\"\",\"\",Linkwahl!AB286)","v":"Deklaration von Holz und Holzprodukten, EVD-VO über die"}]
["SR-Link",{"$f":"IF(Linkwahl!Z287=\"\",\"\",Linkwahl!Z287)","v":""},{"$f":"IF(Linkwahl!Y287=\"\",\"\",Linkwahl!Y287)","v":"HEntfÜ"},{"$f":"IF(Linkwahl!AA287=\"\",\"\",Linkwahl!AA287)","v":"0.211.230.02"},{"$f":"IF(Linkwahl!AB287=\"\",\"\",Linkwahl!AB287)","v":"Übereinkommen über die zivilrechtlichen Aspekte internationaler Kindesentführung"}]
["SR-Link",{"$f":"IF(Linkwahl!Z288=\"\",\"\",Linkwahl!Z288)","v":"e"},{"$f":"IF(Linkwahl!Y288=\"\",\"\",Linkwahl!Y288)","v":"HFG"},{"$f":"IF(Linkwahl!AA288=\"\",\"\",Linkwahl!AA288)","v":"810.30"},{"$f":"IF(Linkwahl!AB288=\"\",\"\",Linkwahl!AB288)","v":"Humanforschungsgesetz"}]
["SR-Link",{"$f":"IF(Linkwahl!Z289=\"\",\"\",Linkwahl!Z289)","v":"e"},{"$f":"IF(Linkwahl!Y289=\"\",\"\",Linkwahl!Y289)","v":"HFV"},{"$f":"IF(Linkwahl!AA289=\"\",\"\",Linkwahl!AA289)","v":"810.301"},{"$f":"IF(Linkwahl!AB289=\"\",\"\",Linkwahl!AB289)","v":"HumanforschungsVO"}]
["SR-Link",{"$f":"IF(Linkwahl!Z290=\"\",\"\",Linkwahl!Z290)","v":"e"},{"$f":"IF(Linkwahl!Y290=\"\",\"\",Linkwahl!Y290)","v":"HMG"},{"$f":"IF(Linkwahl!AA290=\"\",\"\",Linkwahl!AA290)","v":"812.21"},{"$f":"IF(Linkwahl!AB290=\"\",\"\",Linkwahl!AB290)","v":"Heilmittelgesetz"}]
["SR-Link",{"$f":"IF(Linkwahl!Z291=\"\",\"\",Linkwahl!Z291)","v":""},{"$f":"IF(Linkwahl!Y291=\"\",\"\",Linkwahl!Y291)","v":"HRegV"},{"$f":"IF(Linkwahl!AA291=\"\",\"\",Linkwahl!AA291)","v":221.411},{"$f":"IF(Linkwahl!AB291=\"\",\"\",Linkwahl!AB291)","v":"Handelsregisterverordnung"}]
["SR-Link",{"$f":"IF(Linkwahl!Z292=\"\",\"\",Linkwahl!Z292)","v":""},{"$f":"IF(Linkwahl!Y292=\"\",\"\",Linkwahl!Y292)","v":"HRG"},{"$f":"IF(Linkwahl!AA292=\"\",\"\",Linkwahl!AA292)","v":"943.1"},{"$f":"IF(Linkwahl!AB292=\"\",\"\",Linkwahl!AB292)","v":"Gewerbe der Reisenden, BG über das (Handelsreisendengesetz)"}]
["SR-Link",{"$f":"IF(Linkwahl!Z293=\"\",\"\",Linkwahl!Z293)","v":""},{"$f":"IF(Linkwahl!Y293=\"\",\"\",Linkwahl!Y293)","v":"HVA"},{"$f":"IF(Linkwahl!AA293=\"\",\"\",Linkwahl!AA293)","v":"831.135.1"},{"$f":"IF(Linkwahl!AB293=\"\",\"\",Linkwahl!AB293)","v":"Hilfsmittelverordnung AV"}]
["SR-Link",{"$f":"IF(Linkwahl!Z294=\"\",\"\",Linkwahl!Z294)","v":""},{"$f":"IF(Linkwahl!Y294=\"\",\"\",Linkwahl!Y294)","v":"HVI "},{"$f":"IF(Linkwahl!AA294=\"\",\"\",Linkwahl!AA294)","v":"831.232.51"},{"$f":"IF(Linkwahl!AB294=\"\",\"\",Linkwahl!AB294)","v":"Hilfsmittelverordnung IV"}]
["SR-Link",{"$f":"IF(Linkwahl!Z295=\"\",\"\",Linkwahl!Z295)","v":""},{"$f":"IF(Linkwahl!Y295=\"\",\"\",Linkwahl!Y295)","v":"HVUV"},{"$f":"IF(Linkwahl!AA295=\"\",\"\",Linkwahl!AA295)","v":"832.205.12"},{"$f":"IF(Linkwahl!AB295=\"\",\"\",Linkwahl!AB295)","v":"Hilfsmittelverordnung UV"}]
["SR-Link",{"$f":"IF(Linkwahl!Z296=\"\",\"\",Linkwahl!Z296)","v":""},{"$f":"IF(Linkwahl!Y296=\"\",\"\",Linkwahl!Y296)","v":"IPRG"},{"$f":"IF(Linkwahl!AA296=\"\",\"\",Linkwahl!AA296)","v":291},{"$f":"IF(Linkwahl!AB296=\"\",\"\",Linkwahl!AB296)","v":"Internationale Privatrecht, BG über das "}]
["SR-Link",{"$f":"IF(Linkwahl!Z297=\"\",\"\",Linkwahl!Z297)","v":"e / r"},{"$f":"IF(Linkwahl!Y297=\"\",\"\",Linkwahl!Y297)","v":"IQG"},{"$f":"IF(Linkwahl!AA297=\"\",\"\",Linkwahl!AA297)","v":"672.4"},{"$f":"IF(Linkwahl!AB297=\"\",\"\",Linkwahl!AB297)","v":" internationale Quellenbesteuerung, BG über die"}]
["SR-Link",{"$f":"IF(Linkwahl!Z298=\"\",\"\",Linkwahl!Z298)","v":"e"},{"$f":"IF(Linkwahl!Y298=\"\",\"\",Linkwahl!Y298)","v":"IRSG"},{"$f":"IF(Linkwahl!AA298=\"\",\"\",Linkwahl!AA298)","v":"351.1"},{"$f":"IF(Linkwahl!AB298=\"\",\"\",Linkwahl!AB298)","v":"Rechtshilfegesetz, BG über Rechtshilfe in internationalen Strafsachen"}]
["SR-Link",{"$f":"IF(Linkwahl!Z299=\"\",\"\",Linkwahl!Z299)","v":""},{"$f":"IF(Linkwahl!Y299=\"\",\"\",Linkwahl!Y299)","v":"IRSV"},{"$f":"IF(Linkwahl!AA299=\"\",\"\",Linkwahl!AA299)","v":"351.11"},{"$f":"IF(Linkwahl!AB299=\"\",\"\",Linkwahl!AB299)","v":"Rechtshilfeverordnung, VO über Rechtshilfe in internationalen Strafsachen"}]
["SR-Link",{"$f":"IF(Linkwahl!Z300=\"\",\"\",Linkwahl!Z300)","v":"e"},{"$f":"IF(Linkwahl!Y300=\"\",\"\",Linkwahl!Y300)","v":"ISchV"},{"$f":"IF(Linkwahl!AA300=\"\",\"\",Linkwahl!AA300)","v":"510.411"},{"$f":"IF(Linkwahl!AB300=\"\",\"\",Linkwahl!AB300)","v":"Informationsschutzverordnung"}]
["SR-Link",{"$f":"IF(Linkwahl!Z301=\"\",\"\",Linkwahl!Z301)","v":""},{"$f":"IF(Linkwahl!Y301=\"\",\"\",Linkwahl!Y301)","v":"IVG"},{"$f":"IF(Linkwahl!AA301=\"\",\"\",Linkwahl!AA301)","v":"831.20"},{"$f":"IF(Linkwahl!AB301=\"\",\"\",Linkwahl!AB301)","v":"Invalidenversicherungsgesetz"}]
["SR-Link",{"$f":"IF(Linkwahl!Z302=\"\",\"\",Linkwahl!Z302)","v":""},{"$f":"IF(Linkwahl!Y302=\"\",\"\",Linkwahl!Y302)","v":"IVV"},{"$f":"IF(Linkwahl!AA302=\"\",\"\",Linkwahl!AA302)","v":831.20100000000002},{"$f":"IF(Linkwahl!AB302=\"\",\"\",Linkwahl!AB302)","v":"Invalidenversicherungsverordnung"}]
["SR-Link",{"$f":"IF(Linkwahl!Z303=\"\",\"\",Linkwahl!Z303)","v":""},{"$f":"IF(Linkwahl!Y303=\"\",\"\",Linkwahl!Y303)","v":"JStG"},{"$f":"IF(Linkwahl!AA303=\"\",\"\",Linkwahl!AA303)","v":311.10000000000002},{"$f":"IF(Linkwahl!AB303=\"\",\"\",Linkwahl!AB303)","v":"Jugendstrafgesetz"}]
["SR-Link",{"$f":"IF(Linkwahl!Z304=\"\",\"\",Linkwahl!Z304)","v":""},{"$f":"IF(Linkwahl!Y304=\"\",\"\",Linkwahl!Y304)","v":"KAG"},{"$f":"IF(Linkwahl!AA304=\"\",\"\",Linkwahl!AA304)","v":"951.31"},{"$f":"IF(Linkwahl!AB304=\"\",\"\",Linkwahl!AB304)","v":"Kollektivanlagengesetz"}]
["SR-Link",{"$f":"IF(Linkwahl!Z305=\"\",\"\",Linkwahl!Z305)","v":"e"},{"$f":"IF(Linkwahl!Y305=\"\",\"\",Linkwahl!Y305)","v":"KEG"},{"$f":"IF(Linkwahl!AA305=\"\",\"\",Linkwahl!AA305)","v":"732.1"},{"$f":"IF(Linkwahl!AB305=\"\",\"\",Linkwahl!AB305)","v":"Kernenergiegesetz"}]
["SR-Link",{"$f":"IF(Linkwahl!Z306=\"\",\"\",Linkwahl!Z306)","v":"e"},{"$f":"IF(Linkwahl!Y306=\"\",\"\",Linkwahl!Y306)","v":"KEV"},{"$f":"IF(Linkwahl!AA306=\"\",\"\",Linkwahl!AA306)","v":"732.11"},{"$f":"IF(Linkwahl!AB306=\"\",\"\",Linkwahl!AB306)","v":"Kernenergieverordnung"}]
["SR-Link",{"$f":"IF(Linkwahl!Z307=\"\",\"\",Linkwahl!Z307)","v":"r"},{"$f":"IF(Linkwahl!Y307=\"\",\"\",Linkwahl!Y307)","v":"KFG"},{"$f":"IF(Linkwahl!AA307=\"\",\"\",Linkwahl!AA307)","v":"442.1"},{"$f":"IF(Linkwahl!AB307=\"\",\"\",Linkwahl!AB307)","v":"Kulturförderungsgesetz"}]
["SR-Link",{"$f":"IF(Linkwahl!Z308=\"\",\"\",Linkwahl!Z308)","v":"r"},{"$f":"IF(Linkwahl!Y308=\"\",\"\",Linkwahl!Y308)","v":"KFV"},{"$f":"IF(Linkwahl!AA308=\"\",\"\",Linkwahl!AA308)","v":"442.11"},{"$f":"IF(Linkwahl!AB308=\"\",\"\",Linkwahl!AB308)","v":"Kulturförderungverordnung"}]
["SR-Link",{"$f":"IF(Linkwahl!Z309=\"\",\"\",Linkwahl!Z309)","v":"e"},{"$f":"IF(Linkwahl!Y309=\"\",\"\",Linkwahl!Y309)","v":"KG"},{"$f":"IF(Linkwahl!AA309=\"\",\"\",Linkwahl!AA309)","v":251},{"$f":"IF(Linkwahl!AB309=\"\",\"\",Linkwahl!AB309)","v":"Kartellgesetz"}]
["SR-Link",{"$f":"IF(Linkwahl!Z310=\"\",\"\",Linkwahl!Z310)","v":""},{"$f":"IF(Linkwahl!Y310=\"\",\"\",Linkwahl!Y310)","v":"KKG"},{"$f":"IF(Linkwahl!AA310=\"\",\"\",Linkwahl!AA310)","v":"221.214.1"},{"$f":"IF(Linkwahl!AB310=\"\",\"\",Linkwahl!AB310)","v":"Konsumkreditgesetz"}]
["SR-Link",{"$f":"IF(Linkwahl!Z311=\"\",\"\",Linkwahl!Z311)","v":"e"},{"$f":"IF(Linkwahl!Y311=\"\",\"\",Linkwahl!Y311)","v":"KlinV"},{"$f":"IF(Linkwahl!AA311=\"\",\"\",Linkwahl!AA311)","v":"810.305"},{"$f":"IF(Linkwahl!AB311=\"\",\"\",Linkwahl!AB311)","v":"klinische Versuche, VO über"}]
["SR-Link",{"$f":"IF(Linkwahl!Z312=\"\",\"\",Linkwahl!Z312)","v":"e"},{"$f":"IF(Linkwahl!Y312=\"\",\"\",Linkwahl!Y312)","v":"KMG"},{"$f":"IF(Linkwahl!AA312=\"\",\"\",Linkwahl!AA312)","v":"514.51"},{"$f":"IF(Linkwahl!AB312=\"\",\"\",Linkwahl!AB312)","v":"Kriegsmaterialgesetz"}]
["SR-Link",{"$f":"IF(Linkwahl!Z313=\"\",\"\",Linkwahl!Z313)","v":"e"},{"$f":"IF(Linkwahl!Y313=\"\",\"\",Linkwahl!Y313)","v":"KMV"},{"$f":"IF(Linkwahl!AA313=\"\",\"\",Linkwahl!AA313)","v":"514.511"},{"$f":"IF(Linkwahl!AB313=\"\",\"\",Linkwahl!AB313)","v":"Kriegsmaterialverordnung"}]
["SR-Link",{"$f":"IF(Linkwahl!Z314=\"\",\"\",Linkwahl!Z314)","v":""},{"$f":"IF(Linkwahl!Y314=\"\",\"\",Linkwahl!Y314)","v":"KOV"},{"$f":"IF(Linkwahl!AA314=\"\",\"\",Linkwahl!AA314)","v":281.32},{"$f":"IF(Linkwahl!AB314=\"\",\"\",Linkwahl!AB314)","v":"Geschäftsführung der Konkursämter, VO Bundesgericht über die "}]
["SR-Link",{"$f":"IF(Linkwahl!Z315=\"\",\"\",Linkwahl!Z315)","v":"r"},{"$f":"IF(Linkwahl!Y315=\"\",\"\",Linkwahl!Y315)","v":"KV GR"},{"$f":"IF(Linkwahl!AA315=\"\",\"\",Linkwahl!AA315)","v":"131.226"},{"$f":"IF(Linkwahl!AB315=\"\",\"\",Linkwahl!AB315)","v":"Kantonsverfassung Graubünden"}]
["SR-Link",{"$f":"IF(Linkwahl!Z316=\"\",\"\",Linkwahl!Z316)","v":""},{"$f":"IF(Linkwahl!Y316=\"\",\"\",Linkwahl!Y316)","v":"KV ZH"},{"$f":"IF(Linkwahl!AA316=\"\",\"\",Linkwahl!AA316)","v":131.21100000000001},{"$f":"IF(Linkwahl!AB316=\"\",\"\",Linkwahl!AB316)","v":"Kantonsverfassung Zürich"}]
["SR-Link",{"$f":"IF(Linkwahl!Z317=\"\",\"\",Linkwahl!Z317)","v":""},{"$f":"IF(Linkwahl!Y317=\"\",\"\",Linkwahl!Y317)","v":"KVG"},{"$f":"IF(Linkwahl!AA317=\"\",\"\",Linkwahl!AA317)","v":"832.10"},{"$f":"IF(Linkwahl!AB317=\"\",\"\",Linkwahl!AB317)","v":"Krankenversicherungsgesetz"}]
["SR-Link",{"$f":"IF(Linkwahl!Z318=\"\",\"\",Linkwahl!Z318)","v":""},{"$f":"IF(Linkwahl!Y318=\"\",\"\",Linkwahl!Y318)","v":"KVV"},{"$f":"IF(Linkwahl!AA318=\"\",\"\",Linkwahl!AA318)","v":832.10199999999998},{"$f":"IF(Linkwahl!AB318=\"\",\"\",Linkwahl!AB318)","v":"Krankenversicherungsverordnung"}]
["SR-Link",{"$f":"IF(Linkwahl!Z319=\"\",\"\",Linkwahl!Z319)","v":""},{"$f":"IF(Linkwahl!Y319=\"\",\"\",Linkwahl!Y319)","v":"LFG"},{"$f":"IF(Linkwahl!AA319=\"\",\"\",Linkwahl!AA319)","v":"748.0"},{"$f":"IF(Linkwahl!AB319=\"\",\"\",Linkwahl!AB319)","v":"Luftfahrtgesetz"}]
["SR-Link",{"$f":"IF(Linkwahl!Z320=\"\",\"\",Linkwahl!Z320)","v":""},{"$f":"IF(Linkwahl!Y320=\"\",\"\",Linkwahl!Y320)","v":"LFV"},{"$f":"IF(Linkwahl!AA320=\"\",\"\",Linkwahl!AA320)","v":"748.01"},{"$f":"IF(Linkwahl!AB320=\"\",\"\",Linkwahl!AB320)","v":"Luftfahrtverordung"}]
["SR-Link",{"$f":"IF(Linkwahl!Z321=\"\",\"\",Linkwahl!Z321)","v":""},{"$f":"IF(Linkwahl!Y321=\"\",\"\",Linkwahl!Y321)","v":"LG"},{"$f":"IF(Linkwahl!AA321=\"\",\"\",Linkwahl!AA321)","v":"935.51"},{"$f":"IF(Linkwahl!AB321=\"\",\"\",Linkwahl!AB321)","v":"Lotteriegesetz"}]
["SR-Link",{"$f":"IF(Linkwahl!Z322=\"\",\"\",Linkwahl!Z322)","v":""},{"$f":"IF(Linkwahl!Y322=\"\",\"\",Linkwahl!Y322)","v":"LGV"},{"$f":"IF(Linkwahl!AA322=\"\",\"\",Linkwahl!AA322)","v":"817.02"},{"$f":"IF(Linkwahl!AB322=\"\",\"\",Linkwahl!AB322)","v":"Lebensmittel- und Gebrauchsgegenständeverordnung"}]
["SR-Link",{"$f":"IF(Linkwahl!Z323=\"\",\"\",Linkwahl!Z323)","v":"e"},{"$f":"IF(Linkwahl!Y323=\"\",\"\",Linkwahl!Y323)","v":"LMG"},{"$f":"IF(Linkwahl!AA323=\"\",\"\",Linkwahl!AA323)","v":"817.0"},{"$f":"IF(Linkwahl!AB323=\"\",\"\",Linkwahl!AB323)","v":"Lebensmittelgesetz"}]
["SR-Link",{"$f":"IF(Linkwahl!Z324=\"\",\"\",Linkwahl!Z324)","v":"e"},{"$f":"IF(Linkwahl!Y324=\"\",\"\",Linkwahl!Y324)","v":"LRV"},{"$f":"IF(Linkwahl!AA324=\"\",\"\",Linkwahl!AA324)","v":"814.318.142.1"},{"$f":"IF(Linkwahl!AB324=\"\",\"\",Linkwahl!AB324)","v":"Luftreinhalte-Verordnung"}]
["SR-Link",{"$f":"IF(Linkwahl!Z325=\"\",\"\",Linkwahl!Z325)","v":"e"},{"$f":"IF(Linkwahl!Y325=\"\",\"\",Linkwahl!Y325)","v":"LSV"},{"$f":"IF(Linkwahl!AA325=\"\",\"\",Linkwahl!AA325)","v":"814.41"},{"$f":"IF(Linkwahl!AB325=\"\",\"\",Linkwahl!AB325)","v":"Lärmschutz-Verordnung"}]
["SR-Link",{"$f":"IF(Linkwahl!Z326=\"\",\"\",Linkwahl!Z326)","v":""},{"$f":"IF(Linkwahl!Y326=\"\",\"\",Linkwahl!Y326)","v":"LugÜ"},{"$f":"IF(Linkwahl!AA326=\"\",\"\",Linkwahl!AA326)","v":"0.275.12"},{"$f":"IF(Linkwahl!AB326=\"\",\"\",Linkwahl!AB326)","v":"Lugano-Übereinkommen 2007"}]
[{"$f":"IF(D196=\"\",\"\",HYPERLINK(\"http://www.admin.ch/ch/d/sr/c\"&SUBSTITUTE(D196,\".\",\"_\")&\".html\",\"SR-Link\"))","v":"SR-Link"},{"$f":"IF(Linkwahl!Z327=\"\",\"\",Linkwahl!Z327)","v":""},{"$f":"IF(Linkwahl!Y327=\"\",\"\",Linkwahl!Y327)","v":"LV"},{"$f":"IF(Linkwahl!AA327=\"\",\"\",Linkwahl!AA327)","v":"935.511"},{"$f":"IF(Linkwahl!AB327=\"\",\"\",Linkwahl!AB327)","v":"Lotterieverordnung"}]
["SR-Link",{"$f":"IF(Linkwahl!Z328=\"\",\"\",Linkwahl!Z328)","v":"e"},{"$f":"IF(Linkwahl!Y328=\"\",\"\",Linkwahl!Y328)","v":"LVG"},{"$f":"IF(Linkwahl!AA328=\"\",\"\",Linkwahl!AA328)","v":"531"},{"$f":"IF(Linkwahl!AB328=\"\",\"\",Linkwahl!AB328)","v":"Landesversorungsgesetz"}]
["SR-Link",{"$f":"IF(Linkwahl!Z329=\"\",\"\",Linkwahl!Z329)","v":"r"},{"$f":"IF(Linkwahl!Y329=\"\",\"\",Linkwahl!Y329)","v":"LwG"},{"$f":"IF(Linkwahl!AA329=\"\",\"\",Linkwahl!AA329)","v":"910.1"},{"$f":"IF(Linkwahl!AB329=\"\",\"\",Linkwahl!AB329)","v":"Landwirtschaftsgesetz"}]
["SR-Link",{"$f":"IF(Linkwahl!Z330=\"\",\"\",Linkwahl!Z330)","v":""},{"$f":"IF(Linkwahl!Y330=\"\",\"\",Linkwahl!Y330)","v":"MaLV"},{"$f":"IF(Linkwahl!AA330=\"\",\"\",Linkwahl!AA330)","v":"814.412.2"},{"$f":"IF(Linkwahl!AB330=\"\",\"\",Linkwahl!AB330)","v":"Maschinenlärmverordnung"}]
["SR-Link",{"$f":"IF(Linkwahl!Z331=\"\",\"\",Linkwahl!Z331)","v":""},{"$f":"IF(Linkwahl!Y331=\"\",\"\",Linkwahl!Y331)","v":"MedBG"},{"$f":"IF(Linkwahl!AA331=\"\",\"\",Linkwahl!AA331)","v":"811.11"},{"$f":"IF(Linkwahl!AB331=\"\",\"\",Linkwahl!AB331)","v":"Medizinalberufegesetz"}]
["SR-Link",{"$f":"IF(Linkwahl!Z332=\"\",\"\",Linkwahl!Z332)","v":""},{"$f":"IF(Linkwahl!Y332=\"\",\"\",Linkwahl!Y332)","v":"MedBV"},{"$f":"IF(Linkwahl!AA332=\"\",\"\",Linkwahl!AA332)","v":"811.112.0"},{"$f":"IF(Linkwahl!AB332=\"\",\"\",Linkwahl!AB332)","v":"Medizinalberufeverordnung"}]
["SR-Link",{"$f":"IF(Linkwahl!Z333=\"\",\"\",Linkwahl!Z333)","v":"e"},{"$f":"IF(Linkwahl!Y333=\"\",\"\",Linkwahl!Y333)","v":"MepV"},{"$f":"IF(Linkwahl!AA333=\"\",\"\",Linkwahl!AA333)","v":"812.213"},{"$f":"IF(Linkwahl!AB333=\"\",\"\",Linkwahl!AB333)","v":"Medizinprodukteverordnung"}]
["SR-Link",{"$f":"IF(Linkwahl!Z334=\"\",\"\",Linkwahl!Z334)","v":""},{"$f":"IF(Linkwahl!Y334=\"\",\"\",Linkwahl!Y334)","v":"MitwG"},{"$f":"IF(Linkwahl!AA334=\"\",\"\",Linkwahl!AA334)","v":822.14},{"$f":"IF(Linkwahl!AB334=\"\",\"\",Linkwahl!AB334)","v":"Mitwirkungsgesetz"}]
["SR-Link",{"$f":"IF(Linkwahl!Z335=\"\",\"\",Linkwahl!Z335)","v":"e"},{"$f":"IF(Linkwahl!Y335=\"\",\"\",Linkwahl!Y335)","v":"MSchG"},{"$f":"IF(Linkwahl!AA335=\"\",\"\",Linkwahl!AA335)","v":"232.11"},{"$f":"IF(Linkwahl!AB335=\"\",\"\",Linkwahl!AB335)","v":"Markenschutzgesetz"}]
["SR-Link",{"$f":"IF(Linkwahl!Z336=\"\",\"\",Linkwahl!Z336)","v":""},{"$f":"IF(Linkwahl!Y336=\"\",\"\",Linkwahl!Y336)","v":"MSchV"},{"$f":"IF(Linkwahl!AA336=\"\",\"\",Linkwahl!AA336)","v":"232.111"},{"$f":"IF(Linkwahl!AB336=\"\",\"\",Linkwahl!AB336)","v":"Markenschutzverordnung"}]
["SR-Link",{"$f":"IF(Linkwahl!Z337=\"\",\"\",Linkwahl!Z337)","v":""},{"$f":"IF(Linkwahl!Y337=\"\",\"\",Linkwahl!Y337)","v":"MStG"},{"$f":"IF(Linkwahl!AA337=\"\",\"\",Linkwahl!AA337)","v":"321.0"},{"$f":"IF(Linkwahl!AB337=\"\",\"\",Linkwahl!AB337)","v":"Militärstrafgesetz"}]
["SR-Link",{"$f":"IF(Linkwahl!Z338=\"\",\"\",Linkwahl!Z338)","v":""},{"$f":"IF(Linkwahl!Y338=\"\",\"\",Linkwahl!Y338)","v":"MStP"},{"$f":"IF(Linkwahl!AA338=\"\",\"\",Linkwahl!AA338)","v":"322.1"},{"$f":"IF(Linkwahl!AB338=\"\",\"\",Linkwahl!AB338)","v":"Militärstrafprozess"}]
["SR-Link",{"$f":"IF(Linkwahl!Z339=\"\",\"\",Linkwahl!Z339)","v":""},{"$f":"IF(Linkwahl!Y339=\"\",\"\",Linkwahl!Y339)","v":"MStV"},{"$f":"IF(Linkwahl!AA339=\"\",\"\",Linkwahl!AA339)","v":"322.2"},{"$f":"IF(Linkwahl!AB339=\"\",\"\",Linkwahl!AB339)","v":"Militärstrafrechtspflege, VO über die "}]
["SR-Link",{"$f":"IF(Linkwahl!Z340=\"\",\"\",Linkwahl!Z340)","v":""},{"$f":"IF(Linkwahl!Y340=\"\",\"\",Linkwahl!Y340)","v":"MVG"},{"$f":"IF(Linkwahl!AA340=\"\",\"\",Linkwahl!AA340)","v":"833.1"},{"$f":"IF(Linkwahl!AB340=\"\",\"\",Linkwahl!AB340)","v":"Militärversicherungsgesetz"}]
["SR-Link",{"$f":"IF(Linkwahl!Z341=\"\",\"\",Linkwahl!Z341)","v":""},{"$f":"IF(Linkwahl!Y341=\"\",\"\",Linkwahl!Y341)","v":"MVV"},{"$f":"IF(Linkwahl!AA341=\"\",\"\",Linkwahl!AA341)","v":"833.11"},{"$f":"IF(Linkwahl!AB341=\"\",\"\",Linkwahl!AB341)","v":"Militärversicherungsverordnung"}]
["SR-Link",{"$f":"IF(Linkwahl!Z342=\"\",\"\",Linkwahl!Z342)","v":"e"},{"$f":"IF(Linkwahl!Y342=\"\",\"\",Linkwahl!Y342)","v":"MWSTG"},{"$f":"IF(Linkwahl!AA342=\"\",\"\",Linkwahl!AA342)","v":"641.20"},{"$f":"IF(Linkwahl!AB342=\"\",\"\",Linkwahl!AB342)","v":"Mehrwertsteuergesetz"}]
["SR-Link",{"$f":"IF(Linkwahl!Z343=\"\",\"\",Linkwahl!Z343)","v":"e"},{"$f":"IF(Linkwahl!Y343=\"\",\"\",Linkwahl!Y343)","v":"MWSTV"},{"$f":"IF(Linkwahl!AA343=\"\",\"\",Linkwahl!AA343)","v":"641.201"},{"$f":"IF(Linkwahl!AB343=\"\",\"\",Linkwahl!AB343)","v":"Mehrwertsteuerverordnung"}]
["SR-Link",{"$f":"IF(Linkwahl!Z344=\"\",\"\",Linkwahl!Z344)","v":"e"},{"$f":"IF(Linkwahl!Y344=\"\",\"\",Linkwahl!Y344)","v":"NagV"},{"$f":"IF(Linkwahl!AA344=\"\",\"\",Linkwahl!AA344)","v":"451.61"},{"$f":"IF(Linkwahl!AB344=\"\",\"\",Linkwahl!AB344)","v":"Nagoya-Verordnung"}]
["SR-Link",{"$f":"IF(Linkwahl!Z345=\"\",\"\",Linkwahl!Z345)","v":""},{"$f":"IF(Linkwahl!Y345=\"\",\"\",Linkwahl!Y345)","v":"NAV AÄrzte"},{"$f":"IF(Linkwahl!AA345=\"\",\"\",Linkwahl!AA345)","v":"221.215.328.1"},{"$f":"IF(Linkwahl!AB345=\"\",\"\",Linkwahl!AB345)","v":"NAV für Assistenzärzte"}]
["SR-Link",{"$f":"IF(Linkwahl!Z346=\"\",\"\",Linkwahl!Z346)","v":""},{"$f":"IF(Linkwahl!Y346=\"\",\"\",Linkwahl!Y346)","v":"NAV Erzieher"},{"$f":"IF(Linkwahl!AA346=\"\",\"\",Linkwahl!AA346)","v":"221.215.324.1"},{"$f":"IF(Linkwahl!AB346=\"\",\"\",Linkwahl!AB346)","v":"NAV für die Erzieher in Heimen und Internaten"}]
["SR-Link",{"$f":"IF(Linkwahl!Z347=\"\",\"\",Linkwahl!Z347)","v":""},{"$f":"IF(Linkwahl!Y347=\"\",\"\",Linkwahl!Y347)","v":"NAV Hausw"},{"$f":"IF(Linkwahl!AA347=\"\",\"\",Linkwahl!AA347)","v":"221.215.329.4"},{"$f":"IF(Linkwahl!AB347=\"\",\"\",Linkwahl!AB347)","v":"NAV Hauswirtschaft"}]
["SR-Link",{"$f":"IF(Linkwahl!Z348=\"\",\"\",Linkwahl!Z348)","v":""},{"$f":"IF(Linkwahl!Y348=\"\",\"\",Linkwahl!Y348)","v":"NAV Milchw"},{"$f":"IF(Linkwahl!AA348=\"\",\"\",Linkwahl!AA348)","v":"221.215.329.2"},{"$f":"IF(Linkwahl!AB348=\"\",\"\",Linkwahl!AB348)","v":"NAV für milchwirtschaftliche Arbeitnehmer"}]
["SR-Link",{"$f":"IF(Linkwahl!Z349=\"\",\"\",Linkwahl!Z349)","v":""},{"$f":"IF(Linkwahl!Y349=\"\",\"\",Linkwahl!Y349)","v":"NAV Pflege"},{"$f":"IF(Linkwahl!AA349=\"\",\"\",Linkwahl!AA349)","v":"221.215.328.4"},{"$f":"IF(Linkwahl!AB349=\"\",\"\",Linkwahl!AB349)","v":"NAV für das Pflegepersonal"}]
["SR-Link",{"$f":"IF(Linkwahl!Z350=\"\",\"\",Linkwahl!Z350)","v":""},{"$f":"IF(Linkwahl!Y350=\"\",\"\",Linkwahl!Y350)","v":"NAV Privatgärtner"},{"$f":"IF(Linkwahl!AA350=\"\",\"\",Linkwahl!AA350)","v":"221.215.329.3"},{"$f":"IF(Linkwahl!AB350=\"\",\"\",Linkwahl!AB350)","v":"NAV für Privatgärtner"}]
["SR-Link",{"$f":"IF(Linkwahl!Z351=\"\",\"\",Linkwahl!Z351)","v":""},{"$f":"IF(Linkwahl!Y351=\"\",\"\",Linkwahl!Y351)","v":"NAV Strahlensch"},{"$f":"IF(Linkwahl!AA351=\"\",\"\",Linkwahl!AA351)","v":"221.215.328.6"},{"$f":"IF(Linkwahl!AB351=\"\",\"\",Linkwahl!AB351)","v":"NAV über Versicherungsleistungen für das beruflich strahlenexponierte Personal"}]
["SR-Link",{"$f":"IF(Linkwahl!Z352=\"\",\"\",Linkwahl!Z352)","v":"e"},{"$f":"IF(Linkwahl!Y352=\"\",\"\",Linkwahl!Y352)","v":"NBG"},{"$f":"IF(Linkwahl!AA352=\"\",\"\",Linkwahl!AA352)","v":"951.11"},{"$f":"IF(Linkwahl!AB352=\"\",\"\",Linkwahl!AB352)","v":"Nationalbankgesetz"}]
["SR-Link",{"$f":"IF(Linkwahl!Z353=\"\",\"\",Linkwahl!Z353)","v":"e"},{"$f":"IF(Linkwahl!Y353=\"\",\"\",Linkwahl!Y353)","v":"NBV"},{"$f":"IF(Linkwahl!AA353=\"\",\"\",Linkwahl!AA353)","v":"951.121"},{"$f":"IF(Linkwahl!AB353=\"\",\"\",Linkwahl!AB353)","v":"Nationalbankverordnung"}]
["SR-Link",{"$f":"IF(Linkwahl!Z354=\"\",\"\",Linkwahl!Z354)","v":"e"},{"$f":"IF(Linkwahl!Y354=\"\",\"\",Linkwahl!Y354)","v":"NEHR"},{"$f":"IF(Linkwahl!AA354=\"\",\"\",Linkwahl!AA354)","v":"641.712.2"},{"$f":"IF(Linkwahl!AB354=\"\",\"\",Linkwahl!AB354)","v":"nationales Emissionshandelsregister, UVEK-VO über das"}]
["SR-Link",{"$f":"IF(Linkwahl!Z355=\"\",\"\",Linkwahl!Z355)","v":"e / r"},{"$f":"IF(Linkwahl!Y355=\"\",\"\",Linkwahl!Y355)","v":"NHG"},{"$f":"IF(Linkwahl!AA355=\"\",\"\",Linkwahl!AA355)","v":"451"},{"$f":"IF(Linkwahl!AB355=\"\",\"\",Linkwahl!AB355)","v":"Natur- und Heimatschutzgesetz"}]
["SR-Link",{"$f":"IF(Linkwahl!Z356=\"\",\"\",Linkwahl!Z356)","v":"e / r"},{"$f":"IF(Linkwahl!Y356=\"\",\"\",Linkwahl!Y356)","v":"NHV"},{"$f":"IF(Linkwahl!AA356=\"\",\"\",Linkwahl!AA356)","v":"451.1"},{"$f":"IF(Linkwahl!AB356=\"\",\"\",Linkwahl!AB356)","v":"Natur- und Heimatschutzverordnung"}]
["SR-Link",{"$f":"IF(Linkwahl!Z357=\"\",\"\",Linkwahl!Z357)","v":"e"},{"$f":"IF(Linkwahl!Y357=\"\",\"\",Linkwahl!Y357)","v":"NPG"},{"$f":"IF(Linkwahl!AA357=\"\",\"\",Linkwahl!AA357)","v":"454"},{"$f":"IF(Linkwahl!AB357=\"\",\"\",Linkwahl!AB357)","v":"Nationalparkgesetz"}]
["SR-Link",{"$f":"IF(Linkwahl!Z358=\"\",\"\",Linkwahl!Z358)","v":""},{"$f":"IF(Linkwahl!Y358=\"\",\"\",Linkwahl!Y358)","v":"OBG"},{"$f":"IF(Linkwahl!AA358=\"\",\"\",Linkwahl!AA358)","v":"741.03"},{"$f":"IF(Linkwahl!AB358=\"\",\"\",Linkwahl!AB358)","v":"Ordnungsbussengesetz"}]
["SR-Link",{"$f":"IF(Linkwahl!Z359=\"\",\"\",Linkwahl!Z359)","v":""},{"$f":"IF(Linkwahl!Y359=\"\",\"\",Linkwahl!Y359)","v":"OBV"},{"$f":"IF(Linkwahl!AA359=\"\",\"\",Linkwahl!AA359)","v":"741.031"},{"$f":"IF(Linkwahl!AB359=\"\",\"\",Linkwahl!AB359)","v":"Ordnungsbussenverordnung"}]
["SR-Link",{"$f":"IF(Linkwahl!Z360=\"\",\"\",Linkwahl!Z360)","v":"e"},{"$f":"IF(Linkwahl!Y360=\"\",\"\",Linkwahl!Y360)","v":"OF-HFG"},{"$f":"IF(Linkwahl!AA360=\"\",\"\",Linkwahl!AA360)","v":"810.308"},{"$f":"IF(Linkwahl!AB360=\"\",\"\",Linkwahl!AB360)","v":"Organisationsverordnung Humanforschungsgesetz"}]
["SR-Link",{"$f":"IF(Linkwahl!Z361=\"\",\"\",Linkwahl!Z361)","v":""},{"$f":"IF(Linkwahl!Y361=\"\",\"\",Linkwahl!Y361)","v":"OHG"},{"$f":"IF(Linkwahl!AA361=\"\",\"\",Linkwahl!AA361)","v":312.5},{"$f":"IF(Linkwahl!AB361=\"\",\"\",Linkwahl!AB361)","v":"Opferhilfegesetz"}]
["SR-Link",{"$f":"IF(Linkwahl!Z362=\"\",\"\",Linkwahl!Z362)","v":""},{"$f":"IF(Linkwahl!Y362=\"\",\"\",Linkwahl!Y362)","v":"OHV"},{"$f":"IF(Linkwahl!AA362=\"\",\"\",Linkwahl!AA362)","v":312.51},{"$f":"IF(Linkwahl!AB362=\"\",\"\",Linkwahl!AB362)","v":"Opferhilfeverordnung"}]
["SR-Link",{"$f":"IF(Linkwahl!Z363=\"\",\"\",Linkwahl!Z363)","v":"e / r"},{"$f":"IF(Linkwahl!Y363=\"\",\"\",Linkwahl!Y363)","v":"OR"},{"$f":"IF(Linkwahl!AA363=\"\",\"\",Linkwahl!AA363)","v":220},{"$f":"IF(Linkwahl!AB363=\"\",\"\",Linkwahl!AB363)","v":"Obligationenrecht"}]
["SR-Link",{"$f":"IF(Linkwahl!Z364=\"\",\"\",Linkwahl!Z364)","v":"r"},{"$f":"IF(Linkwahl!Y364=\"\",\"\",Linkwahl!Y364)","v":"OsthilfeG"},{"$f":"IF(Linkwahl!AA364=\"\",\"\",Linkwahl!AA364)","v":"974.1"},{"$f":"IF(Linkwahl!AB364=\"\",\"\",Linkwahl!AB364)","v":"Zusammenarbeit mit den Staaten Osteuropas, BG über die"}]
["SR-Link",{"$f":"IF(Linkwahl!Z365=\"\",\"\",Linkwahl!Z365)","v":""},{"$f":"IF(Linkwahl!Y365=\"\",\"\",Linkwahl!Y365)","v":"OV-EDI"},{"$f":"IF(Linkwahl!AA365=\"\",\"\",Linkwahl!AA365)","v":"172.212.1"},{"$f":"IF(Linkwahl!AB365=\"\",\"\",Linkwahl!AB365)","v":"Organisationsverordnung für das Eidgenössische Departement des Innern "}]
["SR-Link",{"$f":"IF(Linkwahl!Z366=\"\",\"\",Linkwahl!Z366)","v":"e"},{"$f":"IF(Linkwahl!Y366=\"\",\"\",Linkwahl!Y366)","v":"PAG"},{"$f":"IF(Linkwahl!AA366=\"\",\"\",Linkwahl!AA366)","v":"935.62"},{"$f":"IF(Linkwahl!AB366=\"\",\"\",Linkwahl!AB366)","v":"Patentsanwaltsgesetz"}]
["SR-Link",{"$f":"IF(Linkwahl!Z367=\"\",\"\",Linkwahl!Z367)","v":""},{"$f":"IF(Linkwahl!Y367=\"\",\"\",Linkwahl!Y367)","v":"PaRG"},{"$f":"IF(Linkwahl!AA367=\"\",\"\",Linkwahl!AA367)","v":"831.31"},{"$f":"IF(Linkwahl!AB367=\"\",\"\",Linkwahl!AB367)","v":"Schutz vor Passivrauchen, BG zum"}]
["SR-Link",{"$f":"IF(Linkwahl!Z368=\"\",\"\",Linkwahl!Z368)","v":"e / r"},{"$f":"IF(Linkwahl!Y368=\"\",\"\",Linkwahl!Y368)","v":"ParlG"},{"$f":"IF(Linkwahl!AA368=\"\",\"\",Linkwahl!AA368)","v":"171.10"},{"$f":"IF(Linkwahl!AB368=\"\",\"\",Linkwahl!AB368)","v":"Parlamentsgesetz"}]
["SR-Link",{"$f":"IF(Linkwahl!Z369=\"\",\"\",Linkwahl!Z369)","v":""},{"$f":"IF(Linkwahl!Y369=\"\",\"\",Linkwahl!Y369)","v":"PartG"},{"$f":"IF(Linkwahl!AA369=\"\",\"\",Linkwahl!AA369)","v":"211.231"},{"$f":"IF(Linkwahl!AB369=\"\",\"\",Linkwahl!AB369)","v":"Partnerschaftsgesetz"}]
["SR-Link",{"$f":"IF(Linkwahl!Z370=\"\",\"\",Linkwahl!Z370)","v":""},{"$f":"IF(Linkwahl!Y370=\"\",\"\",Linkwahl!Y370)","v":"PaRV"},{"$f":"IF(Linkwahl!AA370=\"\",\"\",Linkwahl!AA370)","v":"818.311"},{"$f":"IF(Linkwahl!AB370=\"\",\"\",Linkwahl!AB370)","v":"Passivrauchschutzverordnung"}]
["SR-Link",{"$f":"IF(Linkwahl!Z371=\"\",\"\",Linkwahl!Z371)","v":"e"},{"$f":"IF(Linkwahl!Y371=\"\",\"\",Linkwahl!Y371)","v":"PatG"},{"$f":"IF(Linkwahl!AA371=\"\",\"\",Linkwahl!AA371)","v":"232.14"},{"$f":"IF(Linkwahl!AB371=\"\",\"\",Linkwahl!AB371)","v":"Patentgesetz"}]
["SR-Link",{"$f":"IF(Linkwahl!Z372=\"\",\"\",Linkwahl!Z372)","v":"e"},{"$f":"IF(Linkwahl!Y372=\"\",\"\",Linkwahl!Y372)","v":"PatGG"},{"$f":"IF(Linkwahl!AA372=\"\",\"\",Linkwahl!AA372)","v":"173.41"},{"$f":"IF(Linkwahl!AB372=\"\",\"\",Linkwahl!AB372)","v":"Patentgerichtsgesetz"}]
["SR-Link",{"$f":"IF(Linkwahl!Z373=\"\",\"\",Linkwahl!Z373)","v":""},{"$f":"IF(Linkwahl!Y373=\"\",\"\",Linkwahl!Y373)","v":"PatV"},{"$f":"IF(Linkwahl!AA373=\"\",\"\",Linkwahl!AA373)","v":"232.141"},{"$f":"IF(Linkwahl!AB373=\"\",\"\",Linkwahl!AB373)","v":"Patentverordnung"}]
["SR-Link",{"$f":"IF(Linkwahl!Z374=\"\",\"\",Linkwahl!Z374)","v":""},{"$f":"IF(Linkwahl!Y374=\"\",\"\",Linkwahl!Y374)","v":"PauRG"},{"$f":"IF(Linkwahl!AA374=\"\",\"\",Linkwahl!AA374)","v":"944.3"},{"$f":"IF(Linkwahl!AB374=\"\",\"\",Linkwahl!AB374)","v":"Pauschalreisen, BG über die"}]
["SR-Link",{"$f":"IF(Linkwahl!Z375=\"\",\"\",Linkwahl!Z375)","v":"e"},{"$f":"IF(Linkwahl!Y375=\"\",\"\",Linkwahl!Y375)","v":"PAV"},{"$f":"IF(Linkwahl!AA375=\"\",\"\",Linkwahl!AA375)","v":"935.621"},{"$f":"IF(Linkwahl!AB375=\"\",\"\",Linkwahl!AB375)","v":"Patentanwaltsverordnung"}]
["SR-Link",{"$f":"IF(Linkwahl!Z376=\"\",\"\",Linkwahl!Z376)","v":"e"},{"$f":"IF(Linkwahl!Y376=\"\",\"\",Linkwahl!Y376)","v":"PäV"},{"$f":"IF(Linkwahl!AA376=\"\",\"\",Linkwahl!AA376)","v":"451.36"},{"$f":"IF(Linkwahl!AB376=\"\",\"\",Linkwahl!AB376)","v":"Pärkeverordnung"}]
["SR-Link",{"$f":"IF(Linkwahl!Z377=\"\",\"\",Linkwahl!Z377)","v":""},{"$f":"IF(Linkwahl!Y377=\"\",\"\",Linkwahl!Y377)","v":"PAVO"},{"$f":"IF(Linkwahl!AA377=\"\",\"\",Linkwahl!AA377)","v":"211.222.338"},{"$f":"IF(Linkwahl!AB377=\"\",\"\",Linkwahl!AB377)","v":"Aufnahme von Kindern zur Pflege und zur Adoption, VO über die"}]
["SR-Link",{"$f":"IF(Linkwahl!Z378=\"\",\"\",Linkwahl!Z378)","v":""},{"$f":"IF(Linkwahl!Y378=\"\",\"\",Linkwahl!Y378)","v":"PBG"},{"$f":"IF(Linkwahl!AA378=\"\",\"\",Linkwahl!AA378)","v":"745.1"},{"$f":"IF(Linkwahl!AB378=\"\",\"\",Linkwahl!AB378)","v":"Personenbeförderungsgesetz"}]
["SR-Link",{"$f":"IF(Linkwahl!Z379=\"\",\"\",Linkwahl!Z379)","v":""},{"$f":"IF(Linkwahl!Y379=\"\",\"\",Linkwahl!Y379)","v":"PBV"},{"$f":"IF(Linkwahl!AA379=\"\",\"\",Linkwahl!AA379)","v":"942.211"},{"$f":"IF(Linkwahl!AB379=\"\",\"\",Linkwahl!AB379)","v":"Preisbekanntgabeverordnung"}]
["SR-Link",{"$f":"IF(Linkwahl!Z380=\"\",\"\",Linkwahl!Z380)","v":"e"},{"$f":"IF(Linkwahl!Y380=\"\",\"\",Linkwahl!Y380)","v":"PHV"},{"$f":"IF(Linkwahl!AA380=\"\",\"\",Linkwahl!AA380)","v":"192.126"},{"$f":"IF(Linkwahl!AB380=\"\",\"\",Linkwahl!AB380)","v":"privaten Hausangestellte, VO über die"}]
["SR-Link",{"$f":"IF(Linkwahl!Z381=\"\",\"\",Linkwahl!Z381)","v":"e / r"},{"$f":"IF(Linkwahl!Y381=\"\",\"\",Linkwahl!Y381)","v":"POG"},{"$f":"IF(Linkwahl!AA381=\"\",\"\",Linkwahl!AA381)","v":"783.1"},{"$f":"IF(Linkwahl!AB381=\"\",\"\",Linkwahl!AB381)","v":"Postorganisationsgesetz,"}]
["SR-Link",{"$f":"IF(Linkwahl!Z382=\"\",\"\",Linkwahl!Z382)","v":""},{"$f":"IF(Linkwahl!Y382=\"\",\"\",Linkwahl!Y382)","v":"PRG"},{"$f":"IF(Linkwahl!AA382=\"\",\"\",Linkwahl!AA382)","v":"171.21"},{"$f":"IF(Linkwahl!AB382=\"\",\"\",Linkwahl!AB382)","v":"Parlamentsressourcengesetz"}]
["SR-Link",{"$f":"IF(Linkwahl!Z383=\"\",\"\",Linkwahl!Z383)","v":""},{"$f":"IF(Linkwahl!Y383=\"\",\"\",Linkwahl!Y383)","v":"PrHG"},{"$f":"IF(Linkwahl!AA383=\"\",\"\",Linkwahl!AA383)","v":"221.112.944"},{"$f":"IF(Linkwahl!AB383=\"\",\"\",Linkwahl!AB383)","v":"Produktehaftpflichtgesetz"}]
["SR-Link",{"$f":"IF(Linkwahl!Z384=\"\",\"\",Linkwahl!Z384)","v":"e"},{"$f":"IF(Linkwahl!Y384=\"\",\"\",Linkwahl!Y384)","v":"PRTR.-V"},{"$f":"IF(Linkwahl!AA384=\"\",\"\",Linkwahl!AA384)","v":"814.017"},{"$f":"IF(Linkwahl!AB384=\"\",\"\",Linkwahl!AB384)","v":"Register Schadstoff-/Abfall-Freisetzung und -transfer"}]
["SR-Link",{"$f":"IF(Linkwahl!Z385=\"\",\"\",Linkwahl!Z385)","v":"e"},{"$f":"IF(Linkwahl!Y385=\"\",\"\",Linkwahl!Y385)","v":"PublG"},{"$f":"IF(Linkwahl!AA385=\"\",\"\",Linkwahl!AA385)","v":"170.512"},{"$f":"IF(Linkwahl!AB385=\"\",\"\",Linkwahl!AB385)","v":"Publikationsgesetz"}]
["SR-Link",{"$f":"IF(Linkwahl!Z386=\"\",\"\",Linkwahl!Z386)","v":"e"},{"$f":"IF(Linkwahl!Y386=\"\",\"\",Linkwahl!Y386)","v":"PublicaG"},{"$f":"IF(Linkwahl!AA386=\"\",\"\",Linkwahl!AA386)","v":"172.222.1"},{"$f":"IF(Linkwahl!AB386=\"\",\"\",Linkwahl!AB386)","v":"Pensionskasse des Bundes, G über die"}]
["SR-Link",{"$f":"IF(Linkwahl!Z387=\"\",\"\",Linkwahl!Z387)","v":"e"},{"$f":"IF(Linkwahl!Y387=\"\",\"\",Linkwahl!Y387)","v":"PublV"},{"$f":"IF(Linkwahl!AA387=\"\",\"\",Linkwahl!AA387)","v":"170.512.1"},{"$f":"IF(Linkwahl!AB387=\"\",\"\",Linkwahl!AB387)","v":"Publikationsverordnung"}]
["SR-Link",{"$f":"IF(Linkwahl!Z388=\"\",\"\",Linkwahl!Z388)","v":""},{"$f":"IF(Linkwahl!Y388=\"\",\"\",Linkwahl!Y388)","v":"PüG"},{"$f":"IF(Linkwahl!AA388=\"\",\"\",Linkwahl!AA388)","v":"942.20"},{"$f":"IF(Linkwahl!AB388=\"\",\"\",Linkwahl!AB388)","v":"Preisüberwachungsgesetz"}]
["SR-Link",{"$f":"IF(Linkwahl!Z389=\"\",\"\",Linkwahl!Z389)","v":"r"},{"$f":"IF(Linkwahl!Y389=\"\",\"\",Linkwahl!Y389)","v":"RA SNM"},{"$f":"IF(Linkwahl!AA389=\"\",\"\",Linkwahl!AA389)","v":"0.441.1"},{"$f":"IF(Linkwahl!AB389=\"\",\"\",Linkwahl!AB389)","v":"Schutz nationaler Minderheiten, Rahmenabkommen"}]
["SR-Link",{"$f":"IF(Linkwahl!Z390=\"\",\"\",Linkwahl!Z390)","v":""},{"$f":"IF(Linkwahl!Y390=\"\",\"\",Linkwahl!Y390)","v":"RAG"},{"$f":"IF(Linkwahl!AA390=\"\",\"\",Linkwahl!AA390)","v":"221.302"},{"$f":"IF(Linkwahl!AB390=\"\",\"\",Linkwahl!AB390)","v":"Revisionsaufsichtsgesetz"}]
[{"$f":"IF(D260=\"\",\"\",HYPERLINK(\"http://www.admin.ch/ch/d/sr/c\"&SUBSTITUTE(D260,\".\",\"_\")&\".html\",\"SR-Link\"))","v":"SR-Link"},{"$f":"IF(Linkwahl!Z391=\"\",\"\",Linkwahl!Z391)","v":""},{"$f":"IF(Linkwahl!Y391=\"\",\"\",Linkwahl!Y391)","v":"RDV"},{"$f":"IF(Linkwahl!AA391=\"\",\"\",Linkwahl!AA391)","v":"143.5"},{"$f":"IF(Linkwahl!AB391=\"\",\"\",Linkwahl!AB391)","v":"Ausstellung von Reisedokumenten für ausländische Personen, VO über die"}]
["SR-Link",{"$f":"IF(Linkwahl!Z392=\"\",\"\",Linkwahl!Z392)","v":""},{"$f":"IF(Linkwahl!Y392=\"\",\"\",Linkwahl!Y392)","v":"ReRBGer"},{"$f":"IF(Linkwahl!AA392=\"\",\"\",Linkwahl!AA392)","v":"173.110.29"},{"$f":"IF(Linkwahl!AB392=\"\",\"\",Linkwahl!AB392)","v":"Reglement Bundesgericht elektronischer Rechtsverkehr"}]
["SR-Link",{"$f":"IF(Linkwahl!Z393=\"\",\"\",Linkwahl!Z393)","v":"e"},{"$f":"IF(Linkwahl!Y393=\"\",\"\",Linkwahl!Y393)","v":"RHB"},{"$f":"IF(Linkwahl!AA393=\"\",\"\",Linkwahl!AA393)","v":"431.02"},{"$f":"IF(Linkwahl!AB393=\"\",\"\",Linkwahl!AB393)","v":"Registerharmonisierungsgesetz"}]
["SR-Link",{"$f":"IF(Linkwahl!Z394=\"\",\"\",Linkwahl!Z394)","v":"r"},{"$f":"IF(Linkwahl!Y394=\"\",\"\",Linkwahl!Y394)","v":"RPG"},{"$f":"IF(Linkwahl!AA394=\"\",\"\",Linkwahl!AA394)","v":"700"},{"$f":"IF(Linkwahl!AB394=\"\",\"\",Linkwahl!AB394)","v":"Raumplanungsgesetz"}]
["SR-Link",{"$f":"IF(Linkwahl!Z395=\"\",\"\",Linkwahl!Z395)","v":"r"},{"$f":"IF(Linkwahl!Y395=\"\",\"\",Linkwahl!Y395)","v":"RPV"},{"$f":"IF(Linkwahl!AA395=\"\",\"\",Linkwahl!AA395)","v":"700.1"},{"$f":"IF(Linkwahl!AB395=\"\",\"\",Linkwahl!AB395)","v":"Raumplanungsverordnung"}]
["SR-Link",{"$f":"IF(Linkwahl!Z396=\"\",\"\",Linkwahl!Z396)","v":"e / r"},{"$f":"IF(Linkwahl!Y396=\"\",\"\",Linkwahl!Y396)","v":"RTVG"},{"$f":"IF(Linkwahl!AA396=\"\",\"\",Linkwahl!AA396)","v":"784.40"},{"$f":"IF(Linkwahl!AB396=\"\",\"\",Linkwahl!AB396)","v":"Radio und Fernsehen, BG über"}]
["SR-Link",{"$f":"IF(Linkwahl!Z397=\"\",\"\",Linkwahl!Z397)","v":"e"},{"$f":"IF(Linkwahl!Y397=\"\",\"\",Linkwahl!Y397)","v":"RTVV"},{"$f":"IF(Linkwahl!AA397=\"\",\"\",Linkwahl!AA397)","v":"784.401"},{"$f":"IF(Linkwahl!AB397=\"\",\"\",Linkwahl!AB397)","v":"Radio- und Fernsehverordnung"}]
["SR-Link",{"$f":"IF(Linkwahl!Z398=\"\",\"\",Linkwahl!Z398)","v":"e"},{"$f":"IF(Linkwahl!Y398=\"\",\"\",Linkwahl!Y398)","v":"RUVG"},{"$f":"IF(Linkwahl!AA398=\"\",\"\",Linkwahl!AA398)","v":"196.1"},{"$f":"IF(Linkwahl!AB398=\"\",\"\",Linkwahl!AB398)","v":"Rückerstattung unrechtmässig erworbener Vermögenswerte politisch exponierter Personen, BG"}]
["SR-Link",{"$f":"IF(Linkwahl!Z399=\"\",\"\",Linkwahl!Z399)","v":""},{"$f":"IF(Linkwahl!Y399=\"\",\"\",Linkwahl!Y399)","v":"RV BPG"},{"$f":"IF(Linkwahl!AA399=\"\",\"\",Linkwahl!AA399)","v":"172.220.11"},{"$f":"IF(Linkwahl!AB399=\"\",\"\",Linkwahl!AB399)","v":"Rahmenverordnung BPG"}]
["SR-Link",{"$f":"IF(Linkwahl!Z400=\"\",\"\",Linkwahl!Z400)","v":"e / r"},{"$f":"IF(Linkwahl!Y400=\"\",\"\",Linkwahl!Y400)","v":"RVOG"},{"$f":"IF(Linkwahl!AA400=\"\",\"\",Linkwahl!AA400)","v":"172.010"},{"$f":"IF(Linkwahl!AB400=\"\",\"\",Linkwahl!AB400)","v":"Regierungs- und Verwaltungsorganisationsgesetz"}]
["SR-Link",{"$f":"IF(Linkwahl!Z401=\"\",\"\",Linkwahl!Z401)","v":""},{"$f":"IF(Linkwahl!Y401=\"\",\"\",Linkwahl!Y401)","v":"RVOV"},{"$f":"IF(Linkwahl!AA401=\"\",\"\",Linkwahl!AA401)","v":"172.010.1"},{"$f":"IF(Linkwahl!AB401=\"\",\"\",Linkwahl!AB401)","v":"Regierungs- und Verwaltungsorganisationsverordnung"}]
["SR-Link",{"$f":"IF(Linkwahl!Z402=\"\",\"\",Linkwahl!Z402)","v":""},{"$f":"IF(Linkwahl!Y402=\"\",\"\",Linkwahl!Y402)","v":"SBG"},{"$f":"IF(Linkwahl!AA402=\"\",\"\",Linkwahl!AA402)","v":"935.52"},{"$f":"IF(Linkwahl!AB402=\"\",\"\",Linkwahl!AB402)","v":"Spielbankengesetz"}]
["SR-Link",{"$f":"IF(Linkwahl!Z403=\"\",\"\",Linkwahl!Z403)","v":""},{"$f":"IF(Linkwahl!Y403=\"\",\"\",Linkwahl!Y403)","v":"SBV"},{"$f":"IF(Linkwahl!AA403=\"\",\"\",Linkwahl!AA403)","v":"747.201.7"},{"$f":"IF(Linkwahl!AB403=\"\",\"\",Linkwahl!AB403)","v":"Schiffsbauverordnung"}]
["SR-Link",{"$f":"IF(Linkwahl!Z404=\"\",\"\",Linkwahl!Z404)","v":""},{"$f":"IF(Linkwahl!Y404=\"\",\"\",Linkwahl!Y404)","v":"SGG"},{"$f":"IF(Linkwahl!AA404=\"\",\"\",Linkwahl!AA404)","v":173.71},{"$f":"IF(Linkwahl!AB404=\"\",\"\",Linkwahl!AB404)","v":"Strafgerichtsgesetz"}]
["SR-Link",null,{"$f":"IF(Linkwahl!Y405=\"\",\"\",Linkwahl!Y405)","v":"SchKG"},{"$f":"IF(Linkwahl!AA405=\"\",\"\",Linkwahl!AA405)","v":"281.1"},{"$f":"IF(Linkwahl!AB405=\"\",\"\",Linkwahl!AB405)","v":"Schuldbetreibungs- und Konkursgesetz"}]
["SR-Link",{"$f":"IF(Linkwahl!Z406=\"\",\"\",Linkwahl!Z406)","v":"e"},{"$f":"IF(Linkwahl!Y406=\"\",\"\",Linkwahl!Y406)","v":"SLV"},{"$f":"IF(Linkwahl!AA406=\"\",\"\",Linkwahl!AA406)","v":"814.49"},{"$f":"IF(Linkwahl!AB406=\"\",\"\",Linkwahl!AB406)","v":"Schall- und Laserverordnung"}]
["SR-Link",{"$f":"IF(Linkwahl!Z407=\"\",\"\",Linkwahl!Z407)","v":"e / r"},{"$f":"IF(Linkwahl!Y407=\"\",\"\",Linkwahl!Y407)","v":"SpDV"},{"$f":"IF(Linkwahl!AA407=\"\",\"\",Linkwahl!AA407)","v":"172.081"},{"$f":"IF(Linkwahl!AB407=\"\",\"\",Linkwahl!AB407)","v":"Sprachediensteverordnung"}]
["SR-Link",{"$f":"IF(Linkwahl!Z408=\"\",\"\",Linkwahl!Z408)","v":"e / r"},{"$f":"IF(Linkwahl!Y408=\"\",\"\",Linkwahl!Y408)","v":"SpG"},{"$f":"IF(Linkwahl!AA408=\"\",\"\",Linkwahl!AA408)","v":"441.1"},{"$f":"IF(Linkwahl!AB408=\"\",\"\",Linkwahl!AB408)","v":"Sprachengesetz"}]
["SR-Link",{"$f":"IF(Linkwahl!Z409=\"\",\"\",Linkwahl!Z409)","v":"e / r"},{"$f":"IF(Linkwahl!Y409=\"\",\"\",Linkwahl!Y409)","v":"SpV"},{"$f":"IF(Linkwahl!AA409=\"\",\"\",Linkwahl!AA409)","v":"441.11"},{"$f":"IF(Linkwahl!AB409=\"\",\"\",Linkwahl!AB409)","v":"Sprachenverordnung"}]
["SR-Link",{"$f":"IF(Linkwahl!Z410=\"\",\"\",Linkwahl!Z410)","v":"e"},{"$f":"IF(Linkwahl!Y410=\"\",\"\",Linkwahl!Y410)","v":"StAG"},{"$f":"IF(Linkwahl!AA410=\"\",\"\",Linkwahl!AA410)","v":"721.101"},{"$f":"IF(Linkwahl!AB410=\"\",\"\",Linkwahl!AB410)","v":"Stauanlagengesetz"}]
["SR-Link",{"$f":"IF(Linkwahl!Z411=\"\",\"\",Linkwahl!Z411)","v":"e"},{"$f":"IF(Linkwahl!Y411=\"\",\"\",Linkwahl!Y411)","v":"StAhiG"},{"$f":"IF(Linkwahl!AA411=\"\",\"\",Linkwahl!AA411)","v":"651.1"},{"$f":"IF(Linkwahl!AB411=\"\",\"\",Linkwahl!AB411)","v":"Steueramtshilfegesetz"}]
["SR-Link",{"$f":"IF(Linkwahl!Z412=\"\",\"\",Linkwahl!Z412)","v":"e"},{"$f":"IF(Linkwahl!Y412=\"\",\"\",Linkwahl!Y412)","v":"StAV"},{"$f":"IF(Linkwahl!AA412=\"\",\"\",Linkwahl!AA412)","v":"721.101.1"},{"$f":"IF(Linkwahl!AB412=\"\",\"\",Linkwahl!AB412)","v":"Stauanlagenverordnung"}]
["SR-Link",{"$f":"IF(Linkwahl!Z413=\"\",\"\",Linkwahl!Z413)","v":""},{"$f":"IF(Linkwahl!Y413=\"\",\"\",Linkwahl!Y413)","v":"SterG"},{"$f":"IF(Linkwahl!AA413=\"\",\"\",Linkwahl!AA413)","v":"211.111.1"},{"$f":"IF(Linkwahl!AB413=\"\",\"\",Linkwahl!AB413)","v":"Sterilisationsgesetz"}]
["SR-Link",{"$f":"IF(Linkwahl!Z414=\"\",\"\",Linkwahl!Z414)","v":"e / r"},{"$f":"IF(Linkwahl!Y414=\"\",\"\",Linkwahl!Y414)","v":"StFG"},{"$f":"IF(Linkwahl!AA414=\"\",\"\",Linkwahl!AA414)","v":"810.31"},{"$f":"IF(Linkwahl!AB414=\"\",\"\",Linkwahl!AB414)","v":"Stammzellenforschungsgesetz"}]
["SR-Link",{"$f":"IF(Linkwahl!Z415=\"\",\"\",Linkwahl!Z415)","v":"e"},{"$f":"IF(Linkwahl!Y415=\"\",\"\",Linkwahl!Y415)","v":"StFV"},{"$f":"IF(Linkwahl!AA415=\"\",\"\",Linkwahl!AA415)","v":"814.012"},{"$f":"IF(Linkwahl!AB415=\"\",\"\",Linkwahl!AB415)","v":"Störfallverordnung"}]
["SR-Link",{"$f":"IF(Linkwahl!Z416=\"\",\"\",Linkwahl!Z416)","v":"e / r"},{"$f":"IF(Linkwahl!Y416=\"\",\"\",Linkwahl!Y416)","v":"StGB"},{"$f":"IF(Linkwahl!AA416=\"\",\"\",Linkwahl!AA416)","v":"311.0"},{"$f":"IF(Linkwahl!AB416=\"\",\"\",Linkwahl!AB416)","v":"Strafgesetzbuch"}]
["SR-Link",{"$f":"IF(Linkwahl!Z417=\"\",\"\",Linkwahl!Z417)","v":"e / r"},{"$f":"IF(Linkwahl!Y417=\"\",\"\",Linkwahl!Y417)","v":"StPO"},{"$f":"IF(Linkwahl!AA417=\"\",\"\",Linkwahl!AA417)","v":"312.0"},{"$f":"IF(Linkwahl!AB417=\"\",\"\",Linkwahl!AB417)","v":"Strafprozessordnung"}]
["SR-Link",{"$f":"IF(Linkwahl!Z418=\"\",\"\",Linkwahl!Z418)","v":"e"},{"$f":"IF(Linkwahl!Y418=\"\",\"\",Linkwahl!Y418)","v":"StSG"},{"$f":"IF(Linkwahl!AA418=\"\",\"\",Linkwahl!AA418)","v":"814.50"},{"$f":"IF(Linkwahl!AB418=\"\",\"\",Linkwahl!AB418)","v":"Strahlenschutzgesetz"}]
["SR-Link",{"$f":"IF(Linkwahl!Z419=\"\",\"\",Linkwahl!Z419)","v":"e"},{"$f":"IF(Linkwahl!Y419=\"\",\"\",Linkwahl!Y419)","v":"StSV"},{"$f":"IF(Linkwahl!AA419=\"\",\"\",Linkwahl!AA419)","v":"814.501"},{"$f":"IF(Linkwahl!AB419=\"\",\"\",Linkwahl!AB419)","v":"Strahlenschutzverordnung"}]
["SR-Link",{"$f":"IF(Linkwahl!Z420=\"\",\"\",Linkwahl!Z420)","v":""},{"$f":"IF(Linkwahl!Y420=\"\",\"\",Linkwahl!Y420)","v":"STUG"},{"$f":"IF(Linkwahl!AA420=\"\",\"\",Linkwahl!AA420)","v":"744.10"},{"$f":"IF(Linkwahl!AB420=\"\",\"\",Linkwahl!AB420)","v":"Zulassung als Strassentransportunternehmen, BG über die"}]
["SR-Link",{"$f":"IF(Linkwahl!Z421=\"\",\"\",Linkwahl!Z421)","v":""},{"$f":"IF(Linkwahl!Y421=\"\",\"\",Linkwahl!Y421)","v":"SuG"},{"$f":"IF(Linkwahl!AA421=\"\",\"\",Linkwahl!AA421)","v":"616.1"},{"$f":"IF(Linkwahl!AB421=\"\",\"\",Linkwahl!AB421)","v":"Subventionsgesetz"}]
["SR-Link",{"$f":"IF(Linkwahl!Z422=\"\",\"\",Linkwahl!Z422)","v":"r"},{"$f":"IF(Linkwahl!Y422=\"\",\"\",Linkwahl!Y422)","v":"SVG"},{"$f":"IF(Linkwahl!AA422=\"\",\"\",Linkwahl!AA422)","v":"741.01"},{"$f":"IF(Linkwahl!AB422=\"\",\"\",Linkwahl!AB422)","v":"Strassenverkehrsgesetz"}]
["SR-Link",{"$f":"IF(Linkwahl!Z423=\"\",\"\",Linkwahl!Z423)","v":"e"},{"$f":"IF(Linkwahl!Y423=\"\",\"\",Linkwahl!Y423)","v":"SVKG"},{"$f":"IF(Linkwahl!AA423=\"\",\"\",Linkwahl!AA423)","v":"251.5"},{"$f":"IF(Linkwahl!AB423=\"\",\"\",Linkwahl!AB423)","v":"Sanktionen bei unzulässigen Wettbewerbsbeschränkungen, VO über"}]
["SR-Link",{"$f":"IF(Linkwahl!Z424=\"\",\"\",Linkwahl!Z424)","v":""},{"$f":"IF(Linkwahl!Y424=\"\",\"\",Linkwahl!Y424)","v":"SVV"},{"$f":"IF(Linkwahl!AA424=\"\",\"\",Linkwahl!AA424)","v":"741.21"},{"$f":"IF(Linkwahl!AB424=\"\",\"\",Linkwahl!AB424)","v":"Signalisationsverordnung"}]
["SR-Link",{"$f":"IF(Linkwahl!Z425=\"\",\"\",Linkwahl!Z425)","v":"e"},{"$f":"IF(Linkwahl!Y425=\"\",\"\",Linkwahl!Y425)","v":"tkd-VO"},{"$f":"IF(Linkwahl!AA425=\"\",\"\",Linkwahl!AA425)","v":"641.714.11"},{"$f":"IF(Linkwahl!AB425=\"\",\"\",Linkwahl!AB425)","v":"Erhebung von Tonnenkilometerdaten aus Flugstrecken und die Berichterstattung darüber, VO über die"}]
["SR-Link",{"$f":"IF(Linkwahl!Z426=\"\",\"\",Linkwahl!Z426)","v":""},{"$f":"IF(Linkwahl!Y426=\"\",\"\",Linkwahl!Y426)","v":"ToG"},{"$f":"IF(Linkwahl!AA426=\"\",\"\",Linkwahl!AA426)","v":"231.2"},{"$f":"IF(Linkwahl!AB426=\"\",\"\",Linkwahl!AB426)","v":"Topographiengesetz"}]
["SR-Link",{"$f":"IF(Linkwahl!Z427=\"\",\"\",Linkwahl!Z427)","v":"e"},{"$f":"IF(Linkwahl!Y427=\"\",\"\",Linkwahl!Y427)","v":"TpG"},{"$f":"IF(Linkwahl!AA427=\"\",\"\",Linkwahl!AA427)","v":"810.21"},{"$f":"IF(Linkwahl!AB427=\"\",\"\",Linkwahl!AB427)","v":"Transplantationsgesetz"}]
["SR-Link",{"$f":"IF(Linkwahl!Z428=\"\",\"\",Linkwahl!Z428)","v":""},{"$f":"IF(Linkwahl!Y428=\"\",\"\",Linkwahl!Y428)","v":"TrÖbiV"},{"$f":"IF(Linkwahl!AA428=\"\",\"\",Linkwahl!AA428)","v":"641.611.21"},{"$f":"IF(Linkwahl!AB428=\"\",\"\",Linkwahl!AB428)","v":"Treibstoffökobilanz-Verordnung"}]
["SR-Link",{"$f":"IF(Linkwahl!Z429=\"\",\"\",Linkwahl!Z429)","v":"r"},{"$f":"IF(Linkwahl!Y429=\"\",\"\",Linkwahl!Y429)","v":"TschG"},{"$f":"IF(Linkwahl!AA429=\"\",\"\",Linkwahl!AA429)","v":"455"},{"$f":"IF(Linkwahl!AB429=\"\",\"\",Linkwahl!AB429)","v":"Tierschutzgesetz"}]
["SR-Link",{"$f":"IF(Linkwahl!Z430=\"\",\"\",Linkwahl!Z430)","v":"e"},{"$f":"IF(Linkwahl!Y430=\"\",\"\",Linkwahl!Y430)","v":"TVAV"},{"$f":"IF(Linkwahl!AA430=\"\",\"\",Linkwahl!AA430)","v":"211.432.21"},{"$f":"IF(Linkwahl!AB430=\"\",\"\",Linkwahl!AB430)","v":"amtliche Vermessung, technische Verordnung des VBS über die "}]
["SR-Link",{"$f":"IF(Linkwahl!Z431=\"\",\"\",Linkwahl!Z431)","v":"e"},{"$f":"IF(Linkwahl!Y431=\"\",\"\",Linkwahl!Y431)","v":"TWV"},{"$f":"IF(Linkwahl!AA431=\"\",\"\",Linkwahl!AA431)","v":"817.064"},{"$f":"IF(Linkwahl!AB431=\"\",\"\",Linkwahl!AB431)","v":" kombinierte Warnhinweise auf Tabakprodukten, EDI-VO über"}]
["SR-Link",{"$f":"IF(Linkwahl!Z432=\"\",\"\",Linkwahl!Z432)","v":""},{"$f":"IF(Linkwahl!Y432=\"\",\"\",Linkwahl!Y432)","v":"UEV"},{"$f":"IF(Linkwahl!AA432=\"\",\"\",Linkwahl!AA432)","v":"954.195.1"},{"$f":"IF(Linkwahl!AB432=\"\",\"\",Linkwahl!AB432)","v":"Übernahmeverordnung"}]
["SR-Link",{"$f":"IF(Linkwahl!Z433=\"\",\"\",Linkwahl!Z433)","v":"r"},{"$f":"IF(Linkwahl!Y433=\"\",\"\",Linkwahl!Y433)","v":"UN-KRK"},{"$f":"IF(Linkwahl!AA433=\"\",\"\",Linkwahl!AA433)","v":"0.107"},{"$f":"IF(Linkwahl!AB433=\"\",\"\",Linkwahl!AB433)","v":"Übereinkommen über die Rechte des Kindes"}]
["SR-Link",{"$f":"IF(Linkwahl!Z434=\"\",\"\",Linkwahl!Z434)","v":""},{"$f":"IF(Linkwahl!Y434=\"\",\"\",Linkwahl!Y434)","v":"Uno-Pakt I"},{"$f":"IF(Linkwahl!AA434=\"\",\"\",Linkwahl!AA434)","v":"0.103.1"},{"$f":"IF(Linkwahl!AB434=\"\",\"\",Linkwahl!AB434)","v":"Internationaler Pakt über wirtschaftliche, soziale und kulturelle Rechte"}]
["SR-Link",{"$f":"IF(Linkwahl!Z435=\"\",\"\",Linkwahl!Z435)","v":""},{"$f":"IF(Linkwahl!Y435=\"\",\"\",Linkwahl!Y435)","v":"Uno-Pakt II"},{"$f":"IF(Linkwahl!AA435=\"\",\"\",Linkwahl!AA435)","v":"0.103.2"},{"$f":"IF(Linkwahl!AB435=\"\",\"\",Linkwahl!AB435)","v":"Internationaler Pakt über bürgerliche und politische Rechte"}]
["SR-Link",{"$f":"IF(Linkwahl!Z436=\"\",\"\",Linkwahl!Z436)","v":"e"},{"$f":"IF(Linkwahl!Y436=\"\",\"\",Linkwahl!Y436)","v":"URG"},{"$f":"IF(Linkwahl!AA436=\"\",\"\",Linkwahl!AA436)","v":231.1},{"$f":"IF(Linkwahl!AB436=\"\",\"\",Linkwahl!AB436)","v":"Urheberrechtsgesetz"}]
["SR-Link",{"$f":"IF(Linkwahl!Z437=\"\",\"\",Linkwahl!Z437)","v":""},{"$f":"IF(Linkwahl!Y437=\"\",\"\",Linkwahl!Y437)","v":"URV"},{"$f":"IF(Linkwahl!AA437=\"\",\"\",Linkwahl!AA437)","v":231.11},{"$f":"IF(Linkwahl!AB437=\"\",\"\",Linkwahl!AB437)","v":"Urheberrechtsverordnung"}]
["SR-Link",{"$f":"IF(Linkwahl!Z438=\"\",\"\",Linkwahl!Z438)","v":"e"},{"$f":"IF(Linkwahl!Y438=\"\",\"\",Linkwahl!Y438)","v":"USG"},{"$f":"IF(Linkwahl!AA438=\"\",\"\",Linkwahl!AA438)","v":814.01},{"$f":"IF(Linkwahl!AB438=\"\",\"\",Linkwahl!AB438)","v":"Umweltschutzgesetz"}]
["SR-Link",{"$f":"IF(Linkwahl!Z439=\"\",\"\",Linkwahl!Z439)","v":""},{"$f":"IF(Linkwahl!Y439=\"\",\"\",Linkwahl!Y439)","v":"UVG"},{"$f":"IF(Linkwahl!AA439=\"\",\"\",Linkwahl!AA439)","v":"832.20"},{"$f":"IF(Linkwahl!AB439=\"\",\"\",Linkwahl!AB439)","v":"Unfallversicherungsgesetz"}]
["SR-Link",{"$f":"IF(Linkwahl!Z440=\"\",\"\",Linkwahl!Z440)","v":""},{"$f":"IF(Linkwahl!Y440=\"\",\"\",Linkwahl!Y440)","v":"UVV"},{"$f":"IF(Linkwahl!AA440=\"\",\"\",Linkwahl!AA440)","v":832.202},{"$f":"IF(Linkwahl!AB440=\"\",\"\",Linkwahl!AB440)","v":"Unfallversicherungsverordnung"}]
["SR-Link",{"$f":"IF(Linkwahl!Z441=\"\",\"\",Linkwahl!Z441)","v":""},{"$f":"IF(Linkwahl!Y441=\"\",\"\",Linkwahl!Y441)","v":"UWG"},{"$f":"IF(Linkwahl!AA441=\"\",\"\",Linkwahl!AA441)","v":241},{"$f":"IF(Linkwahl!AB441=\"\",\"\",Linkwahl!AB441)","v":"unlauteren Wettbewerb, BG gegen den "}]
["SR-Link",{"$f":"IF(Linkwahl!Z442=\"\",\"\",Linkwahl!Z442)","v":""},{"$f":"IF(Linkwahl!Y442=\"\",\"\",Linkwahl!Y442)","v":"VAG"},{"$f":"IF(Linkwahl!AA442=\"\",\"\",Linkwahl!AA442)","v":"961.01"},{"$f":"IF(Linkwahl!AB442=\"\",\"\",Linkwahl!AB442)","v":"Versicherungsaufsichtsgesetz"}]
["SR-Link",{"$f":"IF(Linkwahl!Z443=\"\",\"\",Linkwahl!Z443)","v":"e"},{"$f":"IF(Linkwahl!Y443=\"\",\"\",Linkwahl!Y443)","v":"VASA"},{"$f":"IF(Linkwahl!AA443=\"\",\"\",Linkwahl!AA443)","v":"814.681"},{"$f":"IF(Linkwahl!AB443=\"\",\"\",Linkwahl!AB443)","v":"Abgabe zur Sanierung von Altlasten, VO über die"}]
["SR-Link",{"$f":"IF(Linkwahl!Z444=\"\",\"\",Linkwahl!Z444)","v":"e"},{"$f":"IF(Linkwahl!Y444=\"\",\"\",Linkwahl!Y444)","v":"V-ASG"},{"$f":"IF(Linkwahl!AA444=\"\",\"\",Linkwahl!AA444)","v":"195.11"},{"$f":"IF(Linkwahl!AB444=\"\",\"\",Linkwahl!AB444)","v":"Auslandschweizerverordnung"}]
["SR-Link",{"$f":"IF(Linkwahl!Z445=\"\",\"\",Linkwahl!Z445)","v":"e"},{"$f":"IF(Linkwahl!Y445=\"\",\"\",Linkwahl!Y445)","v":"VAV"},{"$f":"IF(Linkwahl!AA445=\"\",\"\",Linkwahl!AA445)","v":"211.432.2"},{"$f":"IF(Linkwahl!AB445=\"\",\"\",Linkwahl!AB445)","v":"amtliche Vermessung, VO über die"}]
["SR-Link",{"$f":"IF(Linkwahl!Z446=\"\",\"\",Linkwahl!Z446)","v":"e"},{"$f":"IF(Linkwahl!Y446=\"\",\"\",Linkwahl!Y446)","v":"VBGA"},{"$f":"IF(Linkwahl!AA446=\"\",\"\",Linkwahl!AA446)","v":"152.11"},{"$f":"IF(Linkwahl!AB446=\"\",\"\",Linkwahl!AB446)","v":"Archivierungsverordnung"}]
["SR-Link",{"$f":"IF(Linkwahl!Z447=\"\",\"\",Linkwahl!Z447)","v":"r"},{"$f":"IF(Linkwahl!Y447=\"\",\"\",Linkwahl!Y447)","v":"VBGF"},{"$f":"IF(Linkwahl!AA447=\"\",\"\",Linkwahl!AA447)","v":"923.01"},{"$f":"IF(Linkwahl!AB447=\"\",\"\",Linkwahl!AB447)","v":"Fischerei, VO zum BG über die"}]
["SR-Link",{"$f":"IF(Linkwahl!Z448=\"\",\"\",Linkwahl!Z448)","v":""},{"$f":"IF(Linkwahl!Y448=\"\",\"\",Linkwahl!Y448)","v":"VBO"},{"$f":"IF(Linkwahl!AA448=\"\",\"\",Linkwahl!AA448)","v":"814.076"},{"$f":"IF(Linkwahl!AB448=\"\",\"\",Linkwahl!AB448)","v":"Bezeichnung im US + NHS beschwerdeberechtigte Organisationen, VO über"}]
["SR-Link",{"$f":"IF(Linkwahl!Z449=\"\",\"\",Linkwahl!Z449)","v":"e"},{"$f":"IF(Linkwahl!Y449=\"\",\"\",Linkwahl!Y449)","v":"VBP"},{"$f":"IF(Linkwahl!AA449=\"\",\"\",Linkwahl!AA449)","v":"813.12"},{"$f":"IF(Linkwahl!AB449=\"\",\"\",Linkwahl!AB449)","v":"Biozidprodukteverordnung"}]
["SR-Link",{"$f":"IF(Linkwahl!Z450=\"\",\"\",Linkwahl!Z450)","v":""},{"$f":"IF(Linkwahl!Y450=\"\",\"\",Linkwahl!Y450)","v":"VBPV"},{"$f":"IF(Linkwahl!AA450=\"\",\"\",Linkwahl!AA450)","v":"172.220.111.310.1"},{"$f":"IF(Linkwahl!AB450=\"\",\"\",Linkwahl!AB450)","v":"Verordnung des EFD zur Bundespersonalverordnung"}]
["SR-Link",{"$f":"IF(Linkwahl!Z451=\"\",\"\",Linkwahl!Z451)","v":"e"},{"$f":"IF(Linkwahl!Y451=\"\",\"\",Linkwahl!Y451)","v":"VDSG"},{"$f":"IF(Linkwahl!AA451=\"\",\"\",Linkwahl!AA451)","v":235.11},{"$f":"IF(Linkwahl!AB451=\"\",\"\",Linkwahl!AB451)","v":"Datenschutzverordnung"}]
["SR-Link",{"$f":"IF(Linkwahl!Z452=\"\",\"\",Linkwahl!Z452)","v":"e"},{"$f":"IF(Linkwahl!Y452=\"\",\"\",Linkwahl!Y452)","v":"VDSZ"},{"$f":"IF(Linkwahl!AA452=\"\",\"\",Linkwahl!AA452)","v":"235.13"},{"$f":"IF(Linkwahl!AB452=\"\",\"\",Linkwahl!AB452)","v":"Datenschutzzertifizierungen, VO über die"}]
["SR-Link",{"$f":"IF(Linkwahl!Z453=\"\",\"\",Linkwahl!Z453)","v":""},{"$f":"IF(Linkwahl!Y453=\"\",\"\",Linkwahl!Y453)","v":"VegüV"},{"$f":"IF(Linkwahl!AA453=\"\",\"\",Linkwahl!AA453)","v":"221.331"},{"$f":"IF(Linkwahl!AB453=\"\",\"\",Linkwahl!AB453)","v":"übermässige Vergütungen bei börsenkotierten Aktiengesellschaften, VO gegen "}]
["SR-Link",{"$f":"IF(Linkwahl!Z454=\"\",\"\",Linkwahl!Z454)","v":"e"},{"$f":"IF(Linkwahl!Y454=\"\",\"\",Linkwahl!Y454)","v":"VELes"},{"$f":"IF(Linkwahl!AA454=\"\",\"\",Linkwahl!AA454)","v":"161.116"},{"$f":"IF(Linkwahl!AB454=\"\",\"\",Linkwahl!AB454)","v":"elektronische Stimmabgabe, Verordnung der BK über die "}]
[{"$f":"IF(D324=\"\",\"\",HYPERLINK(\"http://www.admin.ch/ch/d/sr/c\"&SUBSTITUTE(D324,\".\",\"_\")&\".html\",\"SR-Link\"))","v":"SR-Link"},{"$f":"IF(Linkwahl!Z455=\"\",\"\",Linkwahl!Z455)","v":"e"},{"$f":"IF(Linkwahl!Y455=\"\",\"\",Linkwahl!Y455)","v":"VEMV"},{"$f":"IF(Linkwahl!AA455=\"\",\"\",Linkwahl!AA455)","v":"734.5"},{"$f":"IF(Linkwahl!AB455=\"\",\"\",Linkwahl!AB455)","v":"elektromagnetische Verträglichkeit, VO über die"}]
["SR-Link",{"$f":"IF(Linkwahl!Z456=\"\",\"\",Linkwahl!Z456)","v":""},{"$f":"IF(Linkwahl!Y456=\"\",\"\",Linkwahl!Y456)","v":"VEP"},{"$f":"IF(Linkwahl!AA456=\"\",\"\",Linkwahl!AA456)","v":142.203},{"$f":"IF(Linkwahl!AB456=\"\",\"\",Linkwahl!AB456)","v":"Einführung des freien Personenverkehrs, VO über die"}]
["SR-Link",{"$f":"IF(Linkwahl!Z457=\"\",\"\",Linkwahl!Z457)","v":"e"},{"$f":"IF(Linkwahl!Y457=\"\",\"\",Linkwahl!Y457)","v":"VES"},{"$f":"IF(Linkwahl!AA457=\"\",\"\",Linkwahl!AA457)","v":"124"},{"$f":"IF(Linkwahl!AB457=\"\",\"\",Linkwahl!AB457)","v":"den Einsatz privater Sicherheitsfirmen, VO über "}]
["SR-Link",{"$f":"IF(Linkwahl!Z458=\"\",\"\",Linkwahl!Z458)","v":""},{"$f":"IF(Linkwahl!Y458=\"\",\"\",Linkwahl!Y458)","v":"VeÜ-VwV"},{"$f":"IF(Linkwahl!AA458=\"\",\"\",Linkwahl!AA458)","v":"172.021.2"},{"$f":"IF(Linkwahl!AB458=\"\",\"\",Linkwahl!AB458)","v":"Übermittlungsverordnung Verwaltungsverfahren"}]
["SR-Link",{"$f":"IF(Linkwahl!Z459=\"\",\"\",Linkwahl!Z459)","v":""},{"$f":"IF(Linkwahl!Y459=\"\",\"\",Linkwahl!Y459)","v":"VeÜ-ZSSV"},{"$f":"IF(Linkwahl!AA459=\"\",\"\",Linkwahl!AA459)","v":"272.1"},{"$f":"IF(Linkwahl!AB459=\"\",\"\",Linkwahl!AB459)","v":"Übermittlungsverordnung Zivil-, Straf- + SchK-Verfahren"}]
["SR-Link",{"$f":"IF(Linkwahl!Z460=\"\",\"\",Linkwahl!Z460)","v":""},{"$f":"IF(Linkwahl!Y460=\"\",\"\",Linkwahl!Y460)","v":"VEV"},{"$f":"IF(Linkwahl!AA460=\"\",\"\",Linkwahl!AA460)","v":"142.204"},{"$f":"IF(Linkwahl!AB460=\"\",\"\",Linkwahl!AB460)","v":"Einreise- und Visumverfahren, VO über das"}]
["SR-Link",{"$f":"IF(Linkwahl!Z461=\"\",\"\",Linkwahl!Z461)","v":"r"},{"$f":"IF(Linkwahl!Y461=\"\",\"\",Linkwahl!Y461)","v":"V-FIFG"},{"$f":"IF(Linkwahl!AA461=\"\",\"\",Linkwahl!AA461)","v":"420.11"},{"$f":"IF(Linkwahl!AB461=\"\",\"\",Linkwahl!AB461)","v":"Forschungs- und Innovationsförderungsverordnung"}]
["SR-Link",{"$f":"IF(Linkwahl!Z462=\"\",\"\",Linkwahl!Z462)","v":""},{"$f":"IF(Linkwahl!Y462=\"\",\"\",Linkwahl!Y462)","v":"VG"},{"$f":"IF(Linkwahl!AA462=\"\",\"\",Linkwahl!AA462)","v":170.32},{"$f":"IF(Linkwahl!AB462=\"\",\"\",Linkwahl!AB462)","v":"Verantwortlichkeitsgesetz"}]
["SR-Link",{"$f":"IF(Linkwahl!Z463=\"\",\"\",Linkwahl!Z463)","v":""},{"$f":"IF(Linkwahl!Y463=\"\",\"\",Linkwahl!Y463)","v":"VGG"},{"$f":"IF(Linkwahl!AA463=\"\",\"\",Linkwahl!AA463)","v":173.32},{"$f":"IF(Linkwahl!AB463=\"\",\"\",Linkwahl!AB463)","v":"Verwaltungsgerichtsgesetz"}]
["SR-Link",{"$f":"IF(Linkwahl!Z464=\"\",\"\",Linkwahl!Z464)","v":"e"},{"$f":"IF(Linkwahl!Y464=\"\",\"\",Linkwahl!Y464)","v":"V-GSG"},{"$f":"IF(Linkwahl!AA464=\"\",\"\",Linkwahl!AA464)","v":"192.121"},{"$f":"IF(Linkwahl!AB464=\"\",\"\",Linkwahl!AB464)","v":"Gaststaatverordnung"}]
["SR-Link",{"$f":"IF(Linkwahl!Z465=\"\",\"\",Linkwahl!Z465)","v":"e"},{"$f":"IF(Linkwahl!Y465=\"\",\"\",Linkwahl!Y465)","v":"VGV"},{"$f":"IF(Linkwahl!AA465=\"\",\"\",Linkwahl!AA465)","v":"814.621"},{"$f":"IF(Linkwahl!AB465=\"\",\"\",Linkwahl!AB465)","v":"Getränkeverpackungen, VO über die"}]
["SR-Link",{"$f":"IF(Linkwahl!Z466=\"\",\"\",Linkwahl!Z466)","v":"e"},{"$f":"IF(Linkwahl!Y466=\"\",\"\",Linkwahl!Y466)","v":"VID"},{"$f":"IF(Linkwahl!AA466=\"\",\"\",Linkwahl!AA466)","v":"784.104.2"},{"$f":"IF(Linkwahl!AB466=\"\",\"\",Linkwahl!AB466)","v":"Internetdomains, VO über"}]
["SR-Link",{"$f":"IF(Linkwahl!Z467=\"\",\"\",Linkwahl!Z467)","v":""},{"$f":"IF(Linkwahl!Y467=\"\",\"\",Linkwahl!Y467)","v":"VIntA"},{"$f":"IF(Linkwahl!AA467=\"\",\"\",Linkwahl!AA467)","v":"142.205"},{"$f":"IF(Linkwahl!AB467=\"\",\"\",Linkwahl!AB467)","v":"Integration von Ausländerinnen und Ausländern, VO über die"}]
["SR-Link",{"$f":"IF(Linkwahl!Z468=\"\",\"\",Linkwahl!Z468)","v":"e"},{"$f":"IF(Linkwahl!Y468=\"\",\"\",Linkwahl!Y468)","v":"VISV"},{"$f":"IF(Linkwahl!AA468=\"\",\"\",Linkwahl!AA468)","v":"142.512"},{"$f":"IF(Linkwahl!AB468=\"\",\"\",Linkwahl!AB468)","v":"Visa-Informationssystem-Verordnung"}]
["SR-Link",{"$f":"IF(Linkwahl!Z469=\"\",\"\",Linkwahl!Z469)","v":""},{"$f":"IF(Linkwahl!Y469=\"\",\"\",Linkwahl!Y469)","v":"VKKG"},{"$f":"IF(Linkwahl!AA469=\"\",\"\",Linkwahl!AA469)","v":"221.214.11"},{"$f":"IF(Linkwahl!AB469=\"\",\"\",Linkwahl!AB469)","v":"Konsumkreditgesetz, VO zum "}]
["SR-Link",{"$f":"IF(Linkwahl!Z470=\"\",\"\",Linkwahl!Z470)","v":"e"},{"$f":"IF(Linkwahl!Y470=\"\",\"\",Linkwahl!Y470)","v":"VKU"},{"$f":"IF(Linkwahl!AA470=\"\",\"\",Linkwahl!AA470)","v":"251.4"},{"$f":"IF(Linkwahl!AB470=\"\",\"\",Linkwahl!AB470)","v":"Kontrolle von Unternehmenszusammenschlüssen, VO über die"}]
["SR-Link",{"$f":"IF(Linkwahl!Z471=\"\",\"\",Linkwahl!Z471)","v":"e"},{"$f":"IF(Linkwahl!Y471=\"\",\"\",Linkwahl!Y471)","v":"VlG"},{"$f":"IF(Linkwahl!AA471=\"\",\"\",Linkwahl!AA471)","v":"172.061"},{"$f":"IF(Linkwahl!AB471=\"\",\"\",Linkwahl!AB471)","v":"Vernehmlassungsgesetz,"}]
["SR-Link",{"$f":"IF(Linkwahl!Z472=\"\",\"\",Linkwahl!Z472)","v":"e"},{"$f":"IF(Linkwahl!Y472=\"\",\"\",Linkwahl!Y472)","v":"VLK"},{"$f":"IF(Linkwahl!AA472=\"\",\"\",Linkwahl!AA472)","v":"748.941"},{"$f":"IF(Linkwahl!AB472=\"\",\"\",Linkwahl!AB472)","v":"Luftfahrzeuge besonderer Kategorien, VO des UVEK über"}]
["SR-Link",{"$f":"IF(Linkwahl!Z473=\"\",\"\",Linkwahl!Z473)","v":""},{"$f":"IF(Linkwahl!Y473=\"\",\"\",Linkwahl!Y473)","v":"VMWG"},{"$f":"IF(Linkwahl!AA473=\"\",\"\",Linkwahl!AA473)","v":"221.213.11"},{"$f":"IF(Linkwahl!AB473=\"\",\"\",Linkwahl!AB473)","v":"Miete und Pacht von Wohn- und Geschäftsräumen, VO über die "}]
["SR-Link",{"$f":"IF(Linkwahl!Z474=\"\",\"\",Linkwahl!Z474)","v":""},{"$f":"IF(Linkwahl!Y474=\"\",\"\",Linkwahl!Y474)","v":"VöB"},{"$f":"IF(Linkwahl!AA474=\"\",\"\",Linkwahl!AA474)","v":"172.056.11"},{"$f":"IF(Linkwahl!AB474=\"\",\"\",Linkwahl!AB474)","v":"öffentliche Beschaffungswesen, VO über das"}]
["SR-Link",{"$f":"IF(Linkwahl!Z475=\"\",\"\",Linkwahl!Z475)","v":"e / r"},{"$f":"IF(Linkwahl!Y475=\"\",\"\",Linkwahl!Y475)","v":"VOBGÖ"},{"$f":"IF(Linkwahl!AA475=\"\",\"\",Linkwahl!AA475)","v":"152.31"},{"$f":"IF(Linkwahl!AB475=\"\",\"\",Linkwahl!AB475)","v":"Öffentlichkeitsverordnung"}]
["SR-Link",{"$f":"IF(Linkwahl!Z476=\"\",\"\",Linkwahl!Z476)","v":"e"},{"$f":"IF(Linkwahl!Y476=\"\",\"\",Linkwahl!Y476)","v":"VOCV"},{"$f":"IF(Linkwahl!AA476=\"\",\"\",Linkwahl!AA476)","v":"814.018"},{"$f":"IF(Linkwahl!AB476=\"\",\"\",Linkwahl!AB476)","v":"Lenkungsabgabe auf flüchtigen organischen Verbindungen, VO über die"}]
["SR-Link",{"$f":"IF(Linkwahl!Z477=\"\",\"\",Linkwahl!Z477)","v":""},{"$f":"IF(Linkwahl!Y477=\"\",\"\",Linkwahl!Y477)","v":"VOSA"},{"$f":"IF(Linkwahl!AA477=\"\",\"\",Linkwahl!AA477)","v":822.41099999999994},{"$f":"IF(Linkwahl!AB477=\"\",\"\",Linkwahl!AB477)","v":"Schwarzarbeit, VO gegen die"}]
["SR-Link",{"$f":"IF(Linkwahl!Z478=\"\",\"\",Linkwahl!Z478)","v":""},{"$f":"IF(Linkwahl!Y478=\"\",\"\",Linkwahl!Y478)","v":"VPB"},{"$f":"IF(Linkwahl!AA478=\"\",\"\",Linkwahl!AA478)","v":"745.11"},{"$f":"IF(Linkwahl!AB478=\"\",\"\",Linkwahl!AB478)","v":"Personenbeförderung, VO über die"}]
["SR-Link",{"$f":"IF(Linkwahl!Z479=\"\",\"\",Linkwahl!Z479)","v":"r"},{"$f":"IF(Linkwahl!Y479=\"\",\"\",Linkwahl!Y479)","v":"VPR"},{"$f":"IF(Linkwahl!AA479=\"\",\"\",Linkwahl!AA479)","v":"161.11"},{"$f":"IF(Linkwahl!AB479=\"\",\"\",Linkwahl!AB479)","v":"politische Rechte, VO über die"}]
["SR-Link",{"$f":"IF(Linkwahl!Z480=\"\",\"\",Linkwahl!Z480)","v":""},{"$f":"IF(Linkwahl!Y480=\"\",\"\",Linkwahl!Y480)","v":"VRV"},{"$f":"IF(Linkwahl!AA480=\"\",\"\",Linkwahl!AA480)","v":"741.11"},{"$f":"IF(Linkwahl!AB480=\"\",\"\",Linkwahl!AB480)","v":"Verkehrsregelnverordnung"}]
["SR-Link",{"$f":"IF(Linkwahl!Z481=\"\",\"\",Linkwahl!Z481)","v":""},{"$f":"IF(Linkwahl!Y481=\"\",\"\",Linkwahl!Y481)","v":"VSBG"},{"$f":"IF(Linkwahl!AA481=\"\",\"\",Linkwahl!AA481)","v":"935.521"},{"$f":"IF(Linkwahl!AB481=\"\",\"\",Linkwahl!AB481)","v":"Spielbankenverordnung"}]
["SR-Link",{"$f":"IF(Linkwahl!Z482=\"\",\"\",Linkwahl!Z482)","v":"e"},{"$f":"IF(Linkwahl!Y482=\"\",\"\",Linkwahl!Y482)","v":"VST"},{"$f":"IF(Linkwahl!AA482=\"\",\"\",Linkwahl!AA482)","v":"745.21"},{"$f":"IF(Linkwahl!AB482=\"\",\"\",Linkwahl!AB482)","v":"Sicherheitsorgane der Transportunternehmen im öffentlichen Verkehr, VO über die"}]
["SR-Link",{"$f":"IF(Linkwahl!Z483=\"\",\"\",Linkwahl!Z483)","v":"e"},{"$f":"IF(Linkwahl!Y483=\"\",\"\",Linkwahl!Y483)","v":"VStFG"},{"$f":"IF(Linkwahl!AA483=\"\",\"\",Linkwahl!AA483)","v":"810.311"},{"$f":"IF(Linkwahl!AB483=\"\",\"\",Linkwahl!AB483)","v":"Stammzellenforschungsverordnung"}]
["SR-Link",{"$f":"IF(Linkwahl!Z484=\"\",\"\",Linkwahl!Z484)","v":""},{"$f":"IF(Linkwahl!Y484=\"\",\"\",Linkwahl!Y484)","v":"VStG"},{"$f":"IF(Linkwahl!AA484=\"\",\"\",Linkwahl!AA484)","v":"642.21"},{"$f":"IF(Linkwahl!AB484=\"\",\"\",Linkwahl!AB484)","v":"Verrechnungssteuergesetz"}]
["SR-Link",{"$f":"IF(Linkwahl!Z485=\"\",\"\",Linkwahl!Z485)","v":""},{"$f":"IF(Linkwahl!Y485=\"\",\"\",Linkwahl!Y485)","v":"V-StGB-MStG"},{"$f":"IF(Linkwahl!AA485=\"\",\"\",Linkwahl!AA485)","v":"311.01"},{"$f":"IF(Linkwahl!AB485=\"\",\"\",Linkwahl!AB485)","v":"Strafgesetzbuch und Militärstrafgesetz, VO zum "}]
["SR-Link",{"$f":"IF(Linkwahl!Z486=\"\",\"\",Linkwahl!Z486)","v":"r"},{"$f":"IF(Linkwahl!Y486=\"\",\"\",Linkwahl!Y486)","v":"VStrR"},{"$f":"IF(Linkwahl!AA486=\"\",\"\",Linkwahl!AA486)","v":"313.0"},{"$f":"IF(Linkwahl!AB486=\"\",\"\",Linkwahl!AB486)","v":"Verwaltungsstrafrecht"}]
["SR-Link",{"$f":"IF(Linkwahl!Z487=\"\",\"\",Linkwahl!Z487)","v":"e"},{"$f":"IF(Linkwahl!Y487=\"\",\"\",Linkwahl!Y487)","v":"VSZV"},{"$f":"IF(Linkwahl!AA487=\"\",\"\",Linkwahl!AA487)","v":"742.161"},{"$f":"IF(Linkwahl!AB487=\"\",\"\",Linkwahl!AB487)","v":"Sicherheitsuntersuchung von Zwischenfällen im Verkehrswesen, VO über die"}]
["SR-Link",{"$f":"IF(Linkwahl!Z488=\"\",\"\",Linkwahl!Z488)","v":""},{"$f":"IF(Linkwahl!Y488=\"\",\"\",Linkwahl!Y488)","v":"VTS"},{"$f":"IF(Linkwahl!AA488=\"\",\"\",Linkwahl!AA488)","v":"741.41"},{"$f":"IF(Linkwahl!AB488=\"\",\"\",Linkwahl!AB488)","v":"technischen Anforderungen an Strassenfahrzeuge, VO über die"}]
["SR-Link",{"$f":"IF(Linkwahl!Z489=\"\",\"\",Linkwahl!Z489)","v":"e"},{"$f":"IF(Linkwahl!Y489=\"\",\"\",Linkwahl!Y489)","v":"VUB"},{"$f":"IF(Linkwahl!AA489=\"\",\"\",Linkwahl!AA489)","v":"946.31"},{"$f":"IF(Linkwahl!AB489=\"\",\"\",Linkwahl!AB489)","v":"Beglaubigung des nichtpräferenziellen Ursprungs von Waren, VO über die"}]
["SR-Link",{"$f":"IF(Linkwahl!Z490=\"\",\"\",Linkwahl!Z490)","v":"e"},{"$f":"IF(Linkwahl!Y490=\"\",\"\",Linkwahl!Y490)","v":"VUB-EVD"},{"$f":"IF(Linkwahl!AA490=\"\",\"\",Linkwahl!AA490)","v":"946.311"},{"$f":"IF(Linkwahl!AB490=\"\",\"\",Linkwahl!AB490)","v":"Beglaubigung des nichtpräferenziellen Ursprungs von Waren, EVD-VO über die"}]
["SR-Link",{"$f":"IF(Linkwahl!Z491=\"\",\"\",Linkwahl!Z491)","v":""},{"$f":"IF(Linkwahl!Y491=\"\",\"\",Linkwahl!Y491)","v":"VUV"},{"$f":"IF(Linkwahl!AA491=\"\",\"\",Linkwahl!AA491)","v":"832.30"},{"$f":"IF(Linkwahl!AB491=\"\",\"\",Linkwahl!AB491)","v":"Unfallverhütung, Verordnung über die "}]
["SR-Link",{"$f":"IF(Linkwahl!Z492=\"\",\"\",Linkwahl!Z492)","v":""},{"$f":"IF(Linkwahl!Y492=\"\",\"\",Linkwahl!Y492)","v":"VVAG"},{"$f":"IF(Linkwahl!AA492=\"\",\"\",Linkwahl!AA492)","v":"281.41"},{"$f":"IF(Linkwahl!AB492=\"\",\"\",Linkwahl!AB492)","v":"Pfändung und Verwertung von Anteilen an Gemeinschaftsvermögen, VO Bundesgericht über die "}]
["SR-Link",{"$f":"IF(Linkwahl!Z493=\"\",\"\",Linkwahl!Z493)","v":""},{"$f":"IF(Linkwahl!Y493=\"\",\"\",Linkwahl!Y493)","v":"VVG"},{"$f":"IF(Linkwahl!AA493=\"\",\"\",Linkwahl!AA493)","v":"221.229.1"},{"$f":"IF(Linkwahl!AB493=\"\",\"\",Linkwahl!AB493)","v":"Versicherungsvertragsgesetz"}]
["SR-Link",{"$f":"IF(Linkwahl!Z494=\"\",\"\",Linkwahl!Z494)","v":""},{"$f":"IF(Linkwahl!Y494=\"\",\"\",Linkwahl!Y494)","v":"VVV"},{"$f":"IF(Linkwahl!AA494=\"\",\"\",Linkwahl!AA494)","v":"741.31"},{"$f":"IF(Linkwahl!AB494=\"\",\"\",Linkwahl!AB494)","v":"Verkehrsversicherungsverordnung"}]
["SR-Link",{"$f":"IF(Linkwahl!Z495=\"\",\"\",Linkwahl!Z495)","v":""},{"$f":"IF(Linkwahl!Y495=\"\",\"\",Linkwahl!Y495)","v":"VVWA"},{"$f":"IF(Linkwahl!AA495=\"\",\"\",Linkwahl!AA495)","v":"142.281"},{"$f":"IF(Linkwahl!AB495=\"\",\"\",Linkwahl!AB495)","v":"Vollzug der Weg- und Ausweisung von ausländischen Personen, VO über den"}]
["SR-Link",{"$f":"IF(Linkwahl!Z496=\"\",\"\",Linkwahl!Z496)","v":"e / r"},{"$f":"IF(Linkwahl!Y496=\"\",\"\",Linkwahl!Y496)","v":"VwVG"},{"$f":"IF(Linkwahl!AA496=\"\",\"\",Linkwahl!AA496)","v":172.02099999999999},{"$f":"IF(Linkwahl!AB496=\"\",\"\",Linkwahl!AB496)","v":"Verwaltungsverfahrensgesetz"}]
["SR-Link",{"$f":"IF(Linkwahl!Z497=\"\",\"\",Linkwahl!Z497)","v":""},{"$f":"IF(Linkwahl!Y497=\"\",\"\",Linkwahl!Y497)","v":"VZAE"},{"$f":"IF(Linkwahl!AA497=\"\",\"\",Linkwahl!AA497)","v":"142.201"},{"$f":"IF(Linkwahl!AB497=\"\",\"\",Linkwahl!AB497)","v":"Zulassung, Aufenthalt + Erwerbstätigkeit, VO über "}]
["SR-Link",{"$f":"IF(Linkwahl!Z498=\"\",\"\",Linkwahl!Z498)","v":"e"},{"$f":"IF(Linkwahl!Y498=\"\",\"\",Linkwahl!Y498)","v":"VZäG"},{"$f":"IF(Linkwahl!AA498=\"\",\"\",Linkwahl!AA498)","v":"431.112"},{"$f":"IF(Linkwahl!AB498=\"\",\"\",Linkwahl!AB498)","v":"Volkszählungsgesetz"}]
["SR-Link",{"$f":"IF(Linkwahl!Z499=\"\",\"\",Linkwahl!Z499)","v":""},{"$f":"IF(Linkwahl!Y499=\"\",\"\",Linkwahl!Y499)","v":"VZertES"},{"$f":"IF(Linkwahl!AA499=\"\",\"\",Linkwahl!AA499)","v":"943.032"},{"$f":"IF(Linkwahl!AB499=\"\",\"\",Linkwahl!AB499)","v":"VO über die elektronische Signatur"}]
["SR-Link",{"$f":"IF(Linkwahl!Z500=\"\",\"\",Linkwahl!Z500)","v":""},{"$f":"IF(Linkwahl!Y500=\"\",\"\",Linkwahl!Y500)","v":"VZG"},{"$f":"IF(Linkwahl!AA500=\"\",\"\",Linkwahl!AA500)","v":"281.42"},{"$f":"IF(Linkwahl!AB500=\"\",\"\",Linkwahl!AB500)","v":"Zwangsverwertung von Grundstücken, VO Bundesgericht über die "}]
["SR-Link",{"$f":"IF(Linkwahl!Z501=\"\",\"\",Linkwahl!Z501)","v":""},{"$f":"IF(Linkwahl!Y501=\"\",\"\",Linkwahl!Y501)","v":"VZV"},{"$f":"IF(Linkwahl!AA501=\"\",\"\",Linkwahl!AA501)","v":"741.51"},{"$f":"IF(Linkwahl!AB501=\"\",\"\",Linkwahl!AB501)","v":"Verkehrszulassungsverordnung"}]
["SR-Link",{"$f":"IF(Linkwahl!Z502=\"\",\"\",Linkwahl!Z502)","v":"e"},{"$f":"IF(Linkwahl!Y502=\"\",\"\",Linkwahl!Y502)","v":"WaG"},{"$f":"IF(Linkwahl!AA502=\"\",\"\",Linkwahl!AA502)","v":"921.0"},{"$f":"IF(Linkwahl!AB502=\"\",\"\",Linkwahl!AB502)","v":"Waldgesetz"}]
["SR-Link",{"$f":"IF(Linkwahl!Z503=\"\",\"\",Linkwahl!Z503)","v":"e"},{"$f":"IF(Linkwahl!Y503=\"\",\"\",Linkwahl!Y503)","v":"WaV"},{"$f":"IF(Linkwahl!AA503=\"\",\"\",Linkwahl!AA503)","v":"921.01"},{"$f":"IF(Linkwahl!AB503=\"\",\"\",Linkwahl!AB503)","v":"Waldverordnung"}]
["SR-Link",{"$f":"IF(Linkwahl!Z504=\"\",\"\",Linkwahl!Z504)","v":"r"},{"$f":"IF(Linkwahl!Y504=\"\",\"\",Linkwahl!Y504)","v":"WBG"},{"$f":"IF(Linkwahl!AA504=\"\",\"\",Linkwahl!AA504)","v":"721.100"},{"$f":"IF(Linkwahl!AB504=\"\",\"\",Linkwahl!AB504)","v":"Wasserbau, BG über den"}]
["SR-Link",{"$f":"IF(Linkwahl!Z505=\"\",\"\",Linkwahl!Z505)","v":"r"},{"$f":"IF(Linkwahl!Y505=\"\",\"\",Linkwahl!Y505)","v":"WBV"},{"$f":"IF(Linkwahl!AA505=\"\",\"\",Linkwahl!AA505)","v":"721.100.1"},{"$f":"IF(Linkwahl!AB505=\"\",\"\",Linkwahl!AB505)","v":"Wasserbau, VO über den"}]
["SR-Link",{"$f":"IF(Linkwahl!Z506=\"\",\"\",Linkwahl!Z506)","v":""},{"$f":"IF(Linkwahl!Y506=\"\",\"\",Linkwahl!Y506)","v":"WEG"},{"$f":"IF(Linkwahl!AA506=\"\",\"\",Linkwahl!AA506)","v":"843"},{"$f":"IF(Linkwahl!AB506=\"\",\"\",Linkwahl!AB506)","v":"Wohnbau- und Eigentumsförderungsgesetz"}]
["SR-Link",{"$f":"IF(Linkwahl!Z507=\"\",\"\",Linkwahl!Z507)","v":""},{"$f":"IF(Linkwahl!Y507=\"\",\"\",Linkwahl!Y507)","v":"WG"},{"$f":"IF(Linkwahl!AA507=\"\",\"\",Linkwahl!AA507)","v":"514.54"},{"$f":"IF(Linkwahl!AB507=\"\",\"\",Linkwahl!AB507)","v":"Waffengesetz"}]
["SR-Link",{"$f":"IF(Linkwahl!Z508=\"\",\"\",Linkwahl!Z508)","v":""},{"$f":"IF(Linkwahl!Y508=\"\",\"\",Linkwahl!Y508)","v":"WPEG"},{"$f":"IF(Linkwahl!AA508=\"\",\"\",Linkwahl!AA508)","v":"661"},{"$f":"IF(Linkwahl!AB508=\"\",\"\",Linkwahl!AB508)","v":"Wehrpflichtersatzabgabe, BG über die "}]
["SR-Link",{"$f":"IF(Linkwahl!Z509=\"\",\"\",Linkwahl!Z509)","v":""},{"$f":"IF(Linkwahl!Y509=\"\",\"\",Linkwahl!Y509)","v":"WPEV"},{"$f":"IF(Linkwahl!AA509=\"\",\"\",Linkwahl!AA509)","v":"661.1"},{"$f":"IF(Linkwahl!AB509=\"\",\"\",Linkwahl!AB509)","v":"Wehrpflichtersatzabgabe, VO über die "}]
["SR-Link",{"$f":"IF(Linkwahl!Z510=\"\",\"\",Linkwahl!Z510)","v":""},{"$f":"IF(Linkwahl!Y510=\"\",\"\",Linkwahl!Y510)","v":"WRG"},{"$f":"IF(Linkwahl!AA510=\"\",\"\",Linkwahl!AA510)","v":"721.80"},{"$f":"IF(Linkwahl!AB510=\"\",\"\",Linkwahl!AB510)","v":"Wasserrechtsgesetz"}]
["SR-Link",{"$f":"IF(Linkwahl!Z511=\"\",\"\",Linkwahl!Z511)","v":"e"},{"$f":"IF(Linkwahl!Y511=\"\",\"\",Linkwahl!Y511)","v":"WSchG"},{"$f":"IF(Linkwahl!AA511=\"\",\"\",Linkwahl!AA511)","v":"232.21"},{"$f":"IF(Linkwahl!AB511=\"\",\"\",Linkwahl!AB511)","v":"Wappenschutzgesetz"}]
["SR-Link",{"$f":"IF(Linkwahl!Z512=\"\",\"\",Linkwahl!Z512)","v":"e"},{"$f":"IF(Linkwahl!Y512=\"\",\"\",Linkwahl!Y512)","v":"WZG"},{"$f":"IF(Linkwahl!AA512=\"\",\"\",Linkwahl!AA512)","v":"941.10"},{"$f":"IF(Linkwahl!AB512=\"\",\"\",Linkwahl!AB512)","v":"Währung und die Zahlungsmittel. BG über die"}]
["SR-Link",{"$f":"IF(Linkwahl!Z513=\"\",\"\",Linkwahl!Z513)","v":""},{"$f":"IF(Linkwahl!Y513=\"\",\"\",Linkwahl!Y513)","v":"ZertES"},{"$f":"IF(Linkwahl!AA513=\"\",\"\",Linkwahl!AA513)","v":"943.03"},{"$f":"IF(Linkwahl!AB513=\"\",\"\",Linkwahl!AB513)","v":"BG über die elektronische Signatur"}]
["SR-Link",{"$f":"IF(Linkwahl!Z514=\"\",\"\",Linkwahl!Z514)","v":""},{"$f":"IF(Linkwahl!Y514=\"\",\"\",Linkwahl!Y514)","v":"ZG"},{"$f":"IF(Linkwahl!AA514=\"\",\"\",Linkwahl!AA514)","v":"631.0"},{"$f":"IF(Linkwahl!AB514=\"\",\"\",Linkwahl!AB514)","v":"Zollgesetz"}]
["SR-Link",{"$f":"IF(Linkwahl!Z515=\"\",\"\",Linkwahl!Z515)","v":"e / r"},{"$f":"IF(Linkwahl!Y515=\"\",\"\",Linkwahl!Y515)","v":"ZGB"},{"$f":"IF(Linkwahl!AA515=\"\",\"\",Linkwahl!AA515)","v":210},{"$f":"IF(Linkwahl!AB515=\"\",\"\",Linkwahl!AB515)","v":"Zivilgesetzbuch"}]
["SR-Link",{"$f":"IF(Linkwahl!Z516=\"\",\"\",Linkwahl!Z516)","v":"e / r"},{"$f":"IF(Linkwahl!Y516=\"\",\"\",Linkwahl!Y516)","v":"ZPO"},{"$f":"IF(Linkwahl!AA516=\"\",\"\",Linkwahl!AA516)","v":"272"},{"$f":"IF(Linkwahl!AB516=\"\",\"\",Linkwahl!AB516)","v":"Zivilprozessordnung"}]
["SR-Link",{"$f":"IF(Linkwahl!Z517=\"\",\"\",Linkwahl!Z517)","v":""},{"$f":"IF(Linkwahl!Y517=\"\",\"\",Linkwahl!Y517)","v":"ZStV"},{"$f":"IF(Linkwahl!AA517=\"\",\"\",Linkwahl!AA517)","v":"211.112.2"},{"$f":"IF(Linkwahl!AB517=\"\",\"\",Linkwahl!AB517)","v":"Zivilstandsverordnung"}]
["SR-Link",{"$f":"IF(Linkwahl!Z518=\"\",\"\",Linkwahl!Z518)","v":"e"},{"$f":"IF(Linkwahl!Y518=\"\",\"\",Linkwahl!Y518)","v":"ZTG"},{"$f":"IF(Linkwahl!AA518=\"\",\"\",Linkwahl!AA518)","v":"632.10"},{"$f":"IF(Linkwahl!AB518=\"\",\"\",Linkwahl!AB518)","v":"Zolltarifgesetz"}]
[{"$f":"IF(D388=\"\",\"\",HYPERLINK(\"http://www.admin.ch/ch/d/sr/c\"&SUBSTITUTE(D388,\".\",\"_\")&\".html\",\"SR-Link\"))","v":"SR-Link"},{"$f":"IF(Linkwahl!Z519=\"\",\"\",Linkwahl!Z519)","v":""},{"$f":"IF(Linkwahl!Y519=\"\",\"\",Linkwahl!Y519)","v":"ZUG"},{"$f":"IF(Linkwahl!AA519=\"\",\"\",Linkwahl!AA519)","v":"851.1"},{"$f":"IF(Linkwahl!AB519=\"\",\"\",Linkwahl!AB519)","v":"Zuständigkeitsgesetz"}]
["SR-Link",{"$f":"IF(Linkwahl!Z520=\"\",\"\",Linkwahl!Z520)","v":""},{"$f":"IF(Linkwahl!Y520=\"\",\"\",Linkwahl!Y520)","v":"ZV"},{"$f":"IF(Linkwahl!AA520=\"\",\"\",Linkwahl!AA520)","v":"631.01"},{"$f":"IF(Linkwahl!AB520=\"\",\"\",Linkwahl!AB520)","v":"Zollverordnung"}]
["SR-Link",{"$f":"IF(Linkwahl!Z521=\"\",\"\",Linkwahl!Z521)","v":""},{"$f":"IF(Linkwahl!Y521=\"\",\"\",Linkwahl!Y521)","v":"ZV-EFD"},{"$f":"IF(Linkwahl!AA521=\"\",\"\",Linkwahl!AA521)","v":"631.011"},{"$f":"IF(Linkwahl!AB521=\"\",\"\",Linkwahl!AB521)","v":"Zollverordnung des EFD"}]
["SR-Link",{"$f":"IF(Linkwahl!Z522=\"\",\"\",Linkwahl!Z522)","v":"r"},{"$f":"IF(Linkwahl!Y522=\"\",\"\",Linkwahl!Y522)","v":"ZWG"},{"$f":"IF(Linkwahl!AA522=\"\",\"\",Linkwahl!AA522)","v":"702"},{"$f":"IF(Linkwahl!AB522=\"\",\"\",Linkwahl!AB522)","v":"Zweitwohnungsgesetz"}]
["SR-Link",{"$f":"IF(Linkwahl!Z523=\"\",\"\",Linkwahl!Z523)","v":"r"},{"$f":"IF(Linkwahl!Y523=\"\",\"\",Linkwahl!Y523)","v":"ZWV"},{"$f":"IF(Linkwahl!AA523=\"\",\"\",Linkwahl!AA523)","v":"702.1"},{"$f":"IF(Linkwahl!AB523=\"\",\"\",Linkwahl!AB523)","v":"Zweitwohnungverordnung"}]
["",{"$f":"IF(Linkwahl!Z524=\"\",\"\",Linkwahl!Z524)","v":""},{"$f":"IF(Linkwahl!Y524=\"\",\"\",Linkwahl!Y524)","v":""},{"$f":"IF(Linkwahl!AA524=\"\",\"\",Linkwahl!AA524)","v":""},{"$f":"IF(Linkwahl!AB524=\"\",\"\",Linkwahl!AB524)","v":""}]
[{"$f":"IF(D394=\"\",\"\",HYPERLINK(\"http://www.admin.ch/ch/d/sr/c\"&SUBSTITUTE(D394,\".\",\"_\")&\".html\",\"SR-Link\"))","v":""},{"$f":"IF(Linkwahl!Z526=\"\",\"\",Linkwahl!Z526)","v":""},{"$f":"IF(Linkwahl!Y526=\"\",\"\",Linkwahl!Y526)","v":""},{"$f":"IF(Linkwahl!AA526=\"\",\"\",Linkwahl!AA526)","v":""},{"$f":"IF(Linkwahl!AB526=\"\",\"\",Linkwahl!AB526)","v":""}]
["",{"$f":"IF(Linkwahl!Z527=\"\",\"\",Linkwahl!Z527)","v":""},{"$f":"IF(Linkwahl!Y527=\"\",\"\",Linkwahl!Y527)","v":""},{"$f":"IF(Linkwahl!AA527=\"\",\"\",Linkwahl!AA527)","v":""},{"$f":"IF(Linkwahl!AB527=\"\",\"\",Linkwahl!AB527)","v":""}]
["",{"$f":"IF(Linkwahl!Z528=\"\",\"\",Linkwahl!Z528)","v":" "},{"$f":"IF(Linkwahl!Y528=\"\",\"\",Linkwahl!Y528)","v":""},{"$f":"IF(Linkwahl!AA528=\"\",\"\",Linkwahl!AA528)","v":""},{"$f":"IF(Linkwahl!AB528=\"\",\"\",Linkwahl!AB528)","v":""}]
["",{"$f":"IF(Linkwahl!Z529=\"\",\"\",Linkwahl!Z529)","v":" "},{"$f":"IF(Linkwahl!Y529=\"\",\"\",Linkwahl!Y529)","v":""},{"$f":"IF(Linkwahl!AA529=\"\",\"\",Linkwahl!AA529)","v":""},{"$f":"IF(Linkwahl!AB529=\"\",\"\",Linkwahl!AB529)","v":""}]
["",{"$f":"IF(Linkwahl!Z530=\"\",\"\",Linkwahl!Z530)","v":" "},{"$f":"IF(Linkwahl!Y530=\"\",\"\",Linkwahl!Y530)","v":""},{"$f":"IF(Linkwahl!AA530=\"\",\"\",Linkwahl!AA530)","v":""},{"$f":"IF(Linkwahl!AB530=\"\",\"\",Linkwahl!AB530)","v":""}]
["",{"$f":"IF(Linkwahl!Z531=\"\",\"\",Linkwahl!Z531)","v":" "},{"$f":"IF(Linkwahl!Y531=\"\",\"\",Linkwahl!Y531)","v":""},{"$f":"IF(Linkwahl!AA531=\"\",\"\",Linkwahl!AA531)","v":""},{"$f":"IF(Linkwahl!AB531=\"\",\"\",Linkwahl!AB531)","v":""}]
["",{"$f":"IF(Linkwahl!Z532=\"\",\"\",Linkwahl!Z532)","v":" "},{"$f":"IF(Linkwahl!Y532=\"\",\"\",Linkwahl!Y532)","v":""},{"$f":"IF(Linkwahl!AA532=\"\",\"\",Linkwahl!AA532)","v":""},{"$f":"IF(Linkwahl!AB532=\"\",\"\",Linkwahl!AB532)","v":""}]
["",{"$f":"IF(Linkwahl!Z533=\"\",\"\",Linkwahl!Z533)","v":" "},{"$f":"IF(Linkwahl!Y533=\"\",\"\",Linkwahl!Y533)","v":""},{"$f":"IF(Linkwahl!AA533=\"\",\"\",Linkwahl!AA533)","v":""},{"$f":"IF(Linkwahl!AB533=\"\",\"\",Linkwahl!AB533)","v":""}]
["",{"$f":"IF(Linkwahl!Z534=\"\",\"\",Linkwahl!Z534)","v":" "},{"$f":"IF(Linkwahl!Y534=\"\",\"\",Linkwahl!Y534)","v":""},{"$f":"IF(Linkwahl!AA534=\"\",\"\",Linkwahl!AA534)","v":""},{"$f":"IF(Linkwahl!AB534=\"\",\"\",Linkwahl!AB534)","v":""}]
["",{"$f":"IF(Linkwahl!Z535=\"\",\"\",Linkwahl!Z535)","v":" "},{"$f":"IF(Linkwahl!Y535=\"\",\"\",Linkwahl!Y535)","v":""},{"$f":"IF(Linkwahl!AA535=\"\",\"\",Linkwahl!AA535)","v":""},{"$f":"IF(Linkwahl!AB535=\"\",\"\",Linkwahl!AB535)","v":""}]
["",{"$f":"IF(Linkwahl!Z536=\"\",\"\",Linkwahl!Z536)","v":" "},{"$f":"IF(Linkwahl!Y536=\"\",\"\",Linkwahl!Y536)","v":""},{"$f":"IF(Linkwahl!AA536=\"\",\"\",Linkwahl!AA536)","v":""},{"$f":"IF(Linkwahl!AB536=\"\",\"\",Linkwahl!AB536)","v":""}]
["",{"$f":"IF(Linkwahl!Z537=\"\",\"\",Linkwahl!Z537)","v":" "},{"$f":"IF(Linkwahl!Y537=\"\",\"\",Linkwahl!Y537)","v":""},{"$f":"IF(Linkwahl!AA537=\"\",\"\",Linkwahl!AA537)","v":""},{"$f":"IF(Linkwahl!AB537=\"\",\"\",Linkwahl!AB537)","v":""}]
["",{"$f":"IF(Linkwahl!Z538=\"\",\"\",Linkwahl!Z538)","v":" "},{"$f":"IF(Linkwahl!Y538=\"\",\"\",Linkwahl!Y538)","v":""},{"$f":"IF(Linkwahl!AA538=\"\",\"\",Linkwahl!AA538)","v":""},{"$f":"IF(Linkwahl!AB538=\"\",\"\",Linkwahl!AB538)","v":""}]
["",{"$f":"IF(Linkwahl!Z539=\"\",\"\",Linkwahl!Z539)","v":" "},{"$f":"IF(Linkwahl!Y539=\"\",\"\",Linkwahl!Y539)","v":""},{"$f":"IF(Linkwahl!AA539=\"\",\"\",Linkwahl!AA539)","v":""},{"$f":"IF(Linkwahl!AB539=\"\",\"\",Linkwahl!AB539)","v":""}]
["",{"$f":"IF(Linkwahl!Z540=\"\",\"\",Linkwahl!Z540)","v":" "},{"$f":"IF(Linkwahl!Y540=\"\",\"\",Linkwahl!Y540)","v":""},{"$f":"IF(Linkwahl!AA540=\"\",\"\",Linkwahl!AA540)","v":""},{"$f":"IF(Linkwahl!AB540=\"\",\"\",Linkwahl!AB540)","v":""}]
["",{"$f":"IF(Linkwahl!Z541=\"\",\"\",Linkwahl!Z541)","v":" "},{"$f":"IF(Linkwahl!Y541=\"\",\"\",Linkwahl!Y541)","v":""},{"$f":"IF(Linkwahl!AA541=\"\",\"\",Linkwahl!AA541)","v":""},{"$f":"IF(Linkwahl!AB541=\"\",\"\",Linkwahl!AB541)","v":""}]
["",{"$f":"IF(Linkwahl!Z542=\"\",\"\",Linkwahl!Z542)","v":" "},{"$f":"IF(Linkwahl!Y542=\"\",\"\",Linkwahl!Y542)","v":""},{"$f":"IF(Linkwahl!AA542=\"\",\"\",Linkwahl!AA542)","v":""},{"$f":"IF(Linkwahl!AB542=\"\",\"\",Linkwahl!AB542)","v":""}]
["",{"$f":"IF(Linkwahl!Z543=\"\",\"\",Linkwahl!Z543)","v":" "},{"$f":"IF(Linkwahl!Y543=\"\",\"\",Linkwahl!Y543)","v":""},{"$f":"IF(Linkwahl!AA543=\"\",\"\",Linkwahl!AA543)","v":""},{"$f":"IF(Linkwahl!AB543=\"\",\"\",Linkwahl!AB543)","v":""}]
["",{"$f":"IF(Linkwahl!Z544=\"\",\"\",Linkwahl!Z544)","v":" "},{"$f":"IF(Linkwahl!Y544=\"\",\"\",Linkwahl!Y544)","v":""},{"$f":"IF(Linkwahl!AA544=\"\",\"\",Linkwahl!AA544)","v":""},{"$f":"IF(Linkwahl!AB544=\"\",\"\",Linkwahl!AB544)","v":""}]
["",{"$f":"IF(Linkwahl!Z545=\"\",\"\",Linkwahl!Z545)","v":""},{"$f":"IF(Linkwahl!Y545=\"\",\"\",Linkwahl!Y545)","v":""},{"$f":"IF(Linkwahl!AA545=\"\",\"\",Linkwahl!AA545)","v":""},{"$f":"IF(Linkwahl!AB545=\"\",\"\",Linkwahl!AB545)","v":""}]
["",{"$f":"IF(Linkwahl!Z546=\"\",\"\",Linkwahl!Z546)","v":""},{"$f":"IF(Linkwahl!Y546=\"\",\"\",Linkwahl!Y546)","v":""},{"$f":"IF(Linkwahl!AA546=\"\",\"\",Linkwahl!AA546)","v":""},{"$f":"IF(Linkwahl!AB546=\"\",\"\",Linkwahl!AB546)","v":""}]
["",{"$f":"IF(Linkwahl!Z547=\"\",\"\",Linkwahl!Z547)","v":""},{"$f":"IF(Linkwahl!Y547=\"\",\"\",Linkwahl!Y547)","v":""},{"$f":"IF(Linkwahl!AA547=\"\",\"\",Linkwahl!AA547)","v":""},{"$f":"IF(Linkwahl!AB547=\"\",\"\",Linkwahl!AB547)","v":""}]
["",{"$f":"IF(Linkwahl!Z548=\"\",\"\",Linkwahl!Z548)","v":""},{"$f":"IF(Linkwahl!Y548=\"\",\"\",Linkwahl!Y548)","v":""},{"$f":"IF(Linkwahl!AA548=\"\",\"\",Linkwahl!AA548)","v":""},{"$f":"IF(Linkwahl!AB548=\"\",\"\",Linkwahl!AB548)","v":""}]
["",{"$f":"IF(Linkwahl!Z549=\"\",\"\",Linkwahl!Z549)","v":""},{"$f":"IF(Linkwahl!Y549=\"\",\"\",Linkwahl!Y549)","v":""},{"$f":"IF(Linkwahl!AA549=\"\",\"\",Linkwahl!AA549)","v":""},{"$f":"IF(Linkwahl!AB549=\"\",\"\",Linkwahl!AB549)","v":""}]
["",{"$f":"IF(Linkwahl!Z550=\"\",\"\",Linkwahl!Z550)","v":""},{"$f":"IF(Linkwahl!Y550=\"\",\"\",Linkwahl!Y550)","v":""},{"$f":"IF(Linkwahl!AA550=\"\",\"\",Linkwahl!AA550)","v":""},{"$f":"IF(Linkwahl!AB550=\"\",\"\",Linkwahl!AB550)","v":""}]
["",{"$f":"IF(Linkwahl!Z551=\"\",\"\",Linkwahl!Z551)","v":""},{"$f":"IF(Linkwahl!Y551=\"\",\"\",Linkwahl!Y551)","v":""},{"$f":"IF(Linkwahl!AA551=\"\",\"\",Linkwahl!AA551)","v":""},{"$f":"IF(Linkwahl!AB551=\"\",\"\",Linkwahl!AB551)","v":""}]
["",{"$f":"IF(Linkwahl!Z552=\"\",\"\",Linkwahl!Z552)","v":""},{"$f":"IF(Linkwahl!Y552=\"\",\"\",Linkwahl!Y552)","v":""},{"$f":"IF(Linkwahl!AA552=\"\",\"\",Linkwahl!AA552)","v":""},{"$f":"IF(Linkwahl!AB552=\"\",\"\",Linkwahl!AB552)","v":""}]
["",{"$f":"IF(Linkwahl!Z553=\"\",\"\",Linkwahl!Z553)","v":""},{"$f":"IF(Linkwahl!Y553=\"\",\"\",Linkwahl!Y553)","v":""},{"$f":"IF(Linkwahl!AA553=\"\",\"\",Linkwahl!AA553)","v":""},{"$f":"IF(Linkwahl!AB553=\"\",\"\",Linkwahl!AB553)","v":""}]
["",{"$f":"IF(Linkwahl!Z554=\"\",\"\",Linkwahl!Z554)","v":""},{"$f":"IF(Linkwahl!Y554=\"\",\"\",Linkwahl!Y554)","v":""},{"$f":"IF(Linkwahl!AA554=\"\",\"\",Linkwahl!AA554)","v":""},{"$f":"IF(Linkwahl!AB554=\"\",\"\",Linkwahl!AB554)","v":""}]
["",{"$f":"IF(Linkwahl!Z555=\"\",\"\",Linkwahl!Z555)","v":""},{"$f":"IF(Linkwahl!Y555=\"\",\"\",Linkwahl!Y555)","v":""},{"$f":"IF(Linkwahl!AA555=\"\",\"\",Linkwahl!AA555)","v":""},{"$f":"IF(Linkwahl!AB555=\"\",\"\",Linkwahl!AB555)","v":""}]
["",{"$f":"IF(Linkwahl!Z556=\"\",\"\",Linkwahl!Z556)","v":""},{"$f":"IF(Linkwahl!Y556=\"\",\"\",Linkwahl!Y556)","v":""},{"$f":"IF(Linkwahl!AA556=\"\",\"\",Linkwahl!AA556)","v":""},{"$f":"IF(Linkwahl!AB556=\"\",\"\",Linkwahl!AB556)","v":""}]
["",{"$f":"IF(Linkwahl!Z557=\"\",\"\",Linkwahl!Z557)","v":""},{"$f":"IF(Linkwahl!Y557=\"\",\"\",Linkwahl!Y557)","v":""},{"$f":"IF(Linkwahl!AA557=\"\",\"\",Linkwahl!AA557)","v":""},{"$f":"IF(Linkwahl!AB557=\"\",\"\",Linkwahl!AB557)","v":""}]
["",{"$f":"IF(Linkwahl!Z558=\"\",\"\",Linkwahl!Z558)","v":""},{"$f":"IF(Linkwahl!Y558=\"\",\"\",Linkwahl!Y558)","v":""},{"$f":"IF(Linkwahl!AA558=\"\",\"\",Linkwahl!AA558)","v":""},{"$f":"IF(Linkwahl!AB558=\"\",\"\",Linkwahl!AB558)","v":""}]
["",{"$f":"IF(Linkwahl!Z559=\"\",\"\",Linkwahl!Z559)","v":""},{"$f":"IF(Linkwahl!Y559=\"\",\"\",Linkwahl!Y559)","v":""},{"$f":"IF(Linkwahl!AA559=\"\",\"\",Linkwahl!AA559)","v":""},{"$f":"IF(Linkwahl!AB559=\"\",\"\",Linkwahl!AB559)","v":""}]
["",{"$f":"IF(Linkwahl!Z560=\"\",\"\",Linkwahl!Z560)","v":""},{"$f":"IF(Linkwahl!Y560=\"\",\"\",Linkwahl!Y560)","v":""},{"$f":"IF(Linkwahl!AA560=\"\",\"\",Linkwahl!AA560)","v":""},{"$f":"IF(Linkwahl!AB560=\"\",\"\",Linkwahl!AB560)","v":""}]
["",{"$f":"IF(Linkwahl!Z561=\"\",\"\",Linkwahl!Z561)","v":""},{"$f":"IF(Linkwahl!Y561=\"\",\"\",Linkwahl!Y561)","v":""},{"$f":"IF(Linkwahl!AA561=\"\",\"\",Linkwahl!AA561)","v":""},{"$f":"IF(Linkwahl!AB561=\"\",\"\",Linkwahl!AB561)","v":""}]
["",{"$f":"IF(Linkwahl!Z562=\"\",\"\",Linkwahl!Z562)","v":""},{"$f":"IF(Linkwahl!Y562=\"\",\"\",Linkwahl!Y562)","v":""},{"$f":"IF(Linkwahl!AA562=\"\",\"\",Linkwahl!AA562)","v":""},{"$f":"IF(Linkwahl!AB562=\"\",\"\",Linkwahl!AB562)","v":""}]
["",{"$f":"IF(Linkwahl!Z563=\"\",\"\",Linkwahl!Z563)","v":""},{"$f":"IF(Linkwahl!Y563=\"\",\"\",Linkwahl!Y563)","v":""},{"$f":"IF(Linkwahl!AA563=\"\",\"\",Linkwahl!AA563)","v":""},{"$f":"IF(Linkwahl!AB563=\"\",\"\",Linkwahl!AB563)","v":""}]
["",{"$f":"IF(Linkwahl!Z564=\"\",\"\",Linkwahl!Z564)","v":""},{"$f":"IF(Linkwahl!Y564=\"\",\"\",Linkwahl!Y564)","v":""},{"$f":"IF(Linkwahl!AA564=\"\",\"\",Linkwahl!AA564)","v":""},{"$f":"IF(Linkwahl!AB564=\"\",\"\",Linkwahl!AB564)","v":""}]
["",{"$f":"IF(Linkwahl!Z565=\"\",\"\",Linkwahl!Z565)","v":""},{"$f":"IF(Linkwahl!Y565=\"\",\"\",Linkwahl!Y565)","v":""},{"$f":"IF(Linkwahl!AA565=\"\",\"\",Linkwahl!AA565)","v":""},{"$f":"IF(Linkwahl!AB565=\"\",\"\",Linkwahl!AB565)","v":""}]
["",{"$f":"IF(Linkwahl!Z566=\"\",\"\",Linkwahl!Z566)","v":""},{"$f":"IF(Linkwahl!Y566=\"\",\"\",Linkwahl!Y566)","v":""},{"$f":"IF(Linkwahl!AA566=\"\",\"\",Linkwahl!AA566)","v":""},{"$f":"IF(Linkwahl!AB566=\"\",\"\",Linkwahl!AB566)","v":""}]
["",{"$f":"IF(Linkwahl!Z567=\"\",\"\",Linkwahl!Z567)","v":""},{"$f":"IF(Linkwahl!Y567=\"\",\"\",Linkwahl!Y567)","v":""},{"$f":"IF(Linkwahl!AA567=\"\",\"\",Linkwahl!AA567)","v":""},{"$f":"IF(Linkwahl!AB567=\"\",\"\",Linkwahl!AB567)","v":""}]
["",{"$f":"IF(Linkwahl!Z568=\"\",\"\",Linkwahl!Z568)","v":""},{"$f":"IF(Linkwahl!Y568=\"\",\"\",Linkwahl!Y568)","v":""},{"$f":"IF(Linkwahl!AA568=\"\",\"\",Linkwahl!AA568)","v":""},{"$f":"IF(Linkwahl!AB568=\"\",\"\",Linkwahl!AB568)","v":""}]
["",{"$f":"IF(Linkwahl!Z569=\"\",\"\",Linkwahl!Z569)","v":""},{"$f":"IF(Linkwahl!Y569=\"\",\"\",Linkwahl!Y569)","v":""},{"$f":"IF(Linkwahl!AA569=\"\",\"\",Linkwahl!AA569)","v":""},{"$f":"IF(Linkwahl!AB569=\"\",\"\",Linkwahl!AB569)","v":""}]
["",{"$f":"IF(Linkwahl!Z570=\"\",\"\",Linkwahl!Z570)","v":""},{"$f":"IF(Linkwahl!Y570=\"\",\"\",Linkwahl!Y570)","v":""},{"$f":"IF(Linkwahl!AA570=\"\",\"\",Linkwahl!AA570)","v":""},{"$f":"IF(Linkwahl!AB570=\"\",\"\",Linkwahl!AB570)","v":""}]
["",{"$f":"IF(Linkwahl!Z571=\"\",\"\",Linkwahl!Z571)","v":""},{"$f":"IF(Linkwahl!Y571=\"\",\"\",Linkwahl!Y571)","v":""},{"$f":"IF(Linkwahl!AA571=\"\",\"\",Linkwahl!AA571)","v":""},{"$f":"IF(Linkwahl!AB571=\"\",\"\",Linkwahl!AB571)","v":""}]
["",{"$f":"IF(Linkwahl!Z572=\"\",\"\",Linkwahl!Z572)","v":""},{"$f":"IF(Linkwahl!Y572=\"\",\"\",Linkwahl!Y572)","v":""},{"$f":"IF(Linkwahl!AA572=\"\",\"\",Linkwahl!AA572)","v":""},{"$f":"IF(Linkwahl!AB572=\"\",\"\",Linkwahl!AB572)","v":""}]
["",{"$f":"IF(Linkwahl!Z573=\"\",\"\",Linkwahl!Z573)","v":""},{"$f":"IF(Linkwahl!Y573=\"\",\"\",Linkwahl!Y573)","v":""},{"$f":"IF(Linkwahl!AA573=\"\",\"\",Linkwahl!AA573)","v":""},{"$f":"IF(Linkwahl!AB573=\"\",\"\",Linkwahl!AB573)","v":""}]
["",{"$f":"IF(Linkwahl!Z574=\"\",\"\",Linkwahl!Z574)","v":""},{"$f":"IF(Linkwahl!Y574=\"\",\"\",Linkwahl!Y574)","v":""},{"$f":"IF(Linkwahl!AA574=\"\",\"\",Linkwahl!AA574)","v":""},{"$f":"IF(Linkwahl!AB574=\"\",\"\",Linkwahl!AB574)","v":""}]
["",{"$f":"IF(Linkwahl!Z575=\"\",\"\",Linkwahl!Z575)","v":""},{"$f":"IF(Linkwahl!Y575=\"\",\"\",Linkwahl!Y575)","v":""},{"$f":"IF(Linkwahl!AA575=\"\",\"\",Linkwahl!AA575)","v":""},{"$f":"IF(Linkwahl!AB575=\"\",\"\",Linkwahl!AB575)","v":""}]
["",{"$f":"IF(Linkwahl!Z576=\"\",\"\",Linkwahl!Z576)","v":""},{"$f":"IF(Linkwahl!Y576=\"\",\"\",Linkwahl!Y576)","v":""},{"$f":"IF(Linkwahl!AA576=\"\",\"\",Linkwahl!AA576)","v":""},{"$f":"IF(Linkwahl!AB576=\"\",\"\",Linkwahl!AB576)","v":""}]
["",{"$f":"IF(Linkwahl!Z577=\"\",\"\",Linkwahl!Z577)","v":""},{"$f":"IF(Linkwahl!Y577=\"\",\"\",Linkwahl!Y577)","v":""},{"$f":"IF(Linkwahl!AA577=\"\",\"\",Linkwahl!AA577)","v":""},{"$f":"IF(Linkwahl!AB577=\"\",\"\",Linkwahl!AB577)","v":""}]
["",{"$f":"IF(Linkwahl!Z578=\"\",\"\",Linkwahl!Z578)","v":""},{"$f":"IF(Linkwahl!Y578=\"\",\"\",Linkwahl!Y578)","v":""},{"$f":"IF(Linkwahl!AA578=\"\",\"\",Linkwahl!AA578)","v":""},{"$f":"IF(Linkwahl!AB578=\"\",\"\",Linkwahl!AB578)","v":""}]
["",{"$f":"IF(Linkwahl!Z579=\"\",\"\",Linkwahl!Z579)","v":""},{"$f":"IF(Linkwahl!Y579=\"\",\"\",Linkwahl!Y579)","v":""},{"$f":"IF(Linkwahl!AA579=\"\",\"\",Linkwahl!AA579)","v":""},{"$f":"IF(Linkwahl!AB579=\"\",\"\",Linkwahl!AB579)","v":""}]
["",{"$f":"IF(Linkwahl!Z580=\"\",\"\",Linkwahl!Z580)","v":""},{"$f":"IF(Linkwahl!Y580=\"\",\"\",Linkwahl!Y580)","v":""},{"$f":"IF(Linkwahl!AA580=\"\",\"\",Linkwahl!AA580)","v":""},{"$f":"IF(Linkwahl!AB580=\"\",\"\",Linkwahl!AB580)","v":""}]
["",{"$f":"IF(Linkwahl!Z581=\"\",\"\",Linkwahl!Z581)","v":""},{"$f":"IF(Linkwahl!Y581=\"\",\"\",Linkwahl!Y581)","v":""},{"$f":"IF(Linkwahl!AA581=\"\",\"\",Linkwahl!AA581)","v":""},{"$f":"IF(Linkwahl!AB581=\"\",\"\",Linkwahl!AB581)","v":""}]
["",{"$f":"IF(Linkwahl!Z582=\"\",\"\",Linkwahl!Z582)","v":""},{"$f":"IF(Linkwahl!Y582=\"\",\"\",Linkwahl!Y582)","v":""},{"$f":"IF(Linkwahl!AA582=\"\",\"\",Linkwahl!AA582)","v":""},{"$f":"IF(Linkwahl!AB582=\"\",\"\",Linkwahl!AB582)","v":""}]
["",{"$f":"IF(Linkwahl!Z583=\"\",\"\",Linkwahl!Z583)","v":""},{"$f":"IF(Linkwahl!Y583=\"\",\"\",Linkwahl!Y583)","v":""},{"$f":"IF(Linkwahl!AA583=\"\",\"\",Linkwahl!AA583)","v":""},{"$f":"IF(Linkwahl!AB583=\"\",\"\",Linkwahl!AB583)","v":""}]
[{"$f":"IF(D452=\"\",\"\",HYPERLINK(\"http://www.admin.ch/ch/d/sr/c\"&SUBSTITUTE(D452,\".\",\"_\")&\".html\",\"SR-Link\"))","v":""},{"$f":"IF(Linkwahl!Z584=\"\",\"\",Linkwahl!Z584)","v":""},{"$f":"IF(Linkwahl!Y584=\"\",\"\",Linkwahl!Y584)","v":""},{"$f":"IF(Linkwahl!AA584=\"\",\"\",Linkwahl!AA584)","v":""},{"$f":"IF(Linkwahl!AB584=\"\",\"\",Linkwahl!AB584)","v":""}]
["",{"$f":"IF(Linkwahl!Z585=\"\",\"\",Linkwahl!Z585)","v":""},{"$f":"IF(Linkwahl!Y585=\"\",\"\",Linkwahl!Y585)","v":""},{"$f":"IF(Linkwahl!AA585=\"\",\"\",Linkwahl!AA585)","v":""},{"$f":"IF(Linkwahl!AB585=\"\",\"\",Linkwahl!AB585)","v":""}]
["",{"$f":"IF(Linkwahl!Z586=\"\",\"\",Linkwahl!Z586)","v":""},{"$f":"IF(Linkwahl!Y586=\"\",\"\",Linkwahl!Y586)","v":""},{"$f":"IF(Linkwahl!AA586=\"\",\"\",Linkwahl!AA586)","v":""},{"$f":"IF(Linkwahl!AB586=\"\",\"\",Linkwahl!AB586)","v":""}]
["",{"$f":"IF(Linkwahl!Z587=\"\",\"\",Linkwahl!Z587)","v":""},{"$f":"IF(Linkwahl!Y587=\"\",\"\",Linkwahl!Y587)","v":""},{"$f":"IF(Linkwahl!AA587=\"\",\"\",Linkwahl!AA587)","v":""},{"$f":"IF(Linkwahl!AB587=\"\",\"\",Linkwahl!AB587)","v":""}]
["",{"$f":"IF(Linkwahl!Z588=\"\",\"\",Linkwahl!Z588)","v":""},{"$f":"IF(Linkwahl!Y588=\"\",\"\",Linkwahl!Y588)","v":""},{"$f":"IF(Linkwahl!AA588=\"\",\"\",Linkwahl!AA588)","v":""},{"$f":"IF(Linkwahl!AB588=\"\",\"\",Linkwahl!AB588)","v":""}]
["",{"$f":"IF(Linkwahl!Z589=\"\",\"\",Linkwahl!Z589)","v":""},{"$f":"IF(Linkwahl!Y589=\"\",\"\",Linkwahl!Y589)","v":""},{"$f":"IF(Linkwahl!AA589=\"\",\"\",Linkwahl!AA589)","v":""},{"$f":"IF(Linkwahl!AB589=\"\",\"\",Linkwahl!AB589)","v":""}]
["",{"$f":"IF(Linkwahl!Z590=\"\",\"\",Linkwahl!Z590)","v":""},{"$f":"IF(Linkwahl!Y590=\"\",\"\",Linkwahl!Y590)","v":""},{"$f":"IF(Linkwahl!AA590=\"\",\"\",Linkwahl!AA590)","v":""},{"$f":"IF(Linkwahl!AB590=\"\",\"\",Linkwahl!AB590)","v":""}]
["",{"$f":"IF(Linkwahl!Z591=\"\",\"\",Linkwahl!Z591)","v":""},{"$f":"IF(Linkwahl!Y591=\"\",\"\",Linkwahl!Y591)","v":""},{"$f":"IF(Linkwahl!AA591=\"\",\"\",Linkwahl!AA591)","v":""},{"$f":"IF(Linkwahl!AB591=\"\",\"\",Linkwahl!AB591)","v":""}]
["",{"$f":"IF(Linkwahl!Z592=\"\",\"\",Linkwahl!Z592)","v":""},{"$f":"IF(Linkwahl!Y592=\"\",\"\",Linkwahl!Y592)","v":""},{"$f":"IF(Linkwahl!AA592=\"\",\"\",Linkwahl!AA592)","v":""},{"$f":"IF(Linkwahl!AB592=\"\",\"\",Linkwahl!AB592)","v":""}]
["",{"$f":"IF(Linkwahl!Z593=\"\",\"\",Linkwahl!Z593)","v":""},{"$f":"IF(Linkwahl!Y593=\"\",\"\",Linkwahl!Y593)","v":""},{"$f":"IF(Linkwahl!AA593=\"\",\"\",Linkwahl!AA593)","v":""},{"$f":"IF(Linkwahl!AB593=\"\",\"\",Linkwahl!AB593)","v":""}]
["",{"$f":"IF(Linkwahl!Z594=\"\",\"\",Linkwahl!Z594)","v":""},{"$f":"IF(Linkwahl!Y594=\"\",\"\",Linkwahl!Y594)","v":""},{"$f":"IF(Linkwahl!AA594=\"\",\"\",Linkwahl!AA594)","v":""},{"$f":"IF(Linkwahl!AB594=\"\",\"\",Linkwahl!AB594)","v":""}]
["",{"$f":"IF(Linkwahl!Z595=\"\",\"\",Linkwahl!Z595)","v":""},{"$f":"IF(Linkwahl!Y595=\"\",\"\",Linkwahl!Y595)","v":""},{"$f":"IF(Linkwahl!AA595=\"\",\"\",Linkwahl!AA595)","v":""},{"$f":"IF(Linkwahl!AB595=\"\",\"\",Linkwahl!AB595)","v":""}]
["",{"$f":"IF(Linkwahl!Z596=\"\",\"\",Linkwahl!Z596)","v":""},{"$f":"IF(Linkwahl!Y596=\"\",\"\",Linkwahl!Y596)","v":""},{"$f":"IF(Linkwahl!AA596=\"\",\"\",Linkwahl!AA596)","v":""},{"$f":"IF(Linkwahl!AB596=\"\",\"\",Linkwahl!AB596)","v":""}]
["",{"$f":"IF(Linkwahl!Z597=\"\",\"\",Linkwahl!Z597)","v":""},{"$f":"IF(Linkwahl!Y597=\"\",\"\",Linkwahl!Y597)","v":""},{"$f":"IF(Linkwahl!AA597=\"\",\"\",Linkwahl!AA597)","v":""},{"$f":"IF(Linkwahl!AB597=\"\",\"\",Linkwahl!AB597)","v":""}]
["",{"$f":"IF(Linkwahl!Z598=\"\",\"\",Linkwahl!Z598)","v":""},{"$f":"IF(Linkwahl!Y598=\"\",\"\",Linkwahl!Y598)","v":""},{"$f":"IF(Linkwahl!AA598=\"\",\"\",Linkwahl!AA598)","v":""},{"$f":"IF(Linkwahl!AB598=\"\",\"\",Linkwahl!AB598)","v":""}]
["",{"$f":"IF(Linkwahl!Z599=\"\",\"\",Linkwahl!Z599)","v":""},{"$f":"IF(Linkwahl!Y599=\"\",\"\",Linkwahl!Y599)","v":""},{"$f":"IF(Linkwahl!AA599=\"\",\"\",Linkwahl!AA599)","v":""},{"$f":"IF(Linkwahl!AB599=\"\",\"\",Linkwahl!AB599)","v":""}]
["",{"$f":"IF(Linkwahl!Z600=\"\",\"\",Linkwahl!Z600)","v":""},{"$f":"IF(Linkwahl!Y600=\"\",\"\",Linkwahl!Y600)","v":""},{"$f":"IF(Linkwahl!AA600=\"\",\"\",Linkwahl!AA600)","v":""},{"$f":"IF(Linkwahl!AB600=\"\",\"\",Linkwahl!AB600)","v":""}]
["",{"$f":"IF(Linkwahl!Z601=\"\",\"\",Linkwahl!Z601)","v":""},{"$f":"IF(Linkwahl!Y601=\"\",\"\",Linkwahl!Y601)","v":""},{"$f":"IF(Linkwahl!AA601=\"\",\"\",Linkwahl!AA601)","v":""},{"$f":"IF(Linkwahl!AB601=\"\",\"\",Linkwahl!AB601)","v":""}]
["",{"$f":"IF(Linkwahl!Z602=\"\",\"\",Linkwahl!Z602)","v":""},{"$f":"IF(Linkwahl!Y602=\"\",\"\",Linkwahl!Y602)","v":""},{"$f":"IF(Linkwahl!AA602=\"\",\"\",Linkwahl!AA602)","v":""},{"$f":"IF(Linkwahl!AB602=\"\",\"\",Linkwahl!AB602)","v":""}]
["",{"$f":"IF(Linkwahl!Z603=\"\",\"\",Linkwahl!Z603)","v":""},{"$f":"IF(Linkwahl!Y603=\"\",\"\",Linkwahl!Y603)","v":""},{"$f":"IF(Linkwahl!AA603=\"\",\"\",Linkwahl!AA603)","v":""},{"$f":"IF(Linkwahl!AB603=\"\",\"\",Linkwahl!AB603)","v":""}]
["",{"$f":"IF(Linkwahl!Z604=\"\",\"\",Linkwahl!Z604)","v":""},{"$f":"IF(Linkwahl!Y604=\"\",\"\",Linkwahl!Y604)","v":""},{"$f":"IF(Linkwahl!AA604=\"\",\"\",Linkwahl!AA604)","v":""},{"$f":"IF(Linkwahl!AB604=\"\",\"\",Linkwahl!AB604)","v":""}]
["",{"$f":"IF(Linkwahl!Z605=\"\",\"\",Linkwahl!Z605)","v":""},{"$f":"IF(Linkwahl!Y605=\"\",\"\",Linkwahl!Y605)","v":""},{"$f":"IF(Linkwahl!AA605=\"\",\"\",Linkwahl!AA605)","v":""},{"$f":"IF(Linkwahl!AB605=\"\",\"\",Linkwahl!AB605)","v":""}]
["",{"$f":"IF(Linkwahl!Z606=\"\",\"\",Linkwahl!Z606)","v":""},{"$f":"IF(Linkwahl!Y606=\"\",\"\",Linkwahl!Y606)","v":""},{"$f":"IF(Linkwahl!AA606=\"\",\"\",Linkwahl!AA606)","v":""},{"$f":"IF(Linkwahl!AB606=\"\",\"\",Linkwahl!AB606)","v":""}]
["",{"$f":"IF(Linkwahl!Z607=\"\",\"\",Linkwahl!Z607)","v":""},{"$f":"IF(Linkwahl!Y607=\"\",\"\",Linkwahl!Y607)","v":""},{"$f":"IF(Linkwahl!AA607=\"\",\"\",Linkwahl!AA607)","v":""},{"$f":"IF(Linkwahl!AB607=\"\",\"\",Linkwahl!AB607)","v":""}]
["",{"$f":"IF(Linkwahl!Z608=\"\",\"\",Linkwahl!Z608)","v":""},{"$f":"IF(Linkwahl!Y608=\"\",\"\",Linkwahl!Y608)","v":""},{"$f":"IF(Linkwahl!AA608=\"\",\"\",Linkwahl!AA608)","v":""},{"$f":"IF(Linkwahl!AB608=\"\",\"\",Linkwahl!AB608)","v":""}]
["",{"$f":"IF(Linkwahl!Z609=\"\",\"\",Linkwahl!Z609)","v":""},{"$f":"IF(Linkwahl!Y609=\"\",\"\",Linkwahl!Y609)","v":""},{"$f":"IF(Linkwahl!AA609=\"\",\"\",Linkwahl!AA609)","v":""},{"$f":"IF(Linkwahl!AB609=\"\",\"\",Linkwahl!AB609)","v":""}]
["",{"$f":"IF(Linkwahl!Z610=\"\",\"\",Linkwahl!Z610)","v":""},{"$f":"IF(Linkwahl!Y610=\"\",\"\",Linkwahl!Y610)","v":""},{"$f":"IF(Linkwahl!AA610=\"\",\"\",Linkwahl!AA610)","v":""},{"$f":"IF(Linkwahl!AB610=\"\",\"\",Linkwahl!AB610)","v":""}]
["",{"$f":"IF(Linkwahl!Z611=\"\",\"\",Linkwahl!Z611)","v":""},{"$f":"IF(Linkwahl!Y611=\"\",\"\",Linkwahl!Y611)","v":""},{"$f":"IF(Linkwahl!AA611=\"\",\"\",Linkwahl!AA611)","v":""},{"$f":"IF(Linkwahl!AB611=\"\",\"\",Linkwahl!AB611)","v":""}]
["",{"$f":"IF(Linkwahl!Z612=\"\",\"\",Linkwahl!Z612)","v":""},{"$f":"IF(Linkwahl!Y612=\"\",\"\",Linkwahl!Y612)","v":""},{"$f":"IF(Linkwahl!AA612=\"\",\"\",Linkwahl!AA612)","v":""},{"$f":"IF(Linkwahl!AB612=\"\",\"\",Linkwahl!AB612)","v":""}]
["",{"$f":"IF(Linkwahl!Z613=\"\",\"\",Linkwahl!Z613)","v":""},{"$f":"IF(Linkwahl!Y613=\"\",\"\",Linkwahl!Y613)","v":""},{"$f":"IF(Linkwahl!AA613=\"\",\"\",Linkwahl!AA613)","v":""},{"$f":"IF(Linkwahl!AB613=\"\",\"\",Linkwahl!AB613)","v":""}]
["",{"$f":"IF(Linkwahl!Z614=\"\",\"\",Linkwahl!Z614)","v":""},{"$f":"IF(Linkwahl!Y614=\"\",\"\",Linkwahl!Y614)","v":""},{"$f":"IF(Linkwahl!AA614=\"\",\"\",Linkwahl!AA614)","v":""},{"$f":"IF(Linkwahl!AB614=\"\",\"\",Linkwahl!AB614)","v":""}]
["",{"$f":"IF(Linkwahl!Z615=\"\",\"\",Linkwahl!Z615)","v":""},{"$f":"IF(Linkwahl!Y615=\"\",\"\",Linkwahl!Y615)","v":""},{"$f":"IF(Linkwahl!AA615=\"\",\"\",Linkwahl!AA615)","v":""},{"$f":"IF(Linkwahl!AB615=\"\",\"\",Linkwahl!AB615)","v":""}]
["",{"$f":"IF(Linkwahl!Z616=\"\",\"\",Linkwahl!Z616)","v":""},{"$f":"IF(Linkwahl!Y616=\"\",\"\",Linkwahl!Y616)","v":""},{"$f":"IF(Linkwahl!AA616=\"\",\"\",Linkwahl!AA616)","v":""},{"$f":"IF(Linkwahl!AB616=\"\",\"\",Linkwahl!AB616)","v":""}]
["",{"$f":"IF(Linkwahl!Z617=\"\",\"\",Linkwahl!Z617)","v":""},{"$f":"IF(Linkwahl!Y617=\"\",\"\",Linkwahl!Y617)","v":""},{"$f":"IF(Linkwahl!AA617=\"\",\"\",Linkwahl!AA617)","v":""},{"$f":"IF(Linkwahl!AB617=\"\",\"\",Linkwahl!AB617)","v":""}]
["",{"$f":"IF(Linkwahl!Z618=\"\",\"\",Linkwahl!Z618)","v":""},{"$f":"IF(Linkwahl!Y618=\"\",\"\",Linkwahl!Y618)","v":""},{"$f":"IF(Linkwahl!AA618=\"\",\"\",Linkwahl!AA618)","v":""},{"$f":"IF(Linkwahl!AB618=\"\",\"\",Linkwahl!AB618)","v":""}]
["",{"$f":"IF(Linkwahl!Z619=\"\",\"\",Linkwahl!Z619)","v":""},{"$f":"IF(Linkwahl!Y619=\"\",\"\",Linkwahl!Y619)","v":""},{"$f":"IF(Linkwahl!AA619=\"\",\"\",Linkwahl!AA619)","v":""},{"$f":"IF(Linkwahl!AB619=\"\",\"\",Linkwahl!AB619)","v":""}]
["",{"$f":"IF(Linkwahl!Z620=\"\",\"\",Linkwahl!Z620)","v":""},{"$f":"IF(Linkwahl!Y620=\"\",\"\",Linkwahl!Y620)","v":""},{"$f":"IF(Linkwahl!AA620=\"\",\"\",Linkwahl!AA620)","v":""},{"$f":"IF(Linkwahl!AB620=\"\",\"\",Linkwahl!AB620)","v":""}]
["",{"$f":"IF(Linkwahl!Z621=\"\",\"\",Linkwahl!Z621)","v":""},{"$f":"IF(Linkwahl!Y621=\"\",\"\",Linkwahl!Y621)","v":""},{"$f":"IF(Linkwahl!AA621=\"\",\"\",Linkwahl!AA621)","v":""},{"$f":"IF(Linkwahl!AB621=\"\",\"\",Linkwahl!AB621)","v":""}]
["",{"$f":"IF(Linkwahl!Z622=\"\",\"\",Linkwahl!Z622)","v":""},{"$f":"IF(Linkwahl!Y622=\"\",\"\",Linkwahl!Y622)","v":""},{"$f":"IF(Linkwahl!AA622=\"\",\"\",Linkwahl!AA622)","v":""},{"$f":"IF(Linkwahl!AB622=\"\",\"\",Linkwahl!AB622)","v":""}]
["",{"$f":"IF(Linkwahl!Z623=\"\",\"\",Linkwahl!Z623)","v":""},{"$f":"IF(Linkwahl!Y623=\"\",\"\",Linkwahl!Y623)","v":""},{"$f":"IF(Linkwahl!AA623=\"\",\"\",Linkwahl!AA623)","v":""},{"$f":"IF(Linkwahl!AB623=\"\",\"\",Linkwahl!AB623)","v":""}]
["",{"$f":"IF(Linkwahl!Z624=\"\",\"\",Linkwahl!Z624)","v":""},{"$f":"IF(Linkwahl!Y624=\"\",\"\",Linkwahl!Y624)","v":""},{"$f":"IF(Linkwahl!AA624=\"\",\"\",Linkwahl!AA624)","v":""},{"$f":"IF(Linkwahl!AB624=\"\",\"\",Linkwahl!AB624)","v":""}]
["",{"$f":"IF(Linkwahl!Z625=\"\",\"\",Linkwahl!Z625)","v":""},{"$f":"IF(Linkwahl!Y625=\"\",\"\",Linkwahl!Y625)","v":""},{"$f":"IF(Linkwahl!AA625=\"\",\"\",Linkwahl!AA625)","v":""},{"$f":"IF(Linkwahl!AB625=\"\",\"\",Linkwahl!AB625)","v":""}]
["",{"$f":"IF(Linkwahl!Z626=\"\",\"\",Linkwahl!Z626)","v":""},{"$f":"IF(Linkwahl!Y626=\"\",\"\",Linkwahl!Y626)","v":""},{"$f":"IF(Linkwahl!AA626=\"\",\"\",Linkwahl!AA626)","v":""},{"$f":"IF(Linkwahl!AB626=\"\",\"\",Linkwahl!AB626)","v":""}]
["",{"$f":"IF(Linkwahl!Z627=\"\",\"\",Linkwahl!Z627)","v":""},{"$f":"IF(Linkwahl!Y627=\"\",\"\",Linkwahl!Y627)","v":""},{"$f":"IF(Linkwahl!AA627=\"\",\"\",Linkwahl!AA627)","v":""},{"$f":"IF(Linkwahl!AB627=\"\",\"\",Linkwahl!AB627)","v":""}]
["",{"$f":"IF(Linkwahl!Z628=\"\",\"\",Linkwahl!Z628)","v":""},{"$f":"IF(Linkwahl!Y628=\"\",\"\",Linkwahl!Y628)","v":""},{"$f":"IF(Linkwahl!AA628=\"\",\"\",Linkwahl!AA628)","v":""},{"$f":"IF(Linkwahl!AB628=\"\",\"\",Linkwahl!AB628)","v":""}]
["",{"$f":"IF(Linkwahl!Z629=\"\",\"\",Linkwahl!Z629)","v":""},{"$f":"IF(Linkwahl!Y629=\"\",\"\",Linkwahl!Y629)","v":""},{"$f":"IF(Linkwahl!AA629=\"\",\"\",Linkwahl!AA629)","v":""},{"$f":"IF(Linkwahl!AB629=\"\",\"\",Linkwahl!AB629)","v":""}]
["",{"$f":"IF(Linkwahl!Z630=\"\",\"\",Linkwahl!Z630)","v":""},{"$f":"IF(Linkwahl!Y630=\"\",\"\",Linkwahl!Y630)","v":""},{"$f":"IF(Linkwahl!AA630=\"\",\"\",Linkwahl!AA630)","v":""},{"$f":"IF(Linkwahl!AB630=\"\",\"\",Linkwahl!AB630)","v":""}]
[{"$f":"IF(D499=\"\",\"\",HYPERLINK(\"http://www.admin.ch/ch/d/sr/c\"&SUBSTITUTE(D499,\".\",\"_\")&\".html\",\"SR-Link\"))","v":""},{"$f":"IF(Linkwahl!Z631=\"\",\"\",Linkwahl!Z631)","v":""},{"$f":"IF(Linkwahl!Y631=\"\",\"\",Linkwahl!Y631)","v":""},{"$f":"IF(Linkwahl!AA631=\"\",\"\",Linkwahl!AA631)","v":""},{"$f":"IF(Linkwahl!AB631=\"\",\"\",Linkwahl!AB631)","v":""}]
["",{"$f":"IF(Linkwahl!Z632=\"\",\"\",Linkwahl!Z632)","v":""},{"$f":"IF(Linkwahl!Y632=\"\",\"\",Linkwahl!Y632)","v":""},{"$f":"IF(Linkwahl!AA632=\"\",\"\",Linkwahl!AA632)","v":""},{"$f":"IF(Linkwahl!AB632=\"\",\"\",Linkwahl!AB632)","v":""}]
["",{"$f":"IF(Linkwahl!Z633=\"\",\"\",Linkwahl!Z633)","v":""},{"$f":"IF(Linkwahl!Y633=\"\",\"\",Linkwahl!Y633)","v":""},{"$f":"IF(Linkwahl!AA633=\"\",\"\",Linkwahl!AA633)","v":""},{"$f":"IF(Linkwahl!AB633=\"\",\"\",Linkwahl!AB633)","v":""}]
["",{"$f":"IF(Linkwahl!Z634=\"\",\"\",Linkwahl!Z634)","v":""},{"$f":"IF(Linkwahl!Y634=\"\",\"\",Linkwahl!Y634)","v":""},{"$f":"IF(Linkwahl!AA634=\"\",\"\",Linkwahl!AA634)","v":""},{"$f":"IF(Linkwahl!AB634=\"\",\"\",Linkwahl!AB634)","v":""}]
["",{"$f":"IF(Linkwahl!Z635=\"\",\"\",Linkwahl!Z635)","v":""},{"$f":"IF(Linkwahl!Y635=\"\",\"\",Linkwahl!Y635)","v":""},{"$f":"IF(Linkwahl!AA635=\"\",\"\",Linkwahl!AA635)","v":""},{"$f":"IF(Linkwahl!AB635=\"\",\"\",Linkwahl!AB635)","v":""}]
["",{"$f":"IF(Linkwahl!Z636=\"\",\"\",Linkwahl!Z636)","v":""},{"$f":"IF(Linkwahl!Y636=\"\",\"\",Linkwahl!Y636)","v":""},{"$f":"IF(Linkwahl!AA636=\"\",\"\",Linkwahl!AA636)","v":""},{"$f":"IF(Linkwahl!AB636=\"\",\"\",Linkwahl!AB636)","v":""}]
["",{"$f":"IF(Linkwahl!Z637=\"\",\"\",Linkwahl!Z637)","v":""},{"$f":"IF(Linkwahl!Y637=\"\",\"\",Linkwahl!Y637)","v":""},{"$f":"IF(Linkwahl!AA637=\"\",\"\",Linkwahl!AA637)","v":""},{"$f":"IF(Linkwahl!AB637=\"\",\"\",Linkwahl!AB637)","v":""}]
["",{"$f":"IF(Linkwahl!Z638=\"\",\"\",Linkwahl!Z638)","v":""},{"$f":"IF(Linkwahl!Y638=\"\",\"\",Linkwahl!Y638)","v":""},{"$f":"IF(Linkwahl!AA638=\"\",\"\",Linkwahl!AA638)","v":""},{"$f":"IF(Linkwahl!AB638=\"\",\"\",Linkwahl!AB638)","v":""}]
["",{"$f":"IF(Linkwahl!Z639=\"\",\"\",Linkwahl!Z639)","v":""},{"$f":"IF(Linkwahl!Y639=\"\",\"\",Linkwahl!Y639)","v":""},{"$f":"IF(Linkwahl!AA639=\"\",\"\",Linkwahl!AA639)","v":""},{"$f":"IF(Linkwahl!AB639=\"\",\"\",Linkwahl!AB639)","v":""}]
["",{"$f":"IF(Linkwahl!Z640=\"\",\"\",Linkwahl!Z640)","v":""},{"$f":"IF(Linkwahl!Y640=\"\",\"\",Linkwahl!Y640)","v":""},{"$f":"IF(Linkwahl!AA640=\"\",\"\",Linkwahl!AA640)","v":""},{"$f":"IF(Linkwahl!AB640=\"\",\"\",Linkwahl!AB640)","v":""}]
["",{"$f":"IF(Linkwahl!Z641=\"\",\"\",Linkwahl!Z641)","v":""},{"$f":"IF(Linkwahl!Y641=\"\",\"\",Linkwahl!Y641)","v":""},{"$f":"IF(Linkwahl!AA641=\"\",\"\",Linkwahl!AA641)","v":""},{"$f":"IF(Linkwahl!AB641=\"\",\"\",Linkwahl!AB641)","v":""}]
["",{"$f":"IF(Linkwahl!Z642=\"\",\"\",Linkwahl!Z642)","v":""},{"$f":"IF(Linkwahl!Y642=\"\",\"\",Linkwahl!Y642)","v":""},{"$f":"IF(Linkwahl!AA642=\"\",\"\",Linkwahl!AA642)","v":""},{"$f":"IF(Linkwahl!AB642=\"\",\"\",Linkwahl!AB642)","v":""}]
["",{"$f":"IF(Linkwahl!Z643=\"\",\"\",Linkwahl!Z643)","v":""},{"$f":"IF(Linkwahl!Y643=\"\",\"\",Linkwahl!Y643)","v":""},{"$f":"IF(Linkwahl!AA643=\"\",\"\",Linkwahl!AA643)","v":""},{"$f":"IF(Linkwahl!AB643=\"\",\"\",Linkwahl!AB643)","v":""}]
["",{"$f":"IF(Linkwahl!Z644=\"\",\"\",Linkwahl!Z644)","v":""},{"$f":"IF(Linkwahl!Y644=\"\",\"\",Linkwahl!Y644)","v":""},{"$f":"IF(Linkwahl!AA644=\"\",\"\",Linkwahl!AA644)","v":""},{"$f":"IF(Linkwahl!AB644=\"\",\"\",Linkwahl!AB644)","v":""}]
["",{"$f":"IF(Linkwahl!Z645=\"\",\"\",Linkwahl!Z645)","v":""},{"$f":"IF(Linkwahl!Y645=\"\",\"\",Linkwahl!Y645)","v":""},{"$f":"IF(Linkwahl!AA645=\"\",\"\",Linkwahl!AA645)","v":""},{"$f":"IF(Linkwahl!AB645=\"\",\"\",Linkwahl!AB645)","v":""}]
["",{"$f":"IF(Linkwahl!Z646=\"\",\"\",Linkwahl!Z646)","v":""},{"$f":"IF(Linkwahl!Y646=\"\",\"\",Linkwahl!Y646)","v":""},{"$f":"IF(Linkwahl!AA646=\"\",\"\",Linkwahl!AA646)","v":""},{"$f":"IF(Linkwahl!AB646=\"\",\"\",Linkwahl!AB646)","v":""}]
["",{"$f":"IF(Linkwahl!Z647=\"\",\"\",Linkwahl!Z647)","v":""},{"$f":"IF(Linkwahl!Y647=\"\",\"\",Linkwahl!Y647)","v":""},{"$f":"IF(Linkwahl!AA647=\"\",\"\",Linkwahl!AA647)","v":""},{"$f":"IF(Linkwahl!AB647=\"\",\"\",Linkwahl!AB647)","v":""}]
["",{"$f":"IF(Linkwahl!Z648=\"\",\"\",Linkwahl!Z648)","v":""},{"$f":"IF(Linkwahl!Y648=\"\",\"\",Linkwahl!Y648)","v":""},{"$f":"IF(Linkwahl!AA648=\"\",\"\",Linkwahl!AA648)","v":""},{"$f":"IF(Linkwahl!AB648=\"\",\"\",Linkwahl!AB648)","v":""}]
["",{"$f":"IF(Linkwahl!Z649=\"\",\"\",Linkwahl!Z649)","v":""},{"$f":"IF(Linkwahl!Y649=\"\",\"\",Linkwahl!Y649)","v":""},{"$f":"IF(Linkwahl!AA649=\"\",\"\",Linkwahl!AA649)","v":""},{"$f":"IF(Linkwahl!AB649=\"\",\"\",Linkwahl!AB649)","v":""}]
["",{"$f":"IF(Linkwahl!Z650=\"\",\"\",Linkwahl!Z650)","v":""},{"$f":"IF(Linkwahl!Y650=\"\",\"\",Linkwahl!Y650)","v":""},{"$f":"IF(Linkwahl!AA650=\"\",\"\",Linkwahl!AA650)","v":""},{"$f":"IF(Linkwahl!AB650=\"\",\"\",Linkwahl!AB650)","v":""}]
["",{"$f":"IF(Linkwahl!Z651=\"\",\"\",Linkwahl!Z651)","v":""},{"$f":"IF(Linkwahl!Y651=\"\",\"\",Linkwahl!Y651)","v":""},{"$f":"IF(Linkwahl!AA651=\"\",\"\",Linkwahl!AA651)","v":""},{"$f":"IF(Linkwahl!AB651=\"\",\"\",Linkwahl!AB651)","v":""}]
[]
[]
[]
[]
[]
[]
[]
[]
[]
[]
[]
[]
[]
[]
[]
[]
[]
[]
[]
[]
[]
[]
[]
[]
[]
[]
[]
[]
[]
[]
[]
[]
[]
[]
[]
[]
[]
[]
[]
[]
[]
[]
[]
[]
[]
[]
[]
[]
[]
[]
[]
[]
[]
[]
[]
[]
[]
[]
[]
[]
[]
[]
[]
[]
[]
[]
[]
[]
[]
[]
[{"$f":"IF(D590=\"\",\"\",HYPERLINK(\"http://www.admin.ch/ch/d/sr/c\"&SUBSTITUTE(D590,\".\",\"_\"),\"SR-Link\"))","v":""}]

{"sheet":"SR engl.","index":2,"n_rows":410,"n_cols":3,"rows_kept":410,"cut":false,"hidden":false,"merged":[]}
[null,"englische Übersetzungen Bundesvorschriften (SR)"]
[{"$f":"COUNTA(A3:A410)-COUNTBLANK(A3:A410)","v":178},"SR-Nummer","Bezeichnung                          (Stand 12.2017)"]
[{"$f":"IF(B3=\"\",\"\",HYPERLINK(\"http://www.admin.ch/ch/e/rs/c\"&SUBSTITUTE(B3,\".\",\"_\")&\".html\",\"SR-Link\"))","v":"SR-Link"},{"$f":"IF(Linkwahl!AD133=\"\",\"\",Linkwahl!AD133)","v":101},{"$f":"IF(Linkwahl!AE133=\"\",\"\",Linkwahl!AE133)","v":"Federal Constitution of the Swiss Confederation of 18 April 1999"}]
[{"$f":"IF(B4=\"\",\"\",HYPERLINK(\"http://www.admin.ch/ch/e/rs/c\"&SUBSTITUTE(B4,\".\",\"_\")&\".html\",\"SR-Link\"))","v":"SR-Link"},{"$f":"IF(Linkwahl!AD134=\"\",\"\",Linkwahl!AD134)","v":124},{"$f":"IF(Linkwahl!AE134=\"\",\"\",Linkwahl!AE134)","v":"Ordinance of 31 October 2007 on the Use of Private Security Companies by the Federal Government (Ordinance on the Use of Private Security Companies, OUPSC)"}]
["SR-Link",{"$f":"IF(Linkwahl!AD135=\"\",\"\",Linkwahl!AD135)","v":"141.0"},{"$f":"IF(Linkwahl!AE135=\"\",\"\",Linkwahl!AE135)","v":"Federal Act of 29 September 1952 on the Acquisition and Loss of Swiss Citizenship (Federal Act on Citizenship [SCA])"}]
["SR-Link",{"$f":"IF(Linkwahl!AD136=\"\",\"\",Linkwahl!AD136)","v":"141.21"},{"$f":"IF(Linkwahl!AE136=\"\",\"\",Linkwahl!AE136)","v":"Ordinance of 23 November 2005 on Fees under the Federal Act on Swiss Citizenship (FeeO-SCA)"}]
["SR-Link",{"$f":"IF(Linkwahl!AD137=\"\",\"\",Linkwahl!AD137)","v":"142.20"},{"$f":"IF(Linkwahl!AE137=\"\",\"\",Linkwahl!AE137)","v":"Federal Act of 16 December 2005 on Foreign Nationals (FNIA)"}]
["SR-Link",{"$f":"IF(Linkwahl!AD138=\"\",\"\",Linkwahl!AD138)","v":"142.31"},{"$f":"IF(Linkwahl!AE138=\"\",\"\",Linkwahl!AE138)","v":"Asylum Act of 26 June 1998 (AsylA)"}]
["SR-Link",{"$f":"IF(Linkwahl!AD139=\"\",\"\",Linkwahl!AD139)","v":"142.512"},{"$f":"IF(Linkwahl!AE139=\"\",\"\",Linkwahl!AE139)","v":"Ordinance of 18 December 2013 on the Central Visa Information System and the National Visa System (Visa Information System-Ordinance, VISO)"}]
["SR-Link",{"$f":"IF(Linkwahl!AD140=\"\",\"\",Linkwahl!AD140)","v":"151.1"},{"$f":"IF(Linkwahl!AE140=\"\",\"\",Linkwahl!AE140)","v":"Federal Act of 24 March 1995 on Gender Equality (Gender Equality Act, GEA)"}]
["SR-Link",{"$f":"IF(Linkwahl!AD141=\"\",\"\",Linkwahl!AD141)","v":"152.1"},{"$f":"IF(Linkwahl!AE141=\"\",\"\",Linkwahl!AE141)","v":"Federal Act of 26 June 1998 on Archiving (Archiving Act, ArchA)"}]
["SR-Link",{"$f":"IF(Linkwahl!AD142=\"\",\"\",Linkwahl!AD142)","v":"152.11"},{"$f":"IF(Linkwahl!AE142=\"\",\"\",Linkwahl!AE142)","v":"Ordinance of 8 September 1999 to the Federal Act on Archiving (Archiving Ordinance)"}]
["SR-Link",{"$f":"IF(Linkwahl!AD143=\"\",\"\",Linkwahl!AD143)","v":"152.3"},{"$f":"IF(Linkwahl!AE143=\"\",\"\",Linkwahl!AE143)","v":"Federal Act of 17 December 2004 on Freedom of Information in the Administration (Freedom of Information Act, FoIA)"}]
["SR-Link",{"$f":"IF(Linkwahl!AD144=\"\",\"\",Linkwahl!AD144)","v":"152.31"},{"$f":"IF(Linkwahl!AE144=\"\",\"\",Linkwahl!AE144)","v":"Ordinance of 24 May 2006 on Freedom of Information in the Administration (Freedom of Information Ordinance, FoIO)"}]
["SR-Link",{"$f":"IF(Linkwahl!AD145=\"\",\"\",Linkwahl!AD145)","v":"161.1"},{"$f":"IF(Linkwahl!AE145=\"\",\"\",Linkwahl!AE145)","v":"Federal Act of 17 December 1976 on Political Rights"}]
["SR-Link",{"$f":"IF(Linkwahl!AD146=\"\",\"\",Linkwahl!AD146)","v":"161.116"},{"$f":"IF(Linkwahl!AE146=\"\",\"\",Linkwahl!AE146)","v":"Federal Chancellery Ordinance of 13 December 2013 on Electronic Voting (VEleS)"}]
["SR-Link",{"$f":"IF(Linkwahl!AD147=\"\",\"\",Linkwahl!AD147)","v":"170.512"},{"$f":"IF(Linkwahl!AE147=\"\",\"\",Linkwahl!AE147)","v":"Federal Act of 18 June 2004 on the Compilations of Federal Legislation and the Federal Gazette (Publications Act, PublA)"}]
["SR-Link",{"$f":"IF(Linkwahl!AD148=\"\",\"\",Linkwahl!AD148)","v":"171.10"},{"$f":"IF(Linkwahl!AE148=\"\",\"\",Linkwahl!AE148)","v":"Federal Act of 13 December 2002 on the Federal Assembly (Parliament Act, ParlA)"}]
["SR-Link",{"$f":"IF(Linkwahl!AD149=\"\",\"\",Linkwahl!AD149)","v":"171.13"},{"$f":"IF(Linkwahl!AE149=\"\",\"\",Linkwahl!AE149)","v":"Standing Orders of the National Council of 3 October 2003 (SO-NC)"}]
["SR-Link",{"$f":"IF(Linkwahl!AD150=\"\",\"\",Linkwahl!AD150)","v":"171.14"},{"$f":"IF(Linkwahl!AE150=\"\",\"\",Linkwahl!AE150)","v":"Standing Orders of the Council of States of 20 June 2003 (SO-CS)"}]
["SR-Link",{"$f":"IF(Linkwahl!AD151=\"\",\"\",Linkwahl!AD151)","v":"172.010"},{"$f":"IF(Linkwahl!AE151=\"\",\"\",Linkwahl!AE151)","v":"Government and Administration Organisation Act of 21 March 1997 (GAOA)"}]
["SR-Link",{"$f":"IF(Linkwahl!AD152=\"\",\"\",Linkwahl!AD152)","v":"172.021"},{"$f":"IF(Linkwahl!AE152=\"\",\"\",Linkwahl!AE152)","v":"Federal Act of 20 December 1968 on Administrative Procedure (Administrative Procedure Act, APA)"}]
["SR-Link",{"$f":"IF(Linkwahl!AD153=\"\",\"\",Linkwahl!AD153)","v":"172.061"},{"$f":"IF(Linkwahl!AE153=\"\",\"\",Linkwahl!AE153)","v":"Federal Act of 18 March 2005 on the Consultation Procedure (Consultation Procedure Act, CPA)"}]
["SR-Link",{"$f":"IF(Linkwahl!AD154=\"\",\"\",Linkwahl!AD154)","v":"172.081"},{"$f":"IF(Linkwahl!AE154=\"\",\"\",Linkwahl!AE154)","v":"Ordinance on the Federal Administration Language Services Language Services Ordinance, LangSO) "}]
["SR-Link",{"$f":"IF(Linkwahl!AD155=\"\",\"\",Linkwahl!AD155)","v":"172.222.1"},{"$f":"IF(Linkwahl!AE155=\"\",\"\",Linkwahl!AE155)","v":"Federal Act of 20 December 2006 on the Federal Pension Fund (PUBLICA Act)"}]
["SR-Link",{"$f":"IF(Linkwahl!AD156=\"\",\"\",Linkwahl!AD156)","v":"173.41"},{"$f":"IF(Linkwahl!AE156=\"\",\"\",Linkwahl!AE156)","v":"Federal Act of 20 March 2009 on the Federal Patent Court (Patent Court Act, PatCA)"}]
["SR-Link",{"$f":"IF(Linkwahl!AD157=\"\",\"\",Linkwahl!AD157)","v":"191.11"},{"$f":"IF(Linkwahl!AE157=\"\",\"\",Linkwahl!AE157)","v":"Ordinance of 7 October 2015 on the Fees charged by the Federal Department of Foreign Affairs (FDFA Fees Ordinance, FeeO FDFA)"}]
["SR-Link",{"$f":"IF(Linkwahl!AD158=\"\",\"\",Linkwahl!AD158)","v":"192.12"},{"$f":"IF(Linkwahl!AE158=\"\",\"\",Linkwahl!AE158)","v":"Federal Act of 22 June 2007 on the Privileges, Immunities and Facilities and the Financial Subsidies granted by Switzerland as a Host State (\"Host State Act\", \"HSA\")"}]
["SR-Link",{"$f":"IF(Linkwahl!AD159=\"\",\"\",Linkwahl!AD159)","v":"192.121"},{"$f":"IF(Linkwahl!AE159=\"\",\"\",Linkwahl!AE159)","v":"Ordinance of 7 December 2007 to the Federal Act on the Privileges, Immunities and Facilities and the Financial Subsidies granted by Switzerland as a Host State (Host State Ordinance, HSO)"}]
["SR-Link",{"$f":"IF(Linkwahl!AD160=\"\",\"\",Linkwahl!AD160)","v":"195.1"},{"$f":"IF(Linkwahl!AE160=\"\",\"\",Linkwahl!AE160)","v":"Federal Act of 26 September 2014 on Swiss Persons and Institutions Abroad (Swiss Abroad Act, SAA)"}]
["SR-Link",{"$f":"IF(Linkwahl!AD161=\"\",\"\",Linkwahl!AD161)","v":"195.11"},{"$f":"IF(Linkwahl!AE161=\"\",\"\",Linkwahl!AE161)","v":"Ordinance of 7 October 2015 on Swiss Persons and Institutions Abroad (Swiss Abroad Ordinance, SAO)"}]
["SR-Link",{"$f":"IF(Linkwahl!AD162=\"\",\"\",Linkwahl!AD162)","v":"196.1"},{"$f":"IF(Linkwahl!AE162=\"\",\"\",Linkwahl!AE162)","v":"Federal Act of 1 October 2010 on the Restitution of Assets illicitly obtained by Politically Exposed Persons Restitution of Illicit Assets Act (RIAA)"}]
["SR-Link",{"$f":"IF(Linkwahl!AD163=\"\",\"\",Linkwahl!AD163)","v":"210"},{"$f":"IF(Linkwahl!AE163=\"\",\"\",Linkwahl!AE163)","v":"Swiss Civil Code of 10 December 1907"}]
["SR-Link",{"$f":"IF(Linkwahl!AD164=\"\",\"\",Linkwahl!AD164)","v":"211.221.36"},{"$f":"IF(Linkwahl!AE164=\"\",\"\",Linkwahl!AE164)","v":"Ordinance of 29 June 2011 on Adoption (Adoption Ordinance, AdoptO)"}]
["SR-Link",{"$f":"IF(Linkwahl!AD165=\"\",\"\",Linkwahl!AD165)","v":"211.222.32"},{"$f":"IF(Linkwahl!AE165=\"\",\"\",Linkwahl!AE165)","v":"Federal Act of 21 December 2007 on International Child Abduction and the Hague Conventions on the Protection of Children and Adults"}]
["SR-Link",{"$f":"IF(Linkwahl!AD166=\"\",\"\",Linkwahl!AD166)","v":"211.432.2"},{"$f":"IF(Linkwahl!AE166=\"\",\"\",Linkwahl!AE166)","v":"Ordinance of 18 November 1992 on Official Cadastral Surveying"}]
["SR-Link",{"$f":"IF(Linkwahl!AD167=\"\",\"\",Linkwahl!AD167)","v":"211.432.21"},{"$f":"IF(Linkwahl!AE167=\"\",\"\",Linkwahl!AE167)","v":"DDPS Technical Ordinance of 10 June 1994 on Official Cadastral Survey-ing (TOCS)"}]
["SR-Link",{"$f":"IF(Linkwahl!AD168=\"\",\"\",Linkwahl!AD168)","v":"220"},{"$f":"IF(Linkwahl!AE168=\"\",\"\",Linkwahl!AE168)","v":"Federal Act of 30 March 1911 on the Amendment of the Swiss Civil Code (Part Five: The Code of Obligations)"}]
["SR-Link",{"$f":"IF(Linkwahl!AD169=\"\",\"\",Linkwahl!AD169)","v":"231.1 "},{"$f":"IF(Linkwahl!AE169=\"\",\"\",Linkwahl!AE169)","v":"Federal Act of 9 October 1992 on Copyright and Related Rights (Copyright Act, CopA)"}]
["SR-Link",{"$f":"IF(Linkwahl!AD170=\"\",\"\",Linkwahl!AD170)","v":"232.11 "},{"$f":"IF(Linkwahl!AE170=\"\",\"\",Linkwahl!AE170)","v":"Federal Act of 28 August 1992 on the Protection of Trade Marks and Indications of Source (Trade Mark Protection Act, TmPA)"}]
["SR-Link",{"$f":"IF(Linkwahl!AD171=\"\",\"\",Linkwahl!AD171)","v":"232.12  "},{"$f":"IF(Linkwahl!AE171=\"\",\"\",Linkwahl!AE171)","v":"Federal Act of 5 October 2001 on the Protection of Designs Designs Act, DesA)"}]
["SR-Link",{"$f":"IF(Linkwahl!AD172=\"\",\"\",Linkwahl!AD172)","v":"232.14  "},{"$f":"IF(Linkwahl!AE172=\"\",\"\",Linkwahl!AE172)","v":"Federal Act of 25 June 1954 on Patents for Inventions (Patents Act, PatA)"}]
["SR-Link",{"$f":"IF(Linkwahl!AD173=\"\",\"\",Linkwahl!AD173)","v":"232.21"},{"$f":"IF(Linkwahl!AE173=\"\",\"\",Linkwahl!AE173)","v":"Federal Act on the Protection of the Swiss Coat of Arms and Other Public Signs (Coat of Arms Protection, CAPA)"}]
["SR-Link",{"$f":"IF(Linkwahl!AD174=\"\",\"\",Linkwahl!AD174)","v":"235.1"},{"$f":"IF(Linkwahl!AE174=\"\",\"\",Linkwahl!AE174)","v":"Federal Act of 19 June 1992 on Data Protection (FADP)"}]
["SR-Link",{"$f":"IF(Linkwahl!AD175=\"\",\"\",Linkwahl!AD175)","v":"235.11"},{"$f":"IF(Linkwahl!AE175=\"\",\"\",Linkwahl!AE175)","v":"Ordinance of 14 June 1993 to the Federal Act on Data Protection (OFADP)"}]
["SR-Link",{"$f":"IF(Linkwahl!AD176=\"\",\"\",Linkwahl!AD176)","v":"235.13"},{"$f":"IF(Linkwahl!AE176=\"\",\"\",Linkwahl!AE176)","v":"Ordinance of 28 September 2007 on Data Protection Certification (DPCO)"}]
["SR-Link",{"$f":"IF(Linkwahl!AD177=\"\",\"\",Linkwahl!AD177)","v":"251"},{"$f":"IF(Linkwahl!AE177=\"\",\"\",Linkwahl!AE177)","v":"Federal Act of 6 October 1995 on Cartels and other Restraints of Competition (Cartel Act, CartA)"}]
["SR-Link",{"$f":"IF(Linkwahl!AD178=\"\",\"\",Linkwahl!AD178)","v":"251.4"},{"$f":"IF(Linkwahl!AE178=\"\",\"\",Linkwahl!AE178)","v":"Ordinance of 17 June 1996 on the Control of Concentrations of Undertakings (Merger Control Ordinance, MCO)"}]
["SR-Link",{"$f":"IF(Linkwahl!AD179=\"\",\"\",Linkwahl!AD179)","v":"251.5"},{"$f":"IF(Linkwahl!AE179=\"\",\"\",Linkwahl!AE179)","v":"Ordinance of 12 March 2004 on Sanctions imposed for Unlawful Restraints of Competition (Cartel Act Sanctions Ordinance, CASO)"}]
["SR-Link",{"$f":"IF(Linkwahl!AD180=\"\",\"\",Linkwahl!AD180)","v":"272"},{"$f":"IF(Linkwahl!AE180=\"\",\"\",Linkwahl!AE180)","v":"Swiss Civil Procedure Code of 19 December 2008 (Civil Procedure Code, CPC)"}]
["SR-Link",{"$f":"IF(Linkwahl!AD181=\"\",\"\",Linkwahl!AD181)","v":"311.0"},{"$f":"IF(Linkwahl!AE181=\"\",\"\",Linkwahl!AE181)","v":"Swiss Criminal Code of 21 December 1937"}]
["SR-Link",{"$f":"IF(Linkwahl!AD182=\"\",\"\",Linkwahl!AD182)","v":"312.0"},{"$f":"IF(Linkwahl!AE182=\"\",\"\",Linkwahl!AE182)","v":"Swiss Criminal Procedure Code of 5 October 2007 (Criminal Procedure Code, CPC)"}]
["SR-Link",{"$f":"IF(Linkwahl!AD183=\"\",\"\",Linkwahl!AD183)","v":351.1},{"$f":"IF(Linkwahl!AE183=\"\",\"\",Linkwahl!AE183)","v":"Federal Act of 20 March 1981 on International Mutual Assistance in Criminal Matters (Mutual Assistance Act, IMAC)"}]
["SR-Link",{"$f":"IF(Linkwahl!AD184=\"\",\"\",Linkwahl!AD184)","v":"371"},{"$f":"IF(Linkwahl!AE184=\"\",\"\",Linkwahl!AE184)","v":"Federal Act of 20 June 2003 on the Annulment of the Convictions of Persons who assisted Refugees at the time of the Nazi Regime"}]
["SR-Link",{"$f":"IF(Linkwahl!AD185=\"\",\"\",Linkwahl!AD185)","v":"412.10"},{"$f":"IF(Linkwahl!AE185=\"\",\"\",Linkwahl!AE185)","v":"Federal Act of 13 December 2002 on Vocational and Professional Education and Training (Vocational and Professional Education and Training Act, VPETA)"}]
["SR-Link",{"$f":"IF(Linkwahl!AD186=\"\",\"\",Linkwahl!AD186)","v":"412.101"},{"$f":"IF(Linkwahl!AE186=\"\",\"\",Linkwahl!AE186)","v":"Ordinance of 19 November 2003 on Vocational and Professional Education and Training (Vocational and Professional Education and Training Ordinance, VPETO)"}]
["SR-Link",{"$f":"IF(Linkwahl!AD187=\"\",\"\",Linkwahl!AD187)","v":"412.106.1"},{"$f":"IF(Linkwahl!AE187=\"\",\"\",Linkwahl!AE187)","v":"Ordinance of 14 September 2005 on the Swiss Federal Institute for Vocational Education and Training (SFIVET Ordinance)"}]
["SR-Link",{"$f":"IF(Linkwahl!AD188=\"\",\"\",Linkwahl!AD188)","v":"414.110"},{"$f":"IF(Linkwahl!AE188=\"\",\"\",Linkwahl!AE188)","v":"Federal Act of 4 October 1991 on the Federal Institutes of Technology (FIT Act)"}]
["SR-Link",{"$f":"IF(Linkwahl!AD189=\"\",\"\",Linkwahl!AD189)","v":"414.20"},{"$f":"IF(Linkwahl!AE189=\"\",\"\",Linkwahl!AE189)","v":"Federal Act of 30 September 2011 on Funding and Coordination of the Swiss Higher Education Sector (Higher Education Act, HEdA)"}]
["SR-Link",{"$f":"IF(Linkwahl!AD190=\"\",\"\",Linkwahl!AD190)","v":"414.205.3"},{"$f":"IF(Linkwahl!AE190=\"\",\"\",Linkwahl!AE190)","v":"Guidelines of the Higher Education Council of 28 May 2015 for accreditation within the higher education sector (HEdA Accreditation Guidelines)"}]
["SR-Link",{"$f":"IF(Linkwahl!AD191=\"\",\"\",Linkwahl!AD191)","v":"415.0"},{"$f":"IF(Linkwahl!AE191=\"\",\"\",Linkwahl!AE191)","v":"Federal Act of 17 June 2011 on the Prommotion of Sport and Exercice (Sport Promotion Act, SpoPA)"}]
["SR-Link",{"$f":"IF(Linkwahl!AD192=\"\",\"\",Linkwahl!AD192)","v":"420.1"},{"$f":"IF(Linkwahl!AE192=\"\",\"\",Linkwahl!AE192)","v":"Federal Act of 14 December 2012 on the Promotion of Research and Innovation (RIPA)"}]
["SR-Link",{"$f":"IF(Linkwahl!AD193=\"\",\"\",Linkwahl!AD193)","v":"431.01"},{"$f":"IF(Linkwahl!AE193=\"\",\"\",Linkwahl!AE193)","v":"Federal Statistics Act of 9 October 1992 (FStatA)"}]
["SR-Link",{"$f":"IF(Linkwahl!AD194=\"\",\"\",Linkwahl!AD194)","v":"431.011"},{"$f":"IF(Linkwahl!AE194=\"\",\"\",Linkwahl!AE194)","v":"Ordinance of 30 June 1993 on the Organisation of Federal Statistics"}]
["SR-Link",{"$f":"IF(Linkwahl!AD195=\"\",\"\",Linkwahl!AD195)","v":431.02},{"$f":"IF(Linkwahl!AE195=\"\",\"\",Linkwahl!AE195)","v":"Federal Act of 23 June 2006 on the Harmonisation of the Register of Residents and of other Official Registers of Persons (Register Harmonisation Act, RHA)"}]
["SR-Link",{"$f":"IF(Linkwahl!AD196=\"\",\"\",Linkwahl!AD196)","v":"431.112"},{"$f":"IF(Linkwahl!AE196=\"\",\"\",Linkwahl!AE196)","v":"Federal Act of 22 June 2007 on the Federal Census (Census Act)"}]
["SR-Link",{"$f":"IF(Linkwahl!AD197=\"\",\"\",Linkwahl!AD197)","v":"432.22"},{"$f":"IF(Linkwahl!AE197=\"\",\"\",Linkwahl!AE197)","v":"Ordinance of 9 October 2013 on the Library Am Guisanplatz (BiGO)"}]
[{"$f":"IF(B68=\"\",\"\",HYPERLINK(\"http://www.admin.ch/ch/e/rs/c\"&SUBSTITUTE(B68,\".\",\"_\")&\".html\",\"SR-Link\"))","v":"SR-Link"},{"$f":"IF(Linkwahl!AD198=\"\",\"\",Linkwahl!AD198)","v":"441.1"},{"$f":"IF(Linkwahl!AE198=\"\",\"\",Linkwahl!AE198)","v":"Federal Act of 5 October 2007 on the National Languages and Understanding between the Linguistic Communities (Languages Act, LangA) "}]
["SR-Link",{"$f":"IF(Linkwahl!AD199=\"\",\"\",Linkwahl!AD199)","v":"441.11"},{"$f":"IF(Linkwahl!AE199=\"\",\"\",Linkwahl!AE199)","v":"Ordinance of 4 June 2010 on the National Languages and Understanding between the Linguistic Communities (Languages Ordinance, LangO)"}]
["SR-Link",{"$f":"IF(Linkwahl!AD200=\"\",\"\",Linkwahl!AD200)","v":"443.1"},{"$f":"IF(Linkwahl!AE200=\"\",\"\",Linkwahl!AE200)","v":"Federal Act of 14 December 2001 on Film Production and Film Culture (Film Act, FiA)"}]
["SR-Link",{"$f":"IF(Linkwahl!AD201=\"\",\"\",Linkwahl!AD201)","v":"451"},{"$f":"IF(Linkwahl!AE201=\"\",\"\",Linkwahl!AE201)","v":"Federal Act of 1 July 1966 on the Protection of Nature and Cultural Heritage (NCHA)"}]
["SR-Link",{"$f":"IF(Linkwahl!AD202=\"\",\"\",Linkwahl!AD202)","v":"451.1"},{"$f":"IF(Linkwahl!AE202=\"\",\"\",Linkwahl!AE202)","v":"Ordinance of 16 January 1991 on the Protection of Nature and Cultural Heritage (NCHO)"}]
["SR-Link",{"$f":"IF(Linkwahl!AD203=\"\",\"\",Linkwahl!AD203)","v":"451.36"},{"$f":"IF(Linkwahl!AE203=\"\",\"\",Linkwahl!AE203)","v":"Ordinance of 7 November 2007 on Parks of National Importance (Parks Ordinance, ParkO) "}]
["SR-Link",{"$f":"IF(Linkwahl!AD204=\"\",\"\",Linkwahl!AD204)","v":"451.61"},{"$f":"IF(Linkwahl!AE204=\"\",\"\",Linkwahl!AE204)","v":"Ordinance of 11 December 2015 on the Nagoya Protocol on Access to Genetic Resources and the Fair and Equitable Sharing of Benefits Arising from their Utilization (Nagoya Ordinance, NagO)"}]
["SR-Link",{"$f":"IF(Linkwahl!AD205=\"\",\"\",Linkwahl!AD205)","v":"454"},{"$f":"IF(Linkwahl!AE205=\"\",\"\",Linkwahl!AE205)","v":"Federal Act of 19 December 1980 on the Swiss National Park in the Canton of Graubünden (National Park Act)"}]
["SR-Link",{"$f":"IF(Linkwahl!AD206=\"\",\"\",Linkwahl!AD206)","v":"510.411"},{"$f":"IF(Linkwahl!AE206=\"\",\"\",Linkwahl!AE206)","v":"Ordinance on the of 4 July 2007 Protection of Federal Information (Information Protection Ordinance, IPO)"}]
["SR-Link",{"$f":"IF(Linkwahl!AD207=\"\",\"\",Linkwahl!AD207)","v":"510.62"},{"$f":"IF(Linkwahl!AE207=\"\",\"\",Linkwahl!AE207)","v":"Federal Act of 5 October 2007 on Geoinformation (Geoinformation Act, GeoIA)"}]
["SR-Link",{"$f":"IF(Linkwahl!AD208=\"\",\"\",Linkwahl!AD208)","v":"514.51"},{"$f":"IF(Linkwahl!AE208=\"\",\"\",Linkwahl!AE208)","v":"Federal Act of 13 December 1996 on War Material (War Material Act, WMA)"}]
["SR-Link",{"$f":"IF(Linkwahl!AD209=\"\",\"\",Linkwahl!AD209)","v":"514.511"},{"$f":"IF(Linkwahl!AE209=\"\",\"\",Linkwahl!AE209)","v":"Ordinance of 25 February 1998 on War Material (War Material Ordinance, WMO)"}]
["SR-Link",{"$f":"IF(Linkwahl!AD210=\"\",\"\",Linkwahl!AD210)","v":"531"},{"$f":"IF(Linkwahl!AE210=\"\",\"\",Linkwahl!AE210)","v":"Federal Act of 8 October 1982 on the National Economic Supply (National Economic Supply Act [NESA]) "}]
["SR-Link",{"$f":"IF(Linkwahl!AD211=\"\",\"\",Linkwahl!AD211)","v":"632.10"},{"$f":"IF(Linkwahl!AE211=\"\",\"\",Linkwahl!AE211)","v":"Customs Tariff Act of 9 October 1986 (CTA)"}]
["SR-Link",{"$f":"IF(Linkwahl!AD212=\"\",\"\",Linkwahl!AD212)","v":"641.20"},{"$f":"IF(Linkwahl!AE212=\"\",\"\",Linkwahl!AE212)","v":"Federal Act of 12 June 2009 on Value Added Tax (Value Added Tax Act, VAT Act)"}]
["SR-Link",{"$f":"IF(Linkwahl!AD213=\"\",\"\",Linkwahl!AD213)","v":641.20100000000002},{"$f":"IF(Linkwahl!AE213=\"\",\"\",Linkwahl!AE213)","v":"Ordinance of 27 November 2009 on Value Added Tax (Value Added Tax Ordinance, VAT Ordinance)"}]
["SR-Link",{"$f":"IF(Linkwahl!AD214=\"\",\"\",Linkwahl!AD214)","v":"641.201.511"},{"$f":"IF(Linkwahl!AE214=\"\",\"\",Linkwahl!AE214)","v":"Ordinance of the FDF of 11 December 2009 on Electronic Data and Information (OElDI)"}]
["SR-Link",{"$f":"IF(Linkwahl!AD215=\"\",\"\",Linkwahl!AD215)","v":"641.71"},{"$f":"IF(Linkwahl!AE215=\"\",\"\",Linkwahl!AE215)","v":"Federal Act of 23 December 2011 on the Reduction of CO2 Emissions (CO2 Act)"}]
["SR-Link",{"$f":"IF(Linkwahl!AD216=\"\",\"\",Linkwahl!AD216)","v":"641.711"},{"$f":"IF(Linkwahl!AE216=\"\",\"\",Linkwahl!AE216)","v":"Ordinance of 30 November 2012 for the Reduction of CO2 Emissions (CO2 Ordinance)"}]
["SR-Link",{"$f":"IF(Linkwahl!AD217=\"\",\"\",Linkwahl!AD217)","v":"641.714.11"},{"$f":"IF(Linkwahl!AE217=\"\",\"\",Linkwahl!AE217)","v":"Ordinance of 2 June 2017 on the Acquisition and Reporting of Tonne-Kilometre Data relating to Distances Covered by Aircraft "}]
["SR-Link",{"$f":"IF(Linkwahl!AD218=\"\",\"\",Linkwahl!AD218)","v":"651.1"},{"$f":"IF(Linkwahl!AE218=\"\",\"\",Linkwahl!AE218)","v":"Federal Act of 28 September 2012 on International Administrative Assistance in Tax Matters (Tax Administrative Assistance Act, TAAA)"}]
["SR-Link",{"$f":"IF(Linkwahl!AD219=\"\",\"\",Linkwahl!AD219)","v":"672.4"},{"$f":"IF(Linkwahl!AE219=\"\",\"\",Linkwahl!AE219)","v":"Federal Act of 15 June 2012 on International Withholding Tax (IWTA)"}]
["SR-Link",{"$f":"IF(Linkwahl!AD220=\"\",\"\",Linkwahl!AD220)","v":"721.101"},{"$f":"IF(Linkwahl!AE220=\"\",\"\",Linkwahl!AE220)","v":"Federal Act of 1 October 2010 on Water Retaining Facilities (Water Retaining Facilities Act, WRFA)"}]
["SR-Link",{"$f":"IF(Linkwahl!AD221=\"\",\"\",Linkwahl!AD221)","v":"721.101.1"},{"$f":"IF(Linkwahl!AE221=\"\",\"\",Linkwahl!AE221)","v":"Water Retaining Facilities Ordinance of 17 October 2012 (WRFO)"}]
["SR-Link",{"$f":"IF(Linkwahl!AD222=\"\",\"\",Linkwahl!AD222)","v":"732.1"},{"$f":"IF(Linkwahl!AE222=\"\",\"\",Linkwahl!AE222)","v":"Nuclear Energy Act of 21 March 2003 (NEA)"}]
["SR-Link",{"$f":"IF(Linkwahl!AD223=\"\",\"\",Linkwahl!AD223)","v":"732.11"},{"$f":"IF(Linkwahl!AE223=\"\",\"\",Linkwahl!AE223)","v":"Nuclear Energy Ordinance of 10 December 2004 (NEO)"}]
["SR-Link",{"$f":"IF(Linkwahl!AD224=\"\",\"\",Linkwahl!AD224)","v":"734.5"},{"$f":"IF(Linkwahl!AE224=\"\",\"\",Linkwahl!AE224)","v":"Ordinance of 25 November 2015 on Electromagnetic Compatibility (OEMC) "}]
["SR-Link",{"$f":"IF(Linkwahl!AD225=\"\",\"\",Linkwahl!AD225)","v":"742.161"},{"$f":"IF(Linkwahl!AE225=\"\",\"\",Linkwahl!AE225)","v":"Ordinance of 17 December 2014 on the Safety Investigation of Transport Incidents (OSITI)"}]
["SR-Link",{"$f":"IF(Linkwahl!AD226=\"\",\"\",Linkwahl!AD226)","v":"745.2"},{"$f":"IF(Linkwahl!AE226=\"\",\"\",Linkwahl!AE226)","v":"Federal Act of 18 June 2010 on the Security Units of Public Transport Companies (PTSA)"}]
["SR-Link",{"$f":"IF(Linkwahl!AD227=\"\",\"\",Linkwahl!AD227)","v":"745.21"},{"$f":"IF(Linkwahl!AE227=\"\",\"\",Linkwahl!AE227)","v":"Ordinance of 17 August 2011 on the Security Units of Public Transport Companies (PTSO)"}]
["SR-Link",{"$f":"IF(Linkwahl!AD228=\"\",\"\",Linkwahl!AD228)","v":"748.941"},{"$f":"IF(Linkwahl!AE228=\"\",\"\",Linkwahl!AE228)","v":"DETEC Ordinance of 24 November 1994 on Special Category Aircraft (OSCA)"}]
["SR-Link",{"$f":"IF(Linkwahl!AD229=\"\",\"\",Linkwahl!AD229)","v":783.1},{"$f":"IF(Linkwahl!AE229=\"\",\"\",Linkwahl!AE229)","v":"Federal Act of 17 December 2010 on the Organisation of Swiss Post (Post Organisation Act, POA)"}]
["SR-Link",{"$f":"IF(Linkwahl!AD230=\"\",\"\",Linkwahl!AD230)","v":"784.10"},{"$f":"IF(Linkwahl!AE230=\"\",\"\",Linkwahl!AE230)","v":"Telecommunications Act of 30 April 1997 (TCA)"}]
["SR-Link",{"$f":"IF(Linkwahl!AD231=\"\",\"\",Linkwahl!AD231)","v":"784.101.1"},{"$f":"IF(Linkwahl!AE231=\"\",\"\",Linkwahl!AE231)","v":"Ordinance of 9 March 2007 on Telecommunications Services (OTS)"}]
["SR-Link",{"$f":"IF(Linkwahl!AD232=\"\",\"\",Linkwahl!AD232)","v":"784.101.2"},{"$f":"IF(Linkwahl!AE232=\"\",\"\",Linkwahl!AE232)","v":"Ordinance of 25 November 2015 on Telecommunications Installations (FAV)"}]
["SR-Link",{"$f":"IF(Linkwahl!AD233=\"\",\"\",Linkwahl!AD233)","v":"784.104.2"},{"$f":"IF(Linkwahl!AE233=\"\",\"\",Linkwahl!AE233)","v":"Ordinance of 5 November 2014 on Internet Domains (OID)"}]
["SR-Link",{"$f":"IF(Linkwahl!AD234=\"\",\"\",Linkwahl!AD234)","v":"784.40"},{"$f":"IF(Linkwahl!AE234=\"\",\"\",Linkwahl!AE234)","v":"Federal Act of 24 March 2006 on Radio and Television (RTVA) "}]
["SR-Link",{"$f":"IF(Linkwahl!AD235=\"\",\"\",Linkwahl!AD235)","v":"784.401"},{"$f":"IF(Linkwahl!AE235=\"\",\"\",Linkwahl!AE235)","v":"Ordinance of 9 March 2007 on Radio and Television (RTVO)"}]
["SR-Link",{"$f":"IF(Linkwahl!AD236=\"\",\"\",Linkwahl!AD236)","v":"810.11"},{"$f":"IF(Linkwahl!AE236=\"\",\"\",Linkwahl!AE236)","v":"Federal Act of 18 December 1998 on Medically Assisted Reproduction (Reproductive Medicine Act, RMA)"}]
["SR-Link",{"$f":"IF(Linkwahl!AD237=\"\",\"\",Linkwahl!AD237)","v":"810.112.2"},{"$f":"IF(Linkwahl!AE237=\"\",\"\",Linkwahl!AE237)","v":"Reproductive Medicine Ordinance of 4 December 2000 (RMO)"}]
["SR-Link",{"$f":"IF(Linkwahl!AD238=\"\",\"\",Linkwahl!AD238)","v":"810.12"},{"$f":"IF(Linkwahl!AE238=\"\",\"\",Linkwahl!AE238)","v":"Federal Act of 8 October 2004 on Human Genetic Testing (HGTA)"}]
["SR-Link",{"$f":"IF(Linkwahl!AD239=\"\",\"\",Linkwahl!AD239)","v":"810.21"},{"$f":"IF(Linkwahl!AE239=\"\",\"\",Linkwahl!AE239)","v":"Federal Act of 8 October 2004 on the Transplantation of Organs, Tissues and Cells (Transplantation Act)"}]
["SR-Link",{"$f":"IF(Linkwahl!AD240=\"\",\"\",Linkwahl!AD240)","v":"810.30"},{"$f":"IF(Linkwahl!AE240=\"\",\"\",Linkwahl!AE240)","v":"Federal Act of 30 September 2011 on Research involving Human Beings (Human Research Act, HRA)"}]
["SR-Link",{"$f":"IF(Linkwahl!AD241=\"\",\"\",Linkwahl!AD241)","v":"810.301"},{"$f":"IF(Linkwahl!AE241=\"\",\"\",Linkwahl!AE241)","v":"Ordinance of 20 September 2013 on Human Research with the Exception of Clinical Trials (Human Research Ordinance, HRO)"}]
["SR-Link",{"$f":"IF(Linkwahl!AD242=\"\",\"\",Linkwahl!AD242)","v":"810.305"},{"$f":"IF(Linkwahl!AE242=\"\",\"\",Linkwahl!AE242)","v":"Ordinance of 20 September 2013 on Clinical Trials in Human Research (Clinical Trials Ordinance; ClinO)"}]
["SR-Link",{"$f":"IF(Linkwahl!AD243=\"\",\"\",Linkwahl!AD243)","v":"810.308"},{"$f":"IF(Linkwahl!AE243=\"\",\"\",Linkwahl!AE243)","v":"Ordinance of 20 September 2013 on Organisational Aspects of the Human Research Act (HRA Organisation Ordinance, OrgO-HRA)"}]
["SR-Link",{"$f":"IF(Linkwahl!AD244=\"\",\"\",Linkwahl!AD244)","v":"810.31"},{"$f":"IF(Linkwahl!AE244=\"\",\"\",Linkwahl!AE244)","v":"Federal Act of 19 December 2003 on Research Involving Embryonic Stem Cells (Stem Cell Research Act, StRA)"}]
["SR-Link",{"$f":"IF(Linkwahl!AD245=\"\",\"\",Linkwahl!AD245)","v":"810.311"},{"$f":"IF(Linkwahl!AE245=\"\",\"\",Linkwahl!AE245)","v":"Ordinance of 2 February 2005 on Research involving Embryonic Stem Cells (Stem Cell Research Ordinance, SCRO)"}]
["SR-Link",{"$f":"IF(Linkwahl!AD246=\"\",\"\",Linkwahl!AD246)","v":"812.121"},{"$f":"IF(Linkwahl!AE246=\"\",\"\",Linkwahl!AE246)","v":"Federal Act of 3 October 1951 on Narcotics and Psychotropic Substances (Narcotics Act, NarcA)"}]
["SR-Link",{"$f":"IF(Linkwahl!AD247=\"\",\"\",Linkwahl!AD247)","v":812.21},{"$f":"IF(Linkwahl!AE247=\"\",\"\",Linkwahl!AE247)","v":"Federal Act of 15 December 2000 on Medicinal Products and Medical Devices (Therapeutic Products Act, TPA)"}]
["SR-Link",{"$f":"IF(Linkwahl!AD248=\"\",\"\",Linkwahl!AD248)","v":"812.213"},{"$f":"IF(Linkwahl!AE248=\"\",\"\",Linkwahl!AE248)","v":"Medical Devices Ordinance of 17 October 2001 (MedDO)"}]
["SR-Link",{"$f":"IF(Linkwahl!AD249=\"\",\"\",Linkwahl!AD249)","v":"813.1"},{"$f":"IF(Linkwahl!AE249=\"\",\"\",Linkwahl!AE249)","v":"Federal Act of 15 December 2000 on Protection against Dangerous Substances and Preparations (Chemicals Act, ChemA)"}]
["SR-Link",{"$f":"IF(Linkwahl!AD250=\"\",\"\",Linkwahl!AD250)","v":"813.11"},{"$f":"IF(Linkwahl!AE250=\"\",\"\",Linkwahl!AE250)","v":"Ordinance of 5 June 2015 on Protection against Dangerous Substances and Preparations (Chemicals Ordinance, ChemO)"}]
["SR-Link",{"$f":"IF(Linkwahl!AD251=\"\",\"\",Linkwahl!AD251)","v":"813.112.1"},{"$f":"IF(Linkwahl!AE251=\"\",\"\",Linkwahl!AE251)","v":"Ordinance of 18 May 2005 on Good Laboratory Practice (OGLP)"}]
["SR-Link",{"$f":"IF(Linkwahl!AD252=\"\",\"\",Linkwahl!AD252)","v":"813.12"},{"$f":"IF(Linkwahl!AE252=\"\",\"\",Linkwahl!AE252)","v":"Ordinance of 18 May 2005 on the Placing on the Market and Handling of Biocidal Products (Ordinance on Biocidal Products, OBP)"}]
["SR-Link",{"$f":"IF(Linkwahl!AD253=\"\",\"\",Linkwahl!AD253)","v":"814.01"},{"$f":"IF(Linkwahl!AE253=\"\",\"\",Linkwahl!AE253)","v":"Federal Act of 7 October 1983 on the Protection of the Environment (Environmental Protection Act, EPA)"}]
["SR-Link",{"$f":"IF(Linkwahl!AD254=\"\",\"\",Linkwahl!AD254)","v":"814.012"},{"$f":"IF(Linkwahl!AE254=\"\",\"\",Linkwahl!AE254)","v":"Ordinance of 27 February 1991 on Protection against Major Accidents (Major Accidents Ordinance, MAO)"}]
["SR-Link",{"$f":"IF(Linkwahl!AD255=\"\",\"\",Linkwahl!AD255)","v":"814.017"},{"$f":"IF(Linkwahl!AE255=\"\",\"\",Linkwahl!AE255)","v":"Ordinance of 15 December 2006 on the Register relating to Pollutant Release and the Transfer of Waste and of Pollutants in Waste Water (PRTR-V)"}]
["SR-Link",{"$f":"IF(Linkwahl!AD256=\"\",\"\",Linkwahl!AD256)","v":"814.018"},{"$f":"IF(Linkwahl!AE256=\"\",\"\",Linkwahl!AE256)","v":"Ordinance of 12 November 1997 on the Incentive Tax on Volatile Organic Compounds (OVOC)"}]
["SR-Link",{"$f":"IF(Linkwahl!AD257=\"\",\"\",Linkwahl!AD257)","v":"814.20"},{"$f":"IF(Linkwahl!AE257=\"\",\"\",Linkwahl!AE257)","v":"Federal Act of 24 January 1991 on the Protection of Waters (Waters Protection Act, WPA)"}]
["SR-Link",{"$f":"IF(Linkwahl!AD258=\"\",\"\",Linkwahl!AD258)","v":"814.201"},{"$f":"IF(Linkwahl!AE258=\"\",\"\",Linkwahl!AE258)","v":"Waters Protection Ordinance of 28 October 1998 (WPO)"}]
["SR-Link",{"$f":"IF(Linkwahl!AD259=\"\",\"\",Linkwahl!AD259)","v":"814.318.142.1"},{"$f":"IF(Linkwahl!AE259=\"\",\"\",Linkwahl!AE259)","v":"Ordinance of 16 December 1985 on Air Pollution Control (OAPC)"}]
["SR-Link",{"$f":"IF(Linkwahl!AD260=\"\",\"\",Linkwahl!AD260)","v":"814.41"},{"$f":"IF(Linkwahl!AE260=\"\",\"\",Linkwahl!AE260)","v":"Noise Abatement Ordinance of 15 December 1986 (NAO)"}]
["SR-Link",{"$f":"IF(Linkwahl!AD261=\"\",\"\",Linkwahl!AD261)","v":"814.49"},{"$f":"IF(Linkwahl!AE261=\"\",\"\",Linkwahl!AE261)","v":"Ordinance of 28 February 2007 on the Protection of Audiences from Exposure to Hazard-ous Sound Levels and Laser Beams (Sound Levels and Laser Ordinance, SLO)"}]
[{"$f":"IF(B132=\"\",\"\",HYPERLINK(\"http://www.admin.ch/ch/e/rs/c\"&SUBSTITUTE(B132,\".\",\"_\")&\".html\",\"SR-Link\"))","v":"SR-Link"},{"$f":"IF(Linkwahl!AD262=\"\",\"\",Linkwahl!AD262)","v":"814.50"},{"$f":"IF(Linkwahl!AE262=\"\",\"\",Linkwahl!AE262)","v":"Radiological Protection Act of 22 March 1991 (RPA)"}]
["SR-Link",{"$f":"IF(Linkwahl!AD263=\"\",\"\",Linkwahl!AD263)","v":"814.501"},{"$f":"IF(Linkwahl!AE263=\"\",\"\",Linkwahl!AE263)","v":"Radiological Protection Ordinance of 22 June 1994 (RPO)"}]
["SR-Link",{"$f":"IF(Linkwahl!AD264=\"\",\"\",Linkwahl!AD264)","v":"814.621"},{"$f":"IF(Linkwahl!AE264=\"\",\"\",Linkwahl!AE264)","v":"Ordinance of 5 July 2000 on Beverage Containers (Beverage Container Ordinance, BCO)"}]
["SR-Link",{"$f":"IF(Linkwahl!AD265=\"\",\"\",Linkwahl!AD265)","v":"814.680"},{"$f":"IF(Linkwahl!AE265=\"\",\"\",Linkwahl!AE265)","v":"Ordinance of 26 August 1998 on the Remediation of Polluted Sites (Contaminated Sites Ordinance, CSO)"}]
["SR-Link",{"$f":"IF(Linkwahl!AD266=\"\",\"\",Linkwahl!AD266)","v":"814.681"},{"$f":"IF(Linkwahl!AE266=\"\",\"\",Linkwahl!AE266)","v":"Ordinance of 26 September 2008 on the Charge for the Remediation of Contaminated Sites (OCRCS)"}]
["SR-Link",{"$f":"IF(Linkwahl!AD267=\"\",\"\",Linkwahl!AD267)","v":"814.81"},{"$f":"IF(Linkwahl!AE267=\"\",\"\",Linkwahl!AE267)","v":"Ordinance of 18 May 2005 on the Reduction of Risks relating to the Use of Certain Particularly Dangerous Substances, Preparations and Articles (Chemical Risk Reduction Ordinance, ORRChem)"}]
["SR-Link",{"$f":"IF(Linkwahl!AD268=\"\",\"\",Linkwahl!AD268)","v":"814.82"},{"$f":"IF(Linkwahl!AE268=\"\",\"\",Linkwahl!AE268)","v":"Ordinance of 10 November 2004 on the Rotterdam Convention on the Prior Informed Consent Procedure for Certain Chemicals in International Trade (PIC Ordinance, ChemPICO)"}]
["SR-Link",{"$f":"IF(Linkwahl!AD269=\"\",\"\",Linkwahl!AD269)","v":"814.91"},{"$f":"IF(Linkwahl!AE269=\"\",\"\",Linkwahl!AE269)","v":"Federal Act of 21 March 2003 on Non-Human Gene Technology (Gene Technology Act, GTA)"}]
["SR-Link",{"$f":"IF(Linkwahl!AD270=\"\",\"\",Linkwahl!AD270)","v":"814.911"},{"$f":"IF(Linkwahl!AE270=\"\",\"\",Linkwahl!AE270)","v":"Ordinance of 10 September 2008 on the Handling of Organisms in the Environment (Release Ordinance, RO)"}]
["SR-Link",{"$f":"IF(Linkwahl!AD271=\"\",\"\",Linkwahl!AD271)","v":"814.912.21"},{"$f":"IF(Linkwahl!AE271=\"\",\"\",Linkwahl!AE271)","v":"Ordinance of 3 November 2004 on the Transboundary Movements of Genetically Modified Organisms (Cartagena Ordinance, CartO)"}]
["SR-Link",{"$f":"IF(Linkwahl!AD272=\"\",\"\",Linkwahl!AD272)","v":"817.0"},{"$f":"IF(Linkwahl!AE272=\"\",\"\",Linkwahl!AE272)","v":"Federal Act of 9 October 1992 on Foodstuffs and Utility Articles (Foodstuffs Act, FSA)"}]
["SR-Link",{"$f":"IF(Linkwahl!AD273=\"\",\"\",Linkwahl!AD273)","v":"817.064"},{"$f":"IF(Linkwahl!AE273=\"\",\"\",Linkwahl!AE273)","v":"Ordinance of the FDHA of 10 December 2007 on Combined Warnings on Tobacco Products"}]
["SR-Link",{"$f":"IF(Linkwahl!AD274=\"\",\"\",Linkwahl!AD274)","v":"910.1"},{"$f":"IF(Linkwahl!AE274=\"\",\"\",Linkwahl!AE274)","v":"Federal Act of 29 April 1998 on Agriculture (Agriculture Act, AgricA)"}]
["SR-Link",{"$f":"IF(Linkwahl!AD275=\"\",\"\",Linkwahl!AD275)","v":"910.12"},{"$f":"IF(Linkwahl!AE275=\"\",\"\",Linkwahl!AE275)","v":"Ordinance of 28 May 1997 on the Protection of Designations of Origin and Geographical Indications for Agricultural Products and Processed Agricultural Products (PDO/PGI Ordinance)"}]
["SR-Link",{"$f":"IF(Linkwahl!AD276=\"\",\"\",Linkwahl!AD276)","v":"910.124"},{"$f":"IF(Linkwahl!AE276=\"\",\"\",Linkwahl!AE276)","v":"Ordinance of the FDEA of 11 June 1999 on the Minimum Requirements for Control Procedures of Protected Designations of Origin and Geographical Indications (Ordinance on the Control of PDOs and PGIs)"}]
["SR-Link",{"$f":"IF(Linkwahl!AD277=\"\",\"\",Linkwahl!AD277)","v":"910.81"},{"$f":"IF(Linkwahl!AE277=\"\",\"\",Linkwahl!AE277)","v":"EAER Ordinance of 22 September 1997 on Organic Farming"}]
["SR-Link",{"$f":"IF(Linkwahl!AD278=\"\",\"\",Linkwahl!AD278)","v":"921.0"},{"$f":"IF(Linkwahl!AE278=\"\",\"\",Linkwahl!AE278)","v":"Federal Act of 4 October 1991 on Forest (Forest Act, ForA)"}]
["SR-Link",{"$f":"IF(Linkwahl!AD279=\"\",\"\",Linkwahl!AD279)","v":"921.01"},{"$f":"IF(Linkwahl!AE279=\"\",\"\",Linkwahl!AE279)","v":"Ordinance of 30 November 1992 on Forest (Forest Ordinance, ForO)"}]
["SR-Link",{"$f":"IF(Linkwahl!AD280=\"\",\"\",Linkwahl!AD280)","v":"935.41"},{"$f":"IF(Linkwahl!AE280=\"\",\"\",Linkwahl!AE280)","v":"Federal Act of 27 September 2013 on Private Security Services provided Abroad (PSSA)"}]
["SR-Link",{"$f":"IF(Linkwahl!AD281=\"\",\"\",Linkwahl!AD281)","v":"935.411"},{"$f":"IF(Linkwahl!AE281=\"\",\"\",Linkwahl!AE281)","v":"Ordinance of 24 June 2015 on Private Security Services provided Abroad (OPSA)"}]
["SR-Link",{"$f":"IF(Linkwahl!AD282=\"\",\"\",Linkwahl!AD282)","v":"935.62"},{"$f":"IF(Linkwahl!AE282=\"\",\"\",Linkwahl!AE282)","v":"Federal Act of 20 March 2009 on Patent Attorneys (Patent Attorney Act, PatAA)"}]
["SR-Link",{"$f":"IF(Linkwahl!AD283=\"\",\"\",Linkwahl!AD283)","v":"935.621"},{"$f":"IF(Linkwahl!AE283=\"\",\"\",Linkwahl!AE283)","v":"Patent Attorney Ordinance of 11 May 2011 (PatAO)"}]
["SR-Link",{"$f":"IF(Linkwahl!AD284=\"\",\"\",Linkwahl!AD284)","v":"935.91"},{"$f":"IF(Linkwahl!AE284=\"\",\"\",Linkwahl!AE284)","v":"Federal Act of 17 December 2010 on Mountain Guides and Organisers of other High-Risk Activities"}]
["SR-Link",{"$f":"IF(Linkwahl!AD285=\"\",\"\",Linkwahl!AD285)","v":"935.911"},{"$f":"IF(Linkwahl!AE285=\"\",\"\",Linkwahl!AE285)","v":"Ordinance of 30 November 2012 on Mountain Guides and Organisers of other High-Risk Activities (High-Risk Activities Ordinance)"}]
["SR-Link",{"$f":"IF(Linkwahl!AD286=\"\",\"\",Linkwahl!AD286)","v":"941.10"},{"$f":"IF(Linkwahl!AE286=\"\",\"\",Linkwahl!AE286)","v":"Federal Act of 22 December 1999 on Currency and Payment Instruments (CPIA)"}]
["SR-Link",{"$f":"IF(Linkwahl!AD287=\"\",\"\",Linkwahl!AD287)","v":"941.31"},{"$f":"IF(Linkwahl!AE287=\"\",\"\",Linkwahl!AE287)","v":"Federal Act of 20 June 1933 on the Control of the Trade in Precious Metals and Precious Metal Articles (Precious Metals Control Act, PMCA)"}]
["SR-Link",{"$f":"IF(Linkwahl!AD288=\"\",\"\",Linkwahl!AD288)","v":"941.311"},{"$f":"IF(Linkwahl!AE288=\"\",\"\",Linkwahl!AE288)","v":"Ordinance of 8 May 1934 on the Control of Trade in Precious Metals and Articles of Precious Metals (Precious Metals Control Ordinance, PMCO)"}]
["SR-Link",{"$f":"IF(Linkwahl!AD289=\"\",\"\",Linkwahl!AD289)","v":"941.319"},{"$f":"IF(Linkwahl!AE289=\"\",\"\",Linkwahl!AE289)","v":"Ordinance of 17 August 2005 on the Fees for Precious Metals Control"}]
["SR-Link",{"$f":"IF(Linkwahl!AD290=\"\",\"\",Linkwahl!AD290)","v":"944.021"},{"$f":"IF(Linkwahl!AE290=\"\",\"\",Linkwahl!AE290)","v":"Ordinance of 4 June 2010 on the Declaration for Timber and Timber Products"}]
["SR-Link",{"$f":"IF(Linkwahl!AD291=\"\",\"\",Linkwahl!AD291)","v":"944.021.1"},{"$f":"IF(Linkwahl!AE291=\"\",\"\",Linkwahl!AE291)","v":"FDEA Ordinance of 7 June 2010 on the Declaration for Timber and Timber Products"}]
["SR-Link",{"$f":"IF(Linkwahl!AD292=\"\",\"\",Linkwahl!AD292)","v":"944.3"},{"$f":"IF(Linkwahl!AE292=\"\",\"\",Linkwahl!AE292)","v":"Federal Act of 18 June 1993 on Package Travel"}]
["SR-Link",{"$f":"IF(Linkwahl!AD293=\"\",\"\",Linkwahl!AD293)","v":"946.15"},{"$f":"IF(Linkwahl!AE293=\"\",\"\",Linkwahl!AE293)","v":"Ordinance of 1 May 2013 on the Organisation of the National Contact Point for the OECD Guidelines for Multinational Enterprises and on its Advisory Board (NCPO-OECD) "}]
["SR-Link",{"$f":"IF(Linkwahl!AD294=\"\",\"\",Linkwahl!AD294)","v":"946.202"},{"$f":"IF(Linkwahl!AE294=\"\",\"\",Linkwahl!AE294)","v":"Federal Act of 13 December 1996 on the Control of Dual-Use Goods and of Specific Military Goods (Goods Control Act, GCA)"}]
["SR-Link",{"$f":"IF(Linkwahl!AD295=\"\",\"\",Linkwahl!AD295)","v":"946.202.1"},{"$f":"IF(Linkwahl!AE295=\"\",\"\",Linkwahl!AE295)","v":"Ordinance of 3 June 2016 on the Export, Import and Transit of Dual Use Goods, Specific Military Goods and Strategic Goods (Goods Control Ordinance, GCO) "}]
["SR-Link",{"$f":"IF(Linkwahl!AD296=\"\",\"\",Linkwahl!AD296)","v":"946.231"},{"$f":"IF(Linkwahl!AE296=\"\",\"\",Linkwahl!AE296)","v":"Federal Act of 22 March 2002 on the Implementation of International Sanctions (Embargo Act, EmbA)"}]
["SR-Link",{"$f":"IF(Linkwahl!AD297=\"\",\"\",Linkwahl!AD297)","v":"946.31"},{"$f":"IF(Linkwahl!AE297=\"\",\"\",Linkwahl!AE297)","v":"Ordinance of 9 April 2008 on the Certification of the Non-Preferential Origin of Goods (OCG)"}]
["SR-Link",{"$f":"IF(Linkwahl!AD298=\"\",\"\",Linkwahl!AD298)","v":"946.311"},{"$f":"IF(Linkwahl!AE298=\"\",\"\",Linkwahl!AE298)","v":"Ordinance of the FDEA of 9 April 2008 on the Certification of the Non-Preferential Origin of Goods (OCG-FDEA)"}]
["SR-Link",{"$f":"IF(Linkwahl!AD299=\"\",\"\",Linkwahl!AD299)","v":"951.11"},{"$f":"IF(Linkwahl!AE299=\"\",\"\",Linkwahl!AE299)","v":"Federal Act of 3 October 2003 on the Swiss National Bank (National Bank Act, NBA)"}]
["SR-Link",{"$f":"IF(Linkwahl!AD300=\"\",\"\",Linkwahl!AD300)","v":"951.131"},{"$f":"IF(Linkwahl!AE300=\"\",\"\",Linkwahl!AE300)","v":"Ordinance of 18 March 2004 on the Federal Act on the Swiss National Bank (National Bank Ordinance, NBO)"}]
["SR-Link",{"$f":"IF(Linkwahl!AD301=\"\",\"\",Linkwahl!AD301)","v":"951.31"},{"$f":"IF(Linkwahl!AE301=\"\",\"\",Linkwahl!AE301)","v":"Federal Act of 23 June 2006 on Collective Investment Schemes (Collective Investment Schemes Act, CISA)"}]
["SR-Link",{"$f":"IF(Linkwahl!AD302=\"\",\"\",Linkwahl!AD302)","v":"951.311"},{"$f":"IF(Linkwahl!AE302=\"\",\"\",Linkwahl!AE302)","v":"Ordinance of 22 November 2006 on Collective Investment Schemes Collective Investment Schemes Ordinance, CISO)"}]
["SR-Link",{"$f":"IF(Linkwahl!AD303=\"\",\"\",Linkwahl!AD303)","v":"951.312"},{"$f":"IF(Linkwahl!AE303=\"\",\"\",Linkwahl!AE303)","v":"Ordinance of 27 August 2014 of the Swiss Financial Market Supervisory Authority on Collective Investment Schemes (FINMA Collective Investment Schemes Ordinance, CISO-FINMA)"}]
["SR-Link",{"$f":"IF(Linkwahl!AD304=\"\",\"\",Linkwahl!AD304)","v":952.05},{"$f":"IF(Linkwahl!AE304=\"\",\"\",Linkwahl!AE304)","v":"Ordinance of 30 August 2012 of the Swiss Financial Market Supervisory Authority on the Insolvency of Banks and Securities Dealers (Banking Insolvency Ordinance, BIO-FINMA)"}]
["SR-Link",{"$f":"IF(Linkwahl!AD305=\"\",\"\",Linkwahl!AD305)","v":"955.0"},{"$f":"IF(Linkwahl!AE305=\"\",\"\",Linkwahl!AE305)","v":"Federal Act of 10 October 1997 on Combating Money Laundering and Terrorist Financing in the Financial Sector (Anti-Money Laundering Act, AMLA)"}]
["SR-Link",{"$f":"IF(Linkwahl!AD306=\"\",\"\",Linkwahl!AD306)","v":"956.1"},{"$f":"IF(Linkwahl!AE306=\"\",\"\",Linkwahl!AE306)","v":"Federal Act of 22 June 2007 on the Swiss Financial Market Supervisory Authority (Financial Market Supervision Act, FINMASA)"}]
["SR-Link",{"$f":"IF(Linkwahl!AD307=\"\",\"\",Linkwahl!AD307)","v":"957.1"},{"$f":"IF(Linkwahl!AE307=\"\",\"\",Linkwahl!AE307)","v":"Federal Act of 3 October 2008 on Intermediated Securities (Federal Intermediated Securities Act, FISA)"}]
["SR-Link",{"$f":"IF(Linkwahl!AD308=\"\",\"\",Linkwahl!AD308)","v":"958.1"},{"$f":"IF(Linkwahl!AE308=\"\",\"\",Linkwahl!AE308)","v":"Federal Act of 19 June 2015 on Financial Market Infrastructures and Market Conduct in Securities and Derivatives Trading (Financial Market Infrastructure Act, FMIA)"}]
["SR-Link",{"$f":"IF(Linkwahl!AD309=\"\",\"\",Linkwahl!AD309)","v":"958.11"},{"$f":"IF(Linkwahl!AE309=\"\",\"\",Linkwahl!AE309)","v":"Ordinance of 25 November 2015 on Financial Market Infrastructures and Market Conduct in Securities and Derivatives Trading (Financial Market Infrastructure Ordinance, FMIO)"}]
["SR-Link",{"$f":"IF(Linkwahl!AD310=\"\",\"\",Linkwahl!AD310)","v":"958.111"},{"$f":"IF(Linkwahl!AE310=\"\",\"\",Linkwahl!AE310)","v":"Ordinance of 3 December 2015 of the Swiss Financial Market Supervisory Authority on Financial Market Infrastructures and Market Conduct in Securities and Derivatives Trading (FINMA Financial Market Infrastructure Ordinance, FMIO-FINMA)"}]
["",{"$f":"IF(Linkwahl!AD311=\"\",\"\",Linkwahl!AD311)","v":""},{"$f":"IF(Linkwahl!AE311=\"\",\"\",Linkwahl!AE311)","v":""}]
["",{"$f":"IF(Linkwahl!AD312=\"\",\"\",Linkwahl!AD312)","v":""},{"$f":"IF(Linkwahl!AE312=\"\",\"\",Linkwahl!AE312)","v":""}]
["",{"$f":"IF(Linkwahl!AD313=\"\",\"\",Linkwahl!AD313)","v":""},{"$f":"IF(Linkwahl!AE313=\"\",\"\",Linkwahl!AE313)","v":""}]
["",{"$f":"IF(Linkwahl!AD314=\"\",\"\",Linkwahl!AD314)","v":""},{"$f":"IF(Linkwahl!AE314=\"\",\"\",Linkwahl!AE314)","v":""}]
["",{"$f":"IF(Linkwahl!AD315=\"\",\"\",Linkwahl!AD315)","v":""},{"$f":"IF(Linkwahl!AE315=\"\",\"\",Linkwahl!AE315)","v":""}]
[{"$f":"IF(B186=\"\",\"\",HYPERLINK(\"http://www.admin.ch/ch/e/rs/c\"&SUBSTITUTE(B186,\".\",\"_\")&\".html\",\"SR-Link\"))","v":""},{"$f":"IF(Linkwahl!AD356=\"\",\"\",Linkwahl!AD356)","v":""},{"$f":"IF(Linkwahl!AE356=\"\",\"\",Linkwahl!AE356)","v":""}]
["",{"$f":"IF(Linkwahl!AD357=\"\",\"\",Linkwahl!AD357)","v":""},{"$f":"IF(Linkwahl!AE357=\"\",\"\",Linkwahl!AE357)","v":""}]
["",{"$f":"IF(Linkwahl!AD358=\"\",\"\",Linkwahl!AD358)","v":""},{"$f":"IF(Linkwahl!AE358=\"\",\"\",Linkwahl!AE358)","v":""}]
["",{"$f":"IF(Linkwahl!AD359=\"\",\"\",Linkwahl!AD359)","v":""},{"$f":"IF(Linkwahl!AE359=\"\",\"\",Linkwahl!AE359)","v":""}]
["",{"$f":"IF(Linkwahl!AD360=\"\",\"\",Linkwahl!AD360)","v":""},{"$f":"IF(Linkwahl!AE360=\"\",\"\",Linkwahl!AE360)","v":""}]
["",{"$f":"IF(Linkwahl!AD361=\"\",\"\",Linkwahl!AD361)","v":""},{"$f":"IF(Linkwahl!AE361=\"\",\"\",Linkwahl!AE361)","v":""}]
["",{"$f":"IF(Linkwahl!AD362=\"\",\"\",Linkwahl!AD362)","v":""},{"$f":"IF(Linkwahl!AE362=\"\",\"\",Linkwahl!AE362)","v":""}]
["",{"$f":"IF(Linkwahl!AD363=\"\",\"\",Linkwahl!AD363)","v":""},{"$f":"IF(Linkwahl!AE363=\"\",\"\",Linkwahl!AE363)","v":""}]
["",{"$f":"IF(Linkwahl!AD364=\"\",\"\",Linkwahl!AD364)","v":""},{"$f":"IF(Linkwahl!AE364=\"\",\"\",Linkwahl!AE364)","v":""}]
["",{"$f":"IF(Linkwahl!AD365=\"\",\"\",Linkwahl!AD365)","v":""},{"$f":"IF(Linkwahl!AE365=\"\",\"\",Linkwahl!AE365)","v":""}]
["",{"$f":"IF(Linkwahl!AD366=\"\",\"\",Linkwahl!AD366)","v":""},{"$f":"IF(Linkwahl!AE366=\"\",\"\",Linkwahl!AE366)","v":""}]
["",{"$f":"IF(Linkwahl!AD367=\"\",\"\",Linkwahl!AD367)","v":""},{"$f":"IF(Linkwahl!AE367=\"\",\"\",Linkwahl!AE367)","v":""}]
["",{"$f":"IF(Linkwahl!AD368=\"\",\"\",Linkwahl!AD368)","v":""},{"$f":"IF(Linkwahl!AE368=\"\",\"\",Linkwahl!AE368)","v":""}]
["",{"$f":"IF(Linkwahl!AD369=\"\",\"\",Linkwahl!AD369)","v":""},{"$f":"IF(Linkwahl!AE369=\"\",\"\",Linkwahl!AE369)","v":""}]
["",{"$f":"IF(Linkwahl!AD370=\"\",\"\",Linkwahl!AD370)","v":""},{"$f":"IF(Linkwahl!AE370=\"\",\"\",Linkwahl!AE370)","v":""}]
["",{"$f":"IF(Linkwahl!AD371=\"\",\"\",Linkwahl!AD371)","v":""},{"$f":"IF(Linkwahl!AE371=\"\",\"\",Linkwahl!AE371)","v":""}]
["",{"$f":"IF(Linkwahl!AD372=\"\",\"\",Linkwahl!AD372)","v":""},{"$f":"IF(Linkwahl!AE372=\"\",\"\",Linkwahl!AE372)","v":""}]
["",{"$f":"IF(Linkwahl!AD373=\"\",\"\",Linkwahl!AD373)","v":""},{"$f":"IF(Linkwahl!AE373=\"\",\"\",Linkwahl!AE373)","v":""}]
[{"$f":"IF(B204=\"\",\"\",HYPERLINK(\"http://www.admin.ch/ch/e/rs/c\"&SUBSTITUTE(B204,\".\",\"_\")&\".html\",\"SR-Link\"))","v":""},{"$f":"IF(Linkwahl!AD374=\"\",\"\",Linkwahl!AD374)","v":""},{"$f":"IF(Linkwahl!AE374=\"\",\"\",Linkwahl!AE374)","v":""}]
["",{"$f":"IF(Linkwahl!AD375=\"\",\"\",Linkwahl!AD375)","v":""},{"$f":"IF(Linkwahl!AE375=\"\",\"\",Linkwahl!AE375)","v":""}]
["",{"$f":"IF(Linkwahl!AD376=\"\",\"\",Linkwahl!AD376)","v":""},{"$f":"IF(Linkwahl!AE376=\"\",\"\",Linkwahl!AE376)","v":""}]
["",{"$f":"IF(Linkwahl!AD377=\"\",\"\",Linkwahl!AD377)","v":""},{"$f":"IF(Linkwahl!AE377=\"\",\"\",Linkwahl!AE377)","v":""}]
["",{"$f":"IF(Linkwahl!AD378=\"\",\"\",Linkwahl!AD378)","v":""},{"$f":"IF(Linkwahl!AE378=\"\",\"\",Linkwahl!AE378)","v":""}]
["",{"$f":"IF(Linkwahl!AD379=\"\",\"\",Linkwahl!AD379)","v":""},{"$f":"IF(Linkwahl!AE379=\"\",\"\",Linkwahl!AE379)","v":""}]
["",{"$f":"IF(Linkwahl!AD380=\"\",\"\",Linkwahl!AD380)","v":""},{"$f":"IF(Linkwahl!AE380=\"\",\"\",Linkwahl!AE380)","v":""}]
["",{"$f":"IF(Linkwahl!AD381=\"\",\"\",Linkwahl!AD381)","v":""},{"$f":"IF(Linkwahl!AE381=\"\",\"\",Linkwahl!AE381)","v":""}]
["",{"$f":"IF(Linkwahl!AD382=\"\",\"\",Linkwahl!AD382)","v":""},{"$f":"IF(Linkwahl!AE382=\"\",\"\",Linkwahl!AE382)","v":""}]
["",{"$f":"IF(Linkwahl!AD383=\"\",\"\",Linkwahl!AD383)","v":""},{"$f":"IF(Linkwahl!AE383=\"\",\"\",Linkwahl!AE383)","v":""}]
["",{"$f":"IF(Linkwahl!AD384=\"\",\"\",Linkwahl!AD384)","v":""},{"$f":"IF(Linkwahl!AE384=\"\",\"\",Linkwahl!AE384)","v":""}]
["",{"$f":"IF(Linkwahl!AD385=\"\",\"\",Linkwahl!AD385)","v":""},{"$f":"IF(Linkwahl!AE385=\"\",\"\",Linkwahl!AE385)","v":""}]
["",{"$f":"IF(Linkwahl!AD386=\"\",\"\",Linkwahl!AD386)","v":""},{"$f":"IF(Linkwahl!AE386=\"\",\"\",Linkwahl!AE386)","v":""}]
["",{"$f":"IF(Linkwahl!AD387=\"\",\"\",Linkwahl!AD387)","v":""},{"$f":"IF(Linkwahl!AE387=\"\",\"\",Linkwahl!AE387)","v":""}]
["",{"$f":"IF(Linkwahl!AD388=\"\",\"\",Linkwahl!AD388)","v":""},{"$f":"IF(Linkwahl!AE388=\"\",\"\",Linkwahl!AE388)","v":""}]
["",{"$f":"IF(Linkwahl!AD389=\"\",\"\",Linkwahl!AD389)","v":""},{"$f":"IF(Linkwahl!AE389=\"\",\"\",Linkwahl!AE389)","v":""}]
["",{"$f":"IF(Linkwahl!AD390=\"\",\"\",Linkwahl!AD390)","v":""},{"$f":"IF(Linkwahl!AE390=\"\",\"\",Linkwahl!AE390)","v":""}]
["",{"$f":"IF(Linkwahl!AD391=\"\",\"\",Linkwahl!AD391)","v":""},{"$f":"IF(Linkwahl!AE391=\"\",\"\",Linkwahl!AE391)","v":""}]
["",{"$f":"IF(Linkwahl!AD392=\"\",\"\",Linkwahl!AD392)","v":""},{"$f":"IF(Linkwahl!AE392=\"\",\"\",Linkwahl!AE392)","v":""}]
["",{"$f":"IF(Linkwahl!AD393=\"\",\"\",Linkwahl!AD393)","v":""},{"$f":"IF(Linkwahl!AE393=\"\",\"\",Linkwahl!AE393)","v":""}]
["",{"$f":"IF(Linkwahl!AD394=\"\",\"\",Linkwahl!AD394)","v":""},{"$f":"IF(Linkwahl!AE394=\"\",\"\",Linkwahl!AE394)","v":""}]
["",{"$f":"IF(Linkwahl!AD395=\"\",\"\",Linkwahl!AD395)","v":""},{"$f":"IF(Linkwahl!AE395=\"\",\"\",Linkwahl!AE395)","v":""}]
["",{"$f":"IF(Linkwahl!AD396=\"\",\"\",Linkwahl!AD396)","v":""},{"$f":"IF(Linkwahl!AE396=\"\",\"\",Linkwahl!AE396)","v":""}]
["",{"$f":"IF(Linkwahl!AD397=\"\",\"\",Linkwahl!AD397)","v":""},{"$f":"IF(Linkwahl!AE397=\"\",\"\",Linkwahl!AE397)","v":""}]
["",{"$f":"IF(Linkwahl!AD398=\"\",\"\",Linkwahl!AD398)","v":""},{"$f":"IF(Linkwahl!AE398=\"\",\"\",Linkwahl!AE398)","v":""}]
["",{"$f":"IF(Linkwahl!AD399=\"\",\"\",Linkwahl!AD399)","v":""},{"$f":"IF(Linkwahl!AE399=\"\",\"\",Linkwahl!AE399)","v":""}]
["",{"$f":"IF(Linkwahl!AD400=\"\",\"\",Linkwahl!AD400)","v":""},{"$f":"IF(Linkwahl!AE400=\"\",\"\",Linkwahl!AE400)","v":""}]
["",{"$f":"IF(Linkwahl!AD401=\"\",\"\",Linkwahl!AD401)","v":""},{"$f":"IF(Linkwahl!AE401=\"\",\"\",Linkwahl!AE401)","v":""}]
["",{"$f":"IF(Linkwahl!AD402=\"\",\"\",Linkwahl!AD402)","v":""},{"$f":"IF(Linkwahl!AE402=\"\",\"\",Linkwahl!AE402)","v":""}]
["",{"$f":"IF(Linkwahl!AD403=\"\",\"\",Linkwahl!AD403)","v":""},{"$f":"IF(Linkwahl!AE403=\"\",\"\",Linkwahl!AE403)","v":""}]
["",{"$f":"IF(Linkwahl!AD404=\"\",\"\",Linkwahl!AD404)","v":""},{"$f":"IF(Linkwahl!AE404=\"\",\"\",Linkwahl!AE404)","v":""}]
["",{"$f":"IF(Linkwahl!AD405=\"\",\"\",Linkwahl!AD405)","v":""},{"$f":"IF(Linkwahl!AE405=\"\",\"\",Linkwahl!AE405)","v":""}]
[{"$f":"IF(B236=\"\",\"\",HYPERLINK(\"http://www.admin.ch/ch/e/rs/c\"&SUBSTITUTE(B236,\".\",\"_\")&\".html\",\"SR-Link\"))","v":""},{"$f":"IF(Linkwahl!AD422=\"\",\"\",Linkwahl!AD422)","v":""},{"$f":"IF(Linkwahl!AE422=\"\",\"\",Linkwahl!AE422)","v":""}]
["",{"$f":"IF(Linkwahl!AD423=\"\",\"\",Linkwahl!AD423)","v":""},{"$f":"IF(Linkwahl!AE423=\"\",\"\",Linkwahl!AE423)","v":""}]
["",{"$f":"IF(Linkwahl!AD424=\"\",\"\",Linkwahl!AD424)","v":""},{"$f":"IF(Linkwahl!AE424=\"\",\"\",Linkwahl!AE424)","v":""}]
["",{"$f":"IF(Linkwahl!AD425=\"\",\"\",Linkwahl!AD425)","v":""},{"$f":"IF(Linkwahl!AE425=\"\",\"\",Linkwahl!AE425)","v":""}]
["",{"$f":"IF(Linkwahl!AD426=\"\",\"\",Linkwahl!AD426)","v":""},{"$f":"IF(Linkwahl!AE426=\"\",\"\",Linkwahl!AE426)","v":""}]
["",{"$f":"IF(Linkwahl!AD427=\"\",\"\",Linkwahl!AD427)","v":""},{"$f":"IF(Linkwahl!AE427=\"\",\"\",Linkwahl!AE427)","v":""}]
["",{"$f":"IF(Linkwahl!AD428=\"\",\"\",Linkwahl!AD428)","v":""},{"$f":"IF(Linkwahl!AE428=\"\",\"\",Linkwahl!AE428)","v":""}]
["",{"$f":"IF(Linkwahl!AD429=\"\",\"\",Linkwahl!AD429)","v":""},{"$f":"IF(Linkwahl!AE429=\"\",\"\",Linkwahl!AE429)","v":""}]
["",{"$f":"IF(Linkwahl!AD430=\"\",\"\",Linkwahl!AD430)","v":""},{"$f":"IF(Linkwahl!AE430=\"\",\"\",Linkwahl!AE430)","v":""}]
["",{"$f":"IF(Linkwahl!AD431=\"\",\"\",Linkwahl!AD431)","v":""},{"$f":"IF(Linkwahl!AE431=\"\",\"\",Linkwahl!AE431)","v":""}]
["",{"$f":"IF(Linkwahl!AD432=\"\",\"\",Linkwahl!AD432)","v":""},{"$f":"IF(Linkwahl!AE432=\"\",\"\",Linkwahl!AE432)","v":""}]
["",{"$f":"IF(Linkwahl!AD433=\"\",\"\",Linkwahl!AD433)","v":""},{"$f":"IF(Linkwahl!AE433=\"\",\"\",Linkwahl!AE433)","v":""}]
["",{"$f":"IF(Linkwahl!AD434=\"\",\"\",Linkwahl!AD434)","v":""},{"$f":"IF(Linkwahl!AE434=\"\",\"\",Linkwahl!AE434)","v":""}]
["",{"$f":"IF(Linkwahl!AD435=\"\",\"\",Linkwahl!AD435)","v":""},{"$f":"IF(Linkwahl!AE435=\"\",\"\",Linkwahl!AE435)","v":""}]
["",{"$f":"IF(Linkwahl!AD436=\"\",\"\",Linkwahl!AD436)","v":""},{"$f":"IF(Linkwahl!AE436=\"\",\"\",Linkwahl!AE436)","v":""}]
["",{"$f":"IF(Linkwahl!AD437=\"\",\"\",Linkwahl!AD437)","v":""},{"$f":"IF(Linkwahl!AE437=\"\",\"\",Linkwahl!AE437)","v":""}]
["",{"$f":"IF(Linkwahl!AD438=\"\",\"\",Linkwahl!AD438)","v":""},{"$f":"IF(Linkwahl!AE438=\"\",\"\",Linkwahl!AE438)","v":""}]
["",{"$f":"IF(Linkwahl!AD439=\"\",\"\",Linkwahl!AD439)","v":""},{"$f":"IF(Linkwahl!AE439=\"\",\"\",Linkwahl!AE439)","v":""}]
["",{"$f":"IF(Linkwahl!AD440=\"\",\"\",Linkwahl!AD440)","v":""},{"$f":"IF(Linkwahl!AE440=\"\",\"\",Linkwahl!AE440)","v":""}]
["",{"$f":"IF(Linkwahl!AD441=\"\",\"\",Linkwahl!AD441)","v":""},{"$f":"IF(Linkwahl!AE441=\"\",\"\",Linkwahl!AE441)","v":""}]
["",{"$f":"IF(Linkwahl!AD442=\"\",\"\",Linkwahl!AD442)","v":""},{"$f":"IF(Linkwahl!AE442=\"\",\"\",Linkwahl!AE442)","v":""}]
["",{"$f":"IF(Linkwahl!AD443=\"\",\"\",Linkwahl!AD443)","v":""},{"$f":"IF(Linkwahl!AE443=\"\",\"\",Linkwahl!AE443)","v":""}]
["",{"$f":"IF(Linkwahl!AD444=\"\",\"\",Linkwahl!AD444)","v":""},{"$f":"IF(Linkwahl!AE444=\"\",\"\",Linkwahl!AE444)","v":""}]
["",{"$f":"IF(Linkwahl!AD446=\"\",\"\",Linkwahl!AD446)","v":""},{"$f":"IF(Linkwahl!AE446=\"\",\"\",Linkwahl!AE446)","v":""}]
["",{"$f":"IF(Linkwahl!AD447=\"\",\"\",Linkwahl!AD447)","v":""},{"$f":"IF(Linkwahl!AE447=\"\",\"\",Linkwahl!AE447)","v":""}]
["",{"$f":"IF(Linkwahl!AD448=\"\",\"\",Linkwahl!AD448)","v":""},{"$f":"IF(Linkwahl!AE448=\"\",\"\",Linkwahl!AE448)","v":""}]
["",{"$f":"IF(Linkwahl!AD449=\"\",\"\",Linkwahl!AD449)","v":""},{"$f":"IF(Linkwahl!AE449=\"\",\"\",Linkwahl!AE449)","v":""}]
["",{"$f":"IF(Linkwahl!AD450=\"\",\"\",Linkwahl!AD450)","v":""},{"$f":"IF(Linkwahl!AE450=\"\",\"\",Linkwahl!AE450)","v":""}]
["",{"$f":"IF(Linkwahl!AD451=\"\",\"\",Linkwahl!AD451)","v":""},{"$f":"IF(Linkwahl!AE451=\"\",\"\",Linkwahl!AE451)","v":""}]
["",{"$f":"IF(Linkwahl!AD452=\"\",\"\",Linkwahl!AD452)","v":""},{"$f":"IF(Linkwahl!AE452=\"\",\"\",Linkwahl!AE452)","v":""}]
["",{"$f":"IF(Linkwahl!AD453=\"\",\"\",Linkwahl!AD453)","v":""},{"$f":"IF(Linkwahl!AE453=\"\",\"\",Linkwahl!AE453)","v":""}]
["",{"$f":"IF(Linkwahl!AD454=\"\",\"\",Linkwahl!AD454)","v":""},{"$f":"IF(Linkwahl!AE454=\"\",\"\",Linkwahl!AE454)","v":""}]
[{"$f":"IF(B268=\"\",\"\",HYPERLINK(\"http://www.admin.ch/ch/e/rs/c\"&SUBSTITUTE(B268,\".\",\"_\")&\".html\",\"SR-Link\"))","v":""},{"$f":"IF(Linkwahl!AD455=\"\",\"\",Linkwahl!AD455)","v":""},{"$f":"IF(Linkwahl!AE455=\"\",\"\",Linkwahl!AE455)","v":""}]
["",{"$f":"IF(Linkwahl!AD456=\"\",\"\",Linkwahl!AD456)","v":""},{"$f":"IF(Linkwahl!AE456=\"\",\"\",Linkwahl!AE456)","v":""}]
["",{"$f":"IF(Linkwahl!AD457=\"\",\"\",Linkwahl!AD457)","v":""},{"$f":"IF(Linkwahl!AE457=\"\",\"\",Linkwahl!AE457)","v":""}]
["",{"$f":"IF(Linkwahl!AD458=\"\",\"\",Linkwahl!AD458)","v":""},{"$f":"IF(Linkwahl!AE458=\"\",\"\",Linkwahl!AE458)","v":""}]
["",{"$f":"IF(Linkwahl!AD459=\"\",\"\",Linkwahl!AD459)","v":""},{"$f":"IF(Linkwahl!AE459=\"\",\"\",Linkwahl!AE459)","v":""}]
["",{"$f":"IF(Linkwahl!AD460=\"\",\"\",Linkwahl!AD460)","v":""},{"$f":"IF(Linkwahl!AE460=\"\",\"\",Linkwahl!AE460)","v":""}]
["",{"$f":"IF(Linkwahl!AD461=\"\",\"\",Linkwahl!AD461)","v":""},{"$f":"IF(Linkwahl!AE461=\"\",\"\",Linkwahl!AE461)","v":""}]
["",{"$f":"IF(Linkwahl!AD462=\"\",\"\",Linkwahl!AD462)","v":""},{"$f":"IF(Linkwahl!AE462=\"\",\"\",Linkwahl!AE462)","v":""}]
["",{"$f":"IF(Linkwahl!AD463=\"\",\"\",Linkwahl!AD463)","v":""},{"$f":"IF(Linkwahl!AE463=\"\",\"\",Linkwahl!AE463)","v":""}]
["",{"$f":"IF(Linkwahl!AD464=\"\",\"\",Linkwahl!AD464)","v":""},{"$f":"IF(Linkwahl!AE464=\"\",\"\",Linkwahl!AE464)","v":""}]
["",{"$f":"IF(Linkwahl!AD465=\"\",\"\",Linkwahl!AD465)","v":""},{"$f":"IF(Linkwahl!AE465=\"\",\"\",Linkwahl!AE465)","v":""}]
["",{"$f":"IF(Linkwahl!AD466=\"\",\"\",Linkwahl!AD466)","v":""},{"$f":"IF(Linkwahl!AE466=\"\",\"\",Linkwahl!AE466)","v":""}]
["",{"$f":"IF(Linkwahl!AD467=\"\",\"\",Linkwahl!AD467)","v":""},{"$f":"IF(Linkwahl!AE467=\"\",\"\",Linkwahl!AE467)","v":""}]
["",{"$f":"IF(Linkwahl!AD468=\"\",\"\",Linkwahl!AD468)","v":""},{"$f":"IF(Linkwahl!AE468=\"\",\"\",Linkwahl!AE468)","v":""}]
["",{"$f":"IF(Linkwahl!AD469=\"\",\"\",Linkwahl!AD469)","v":""},{"$f":"IF(Linkwahl!AE469=\"\",\"\",Linkwahl!AE469)","v":""}]
["",{"$f":"IF(Linkwahl!AD470=\"\",\"\",Linkwahl!AD470)","v":""},{"$f":"IF(Linkwahl!AE470=\"\",\"\",Linkwahl!AE470)","v":""}]
["",{"$f":"IF(Linkwahl!AD471=\"\",\"\",Linkwahl!AD471)","v":""},{"$f":"IF(Linkwahl!AE471=\"\",\"\",Linkwahl!AE471)","v":""}]
["",{"$f":"IF(Linkwahl!AD472=\"\",\"\",Linkwahl!AD472)","v":""},{"$f":"IF(Linkwahl!AE472=\"\",\"\",Linkwahl!AE472)","v":""}]
["",{"$f":"IF(Linkwahl!AD473=\"\",\"\",Linkwahl!AD473)","v":""},{"$f":"IF(Linkwahl!AE473=\"\",\"\",Linkwahl!AE473)","v":""}]
["",{"$f":"IF(Linkwahl!AD474=\"\",\"\",Linkwahl!AD474)","v":""},{"$f":"IF(Linkwahl!AE474=\"\",\"\",Linkwahl!AE474)","v":""}]
["",{"$f":"IF(Linkwahl!AD475=\"\",\"\",Linkwahl!AD475)","v":""},{"$f":"IF(Linkwahl!AE475=\"\",\"\",Linkwahl!AE475)","v":""}]
["",{"$f":"IF(Linkwahl!AD476=\"\",\"\",Linkwahl!AD476)","v":""},{"$f":"IF(Linkwahl!AE476=\"\",\"\",Linkwahl!AE476)","v":""}]
["",{"$f":"IF(Linkwahl!AD477=\"\",\"\",Linkwahl!AD477)","v":""},{"$f":"IF(Linkwahl!AE477=\"\",\"\",Linkwahl!AE477)","v":""}]
["",{"$f":"IF(Linkwahl!AD478=\"\",\"\",Linkwahl!AD478)","v":""},{"$f":"IF(Linkwahl!AE478=\"\",\"\",Linkwahl!AE478)","v":""}]
["",{"$f":"IF(Linkwahl!AD479=\"\",\"\",Linkwahl!AD479)","v":""},{"$f":"IF(Linkwahl!AE479=\"\",\"\",Linkwahl!AE479)","v":""}]
["",{"$f":"IF(Linkwahl!AD480=\"\",\"\",Linkwahl!AD480)","v":""},{"$f":"IF(Linkwahl!AE480=\"\",\"\",Linkwahl!AE480)","v":""}]
["",{"$f":"IF(Linkwahl!AD481=\"\",\"\",Linkwahl!AD481)","v":""},{"$f":"IF(Linkwahl!AE481=\"\",\"\",Linkwahl!AE481)","v":""}]
["",{"$f":"IF(Linkwahl!AD482=\"\",\"\",Linkwahl!AD482)","v":""},{"$f":"IF(Linkwahl!AE482=\"\",\"\",Linkwahl!AE482)","v":""}]
["",{"$f":"IF(Linkwahl!AD483=\"\",\"\",Linkwahl!AD483)","v":""},{"$f":"IF(Linkwahl!AE483=\"\",\"\",Linkwahl!AE483)","v":""}]
["",{"$f":"IF(Linkwahl!AD484=\"\",\"\",Linkwahl!AD484)","v":""},{"$f":"IF(Linkwahl!AE484=\"\",\"\",Linkwahl!AE484)","v":""}]
["",{"$f":"IF(Linkwahl!AD485=\"\",\"\",Linkwahl!AD485)","v":""},{"$f":"IF(Linkwahl!AE485=\"\",\"\",Linkwahl!AE485)","v":""}]
["",{"$f":"IF(Linkwahl!AD486=\"\",\"\",Linkwahl!AD486)","v":""},{"$f":"IF(Linkwahl!AE486=\"\",\"\",Linkwahl!AE486)","v":""}]
["",{"$f":"IF(Linkwahl!AD487=\"\",\"\",Linkwahl!AD487)","v":""},{"$f":"IF(Linkwahl!AE487=\"\",\"\",Linkwahl!AE487)","v":""}]
["",{"$f":"IF(Linkwahl!AD488=\"\",\"\",Linkwahl!AD488)","v":""},{"$f":"IF(Linkwahl!AE488=\"\",\"\",Linkwahl!AE488)","v":""}]
["",{"$f":"IF(Linkwahl!AD489=\"\",\"\",Linkwahl!AD489)","v":""},{"$f":"IF(Linkwahl!AE489=\"\",\"\",Linkwahl!AE489)","v":""}]
["",{"$f":"IF(Linkwahl!AD490=\"\",\"\",Linkwahl!AD490)","v":""},{"$f":"IF(Linkwahl!AE490=\"\",\"\",Linkwahl!AE490)","v":""}]
["",{"$f":"IF(Linkwahl!AD491=\"\",\"\",Linkwahl!AD491)","v":""},{"$f":"IF(Linkwahl!AE491=\"\",\"\",Linkwahl!AE491)","v":""}]
["",{"$f":"IF(Linkwahl!AD492=\"\",\"\",Linkwahl!AD492)","v":""},{"$f":"IF(Linkwahl!AE492=\"\",\"\",Linkwahl!AE492)","v":""}]
["",{"$f":"IF(Linkwahl!AD493=\"\",\"\",Linkwahl!AD493)","v":""},{"$f":"IF(Linkwahl!AE493=\"\",\"\",Linkwahl!AE493)","v":""}]
["",{"$f":"IF(Linkwahl!AD494=\"\",\"\",Linkwahl!AD494)","v":""},{"$f":"IF(Linkwahl!AE494=\"\",\"\",Linkwahl!AE494)","v":""}]
["",{"$f":"IF(Linkwahl!AD495=\"\",\"\",Linkwahl!AD495)","v":""},{"$f":"IF(Linkwahl!AE495=\"\",\"\",Linkwahl!AE495)","v":""}]
["",{"$f":"IF(Linkwahl!AD496=\"\",\"\",Linkwahl!AD496)","v":""},{"$f":"IF(Linkwahl!AE496=\"\",\"\",Linkwahl!AE496)","v":""}]
["",{"$f":"IF(Linkwahl!AD497=\"\",\"\",Linkwahl!AD497)","v":""},{"$f":"IF(Linkwahl!AE497=\"\",\"\",Linkwahl!AE497)","v":""}]
["",{"$f":"IF(Linkwahl!AD498=\"\",\"\",Linkwahl!AD498)","v":""},{"$f":"IF(Linkwahl!AE498=\"\",\"\",Linkwahl!AE498)","v":""}]
["",{"$f":"IF(Linkwahl!AD499=\"\",\"\",Linkwahl!AD499)","v":""},{"$f":"IF(Linkwahl!AE499=\"\",\"\",Linkwahl!AE499)","v":""}]
["",{"$f":"IF(Linkwahl!AD500=\"\",\"\",Linkwahl!AD500)","v":""},{"$f":"IF(Linkwahl!AE500=\"\",\"\",Linkwahl!AE500)","v":""}]
["",{"$f":"IF(Linkwahl!AD501=\"\",\"\",Linkwahl!AD501)","v":""},{"$f":"IF(Linkwahl!AE501=\"\",\"\",Linkwahl!AE501)","v":""}]
["",{"$f":"IF(Linkwahl!AD502=\"\",\"\",Linkwahl!AD502)","v":""},{"$f":"IF(Linkwahl!AE502=\"\",\"\",Linkwahl!AE502)","v":""}]
["",{"$f":"IF(Linkwahl!AD503=\"\",\"\",Linkwahl!AD503)","v":""},{"$f":"IF(Linkwahl!AE503=\"\",\"\",Linkwahl!AE503)","v":""}]
["",{"$f":"IF(Linkwahl!AD504=\"\",\"\",Linkwahl!AD504)","v":""},{"$f":"IF(Linkwahl!AE504=\"\",\"\",Linkwahl!AE504)","v":""}]
["",{"$f":"IF(Linkwahl!AD505=\"\",\"\",Linkwahl!AD505)","v":""},{"$f":"IF(Linkwahl!AE505=\"\",\"\",Linkwahl!AE505)","v":""}]
["",{"$f":"IF(Linkwahl!AD506=\"\",\"\",Linkwahl!AD506)","v":""},{"$f":"IF(Linkwahl!AE506=\"\",\"\",Linkwahl!AE506)","v":""}]
["",{"$f":"IF(Linkwahl!AD507=\"\",\"\",Linkwahl!AD507)","v":""},{"$f":"IF(Linkwahl!AE507=\"\",\"\",Linkwahl!AE507)","v":""}]
["",{"$f":"IF(Linkwahl!AD508=\"\",\"\",Linkwahl!AD508)","v":""},{"$f":"IF(Linkwahl!AE508=\"\",\"\",Linkwahl!AE508)","v":""}]
["",{"$f":"IF(Linkwahl!AD509=\"\",\"\",Linkwahl!AD509)","v":""},{"$f":"IF(Linkwahl!AE509=\"\",\"\",Linkwahl!AE509)","v":""}]
["",{"$f":"IF(Linkwahl!AD510=\"\",\"\",Linkwahl!AD510)","v":""},{"$f":"IF(Linkwahl!AE510=\"\",\"\",Linkwahl!AE510)","v":""}]
["",{"$f":"IF(Linkwahl!AD511=\"\",\"\",Linkwahl!AD511)","v":""},{"$f":"IF(Linkwahl!AE511=\"\",\"\",Linkwahl!AE511)","v":""}]
["",{"$f":"IF(Linkwahl!AD512=\"\",\"\",Linkwahl!AD512)","v":""},{"$f":"IF(Linkwahl!AE512=\"\",\"\",Linkwahl!AE512)","v":""}]
["",{"$f":"IF(Linkwahl!AD513=\"\",\"\",Linkwahl!AD513)","v":""},{"$f":"IF(Linkwahl!AE513=\"\",\"\",Linkwahl!AE513)","v":""}]
["",{"$f":"IF(Linkwahl!AD514=\"\",\"\",Linkwahl!AD514)","v":""},{"$f":"IF(Linkwahl!AE514=\"\",\"\",Linkwahl!AE514)","v":""}]
["",{"$f":"IF(Linkwahl!AD515=\"\",\"\",Linkwahl!AD515)","v":""},{"$f":"IF(Linkwahl!AE515=\"\",\"\",Linkwahl!AE515)","v":""}]
["",{"$f":"IF(Linkwahl!AD516=\"\",\"\",Linkwahl!AD516)","v":""},{"$f":"IF(Linkwahl!AE516=\"\",\"\",Linkwahl!AE516)","v":""}]
["",{"$f":"IF(Linkwahl!AD517=\"\",\"\",Linkwahl!AD517)","v":""},{"$f":"IF(Linkwahl!AE517=\"\",\"\",Linkwahl!AE517)","v":""}]
["",{"$f":"IF(Linkwahl!AD518=\"\",\"\",Linkwahl!AD518)","v":""},{"$f":"IF(Linkwahl!AE518=\"\",\"\",Linkwahl!AE518)","v":""}]
[{"$f":"IF(B332=\"\",\"\",HYPERLINK(\"http://www.admin.ch/ch/e/rs/c\"&SUBSTITUTE(B332,\".\",\"_\")&\".html\",\"SR-Link\"))","v":""},{"$f":"IF(Linkwahl!AD519=\"\",\"\",Linkwahl!AD519)","v":""},{"$f":"IF(Linkwahl!AE519=\"\",\"\",Linkwahl!AE519)","v":""}]
["",{"$f":"IF(Linkwahl!AD520=\"\",\"\",Linkwahl!AD520)","v":""},{"$f":"IF(Linkwahl!AE520=\"\",\"\",Linkwahl!AE520)","v":""}]
["",{"$f":"IF(Linkwahl!AD521=\"\",\"\",Linkwahl!AD521)","v":""},{"$f":"IF(Linkwahl!AE521=\"\",\"\",Linkwahl!AE521)","v":""}]
["",{"$f":"IF(Linkwahl!AD522=\"\",\"\",Linkwahl!AD522)","v":""},{"$f":"IF(Linkwahl!AE522=\"\",\"\",Linkwahl!AE522)","v":""}]
["",{"$f":"IF(Linkwahl!AD523=\"\",\"\",Linkwahl!AD523)","v":""},{"$f":"IF(Linkwahl!AE523=\"\",\"\",Linkwahl!AE523)","v":""}]
["",{"$f":"IF(Linkwahl!AD524=\"\",\"\",Linkwahl!AD524)","v":""},{"$f":"IF(Linkwahl!AE524=\"\",\"\",Linkwahl!AE524)","v":""}]
["",{"$f":"IF(Linkwahl!AD525=\"\",\"\",Linkwahl!AD525)","v":""},{"$f":"IF(Linkwahl!AE525=\"\",\"\",Linkwahl!AE525)","v":""}]
["",{"$f":"IF(Linkwahl!AD526=\"\",\"\",Linkwahl!AD526)","v":""},{"$f":"IF(Linkwahl!AE526=\"\",\"\",Linkwahl!AE526)","v":""}]
["",{"$f":"IF(Linkwahl!AD527=\"\",\"\",Linkwahl!AD527)","v":""},{"$f":"IF(Linkwahl!AE527=\"\",\"\",Linkwahl!AE527)","v":""}]
["",{"$f":"IF(Linkwahl!AD528=\"\",\"\",Linkwahl!AD528)","v":""},{"$f":"IF(Linkwahl!AE528=\"\",\"\",Linkwahl!AE528)","v":""}]
["",{"$f":"IF(Linkwahl!AD529=\"\",\"\",Linkwahl!AD529)","v":""},{"$f":"IF(Linkwahl!AE529=\"\",\"\",Linkwahl!AE529)","v":""}]
["",{"$f":"IF(Linkwahl!AD530=\"\",\"\",Linkwahl!AD530)","v":""},{"$f":"IF(Linkwahl!AE530=\"\",\"\",Linkwahl!AE530)","v":""}]
["",{"$f":"IF(Linkwahl!AD531=\"\",\"\",Linkwahl!AD531)","v":""},{"$f":"IF(Linkwahl!AE531=\"\",\"\",Linkwahl!AE531)","v":""}]
["",{"$f":"IF(Linkwahl!AD532=\"\",\"\",Linkwahl!AD532)","v":""},{"$f":"IF(Linkwahl!AE532=\"\",\"\",Linkwahl!AE532)","v":""}]
["",{"$f":"IF(Linkwahl!AD533=\"\",\"\",Linkwahl!AD533)","v":""},{"$f":"IF(Linkwahl!AE533=\"\",\"\",Linkwahl!AE533)","v":""}]
["",{"$f":"IF(Linkwahl!AD534=\"\",\"\",Linkwahl!AD534)","v":""},{"$f":"IF(Linkwahl!AE534=\"\",\"\",Linkwahl!AE534)","v":""}]
["",{"$f":"IF(Linkwahl!AD535=\"\",\"\",Linkwahl!AD535)","v":""},{"$f":"IF(Linkwahl!AE535=\"\",\"\",Linkwahl!AE535)","v":""}]
["",{"$f":"IF(Linkwahl!AD536=\"\",\"\",Linkwahl!AD536)","v":""},{"$f":"IF(Linkwahl!AE536=\"\",\"\",Linkwahl!AE536)","v":""}]
["",{"$f":"IF(Linkwahl!AD537=\"\",\"\",Linkwahl!AD537)","v":""},{"$f":"IF(Linkwahl!AE537=\"\",\"\",Linkwahl!AE537)","v":""}]
["",{"$f":"IF(Linkwahl!AD538=\"\",\"\",Linkwahl!AD538)","v":""},{"$f":"IF(Linkwahl!AE538=\"\",\"\",Linkwahl!AE538)","v":""}]
["",{"$f":"IF(Linkwahl!AD539=\"\",\"\",Linkwahl!AD539)","v":""},{"$f":"IF(Linkwahl!AE539=\"\",\"\",Linkwahl!AE539)","v":""}]
["",{"$f":"IF(Linkwahl!AD540=\"\",\"\",Linkwahl!AD540)","v":""},{"$f":"IF(Linkwahl!AE540=\"\",\"\",Linkwahl!AE540)","v":""}]
["",{"$f":"IF(Linkwahl!AD541=\"\",\"\",Linkwahl!AD541)","v":""},{"$f":"IF(Linkwahl!AE541=\"\",\"\",Linkwahl!AE541)","v":""}]
["",{"$f":"IF(Linkwahl!AD542=\"\",\"\",Linkwahl!AD542)","v":""},{"$f":"IF(Linkwahl!AE542=\"\",\"\",Linkwahl!AE542)","v":""}]
["",{"$f":"IF(Linkwahl!AD543=\"\",\"\",Linkwahl!AD543)","v":""},{"$f":"IF(Linkwahl!AE543=\"\",\"\",Linkwahl!AE543)","v":""}]
["",{"$f":"IF(Linkwahl!AD544=\"\",\"\",Linkwahl!AD544)","v":""},{"$f":"IF(Linkwahl!AE544=\"\",\"\",Linkwahl!AE544)","v":""}]
["",{"$f":"IF(Linkwahl!AD545=\"\",\"\",Linkwahl!AD545)","v":""},{"$f":"IF(Linkwahl!AE545=\"\",\"\",Linkwahl!AE545)","v":""}]
["",{"$f":"IF(Linkwahl!AD546=\"\",\"\",Linkwahl!AD546)","v":""},{"$f":"IF(Linkwahl!AE546=\"\",\"\",Linkwahl!AE546)","v":""}]
["",{"$f":"IF(Linkwahl!AD547=\"\",\"\",Linkwahl!AD547)","v":""},{"$f":"IF(Linkwahl!AE547=\"\",\"\",Linkwahl!AE547)","v":""}]
["",{"$f":"IF(Linkwahl!AD548=\"\",\"\",Linkwahl!AD548)","v":""},{"$f":"IF(Linkwahl!AE548=\"\",\"\",Linkwahl!AE548)","v":""}]
["",{"$f":"IF(Linkwahl!AD549=\"\",\"\",Linkwahl!AD549)","v":""},{"$f":"IF(Linkwahl!AE549=\"\",\"\",Linkwahl!AE549)","v":""}]
["",{"$f":"IF(Linkwahl!AD550=\"\",\"\",Linkwahl!AD550)","v":""},{"$f":"IF(Linkwahl!AE550=\"\",\"\",Linkwahl!AE550)","v":""}]
["",{"$f":"IF(Linkwahl!AD551=\"\",\"\",Linkwahl!AD551)","v":""},{"$f":"IF(Linkwahl!AE551=\"\",\"\",Linkwahl!AE551)","v":""}]
["",{"$f":"IF(Linkwahl!AD552=\"\",\"\",Linkwahl!AD552)","v":""},{"$f":"IF(Linkwahl!AE552=\"\",\"\",Linkwahl!AE552)","v":""}]
["",{"$f":"IF(Linkwahl!AD553=\"\",\"\",Linkwahl!AD553)","v":""},{"$f":"IF(Linkwahl!AE553=\"\",\"\",Linkwahl!AE553)","v":""}]
["",{"$f":"IF(Linkwahl!AD554=\"\",\"\",Linkwahl!AD554)","v":""},{"$f":"IF(Linkwahl!AE554=\"\",\"\",Linkwahl!AE554)","v":""}]
["",{"$f":"IF(Linkwahl!AD555=\"\",\"\",Linkwahl!AD555)","v":""},{"$f":"IF(Linkwahl!AE555=\"\",\"\",Linkwahl!AE555)","v":""}]
["",{"$f":"IF(Linkwahl!AD556=\"\",\"\",Linkwahl!AD556)","v":""},{"$f":"IF(Linkwahl!AE556=\"\",\"\",Linkwahl!AE556)","v":""}]
["",{"$f":"IF(Linkwahl!AD557=\"\",\"\",Linkwahl!AD557)","v":""},{"$f":"IF(Linkwahl!AE557=\"\",\"\",Linkwahl!AE557)","v":""}]
["",{"$f":"IF(Linkwahl!AD558=\"\",\"\",Linkwahl!AD558)","v":""},{"$f":"IF(Linkwahl!AE558=\"\",\"\",Linkwahl!AE558)","v":""}]
["",{"$f":"IF(Linkwahl!AD559=\"\",\"\",Linkwahl!AD559)","v":""},{"$f":"IF(Linkwahl!AE559=\"\",\"\",Linkwahl!AE559)","v":""}]
["",{"$f":"IF(Linkwahl!AD560=\"\",\"\",Linkwahl!AD560)","v":""},{"$f":"IF(Linkwahl!AE560=\"\",\"\",Linkwahl!AE560)","v":""}]
["",{"$f":"IF(Linkwahl!AD561=\"\",\"\",Linkwahl!AD561)","v":""},{"$f":"IF(Linkwahl!AE561=\"\",\"\",Linkwahl!AE561)","v":""}]
["",{"$f":"IF(Linkwahl!AD562=\"\",\"\",Linkwahl!AD562)","v":""},{"$f":"IF(Linkwahl!AE562=\"\",\"\",Linkwahl!AE562)","v":""}]
["",{"$f":"IF(Linkwahl!AD563=\"\",\"\",Linkwahl!AD563)","v":""},{"$f":"IF(Linkwahl!AE563=\"\",\"\",Linkwahl!AE563)","v":""}]
["",{"$f":"IF(Linkwahl!AD564=\"\",\"\",Linkwahl!AD564)","v":""},{"$f":"IF(Linkwahl!AE564=\"\",\"\",Linkwahl!AE564)","v":""}]
["",{"$f":"IF(Linkwahl!AD565=\"\",\"\",Linkwahl!AD565)","v":""},{"$f":"IF(Linkwahl!AE565=\"\",\"\",Linkwahl!AE565)","v":""}]
["",{"$f":"IF(Linkwahl!AD566=\"\",\"\",Linkwahl!AD566)","v":""},{"$f":"IF(Linkwahl!AE566=\"\",\"\",Linkwahl!AE566)","v":""}]
["",{"$f":"IF(Linkwahl!AD567=\"\",\"\",Linkwahl!AD567)","v":""},{"$f":"IF(Linkwahl!AE567=\"\",\"\",Linkwahl!AE567)","v":""}]
["",{"$f":"IF(Linkwahl!AD568=\"\",\"\",Linkwahl!AD568)","v":""},{"$f":"IF(Linkwahl!AE568=\"\",\"\",Linkwahl!AE568)","v":""}]
["",{"$f":"IF(Linkwahl!AD569=\"\",\"\",Linkwahl!AD569)","v":""},{"$f":"IF(Linkwahl!AE569=\"\",\"\",Linkwahl!AE569)","v":""}]
["",{"$f":"IF(Linkwahl!AD570=\"\",\"\",Linkwahl!AD570)","v":""},{"$f":"IF(Linkwahl!AE570=\"\",\"\",Linkwahl!AE570)","v":""}]
["",{"$f":"IF(Linkwahl!AD571=\"\",\"\",Linkwahl!AD571)","v":""},{"$f":"IF(Linkwahl!AE571=\"\",\"\",Linkwahl!AE571)","v":""}]
["",{"$f":"IF(Linkwahl!AD572=\"\",\"\",Linkwahl!AD572)","v":""},{"$f":"IF(Linkwahl!AE572=\"\",\"\",Linkwahl!AE572)","v":""}]
["",{"$f":"IF(Linkwahl!AD573=\"\",\"\",Linkwahl!AD573)","v":""},{"$f":"IF(Linkwahl!AE573=\"\",\"\",Linkwahl!AE573)","v":""}]
["",{"$f":"IF(Linkwahl!AD574=\"\",\"\",Linkwahl!AD574)","v":""},{"$f":"IF(Linkwahl!AE574=\"\",\"\",Linkwahl!AE574)","v":""}]
["",{"$f":"IF(Linkwahl!AD575=\"\",\"\",Linkwahl!AD575)","v":""},{"$f":"IF(Linkwahl!AE575=\"\",\"\",Linkwahl!AE575)","v":""}]
["",{"$f":"IF(Linkwahl!AD576=\"\",\"\",Linkwahl!AD576)","v":""},{"$f":"IF(Linkwahl!AE576=\"\",\"\",Linkwahl!AE576)","v":""}]
["",{"$f":"IF(Linkwahl!AD577=\"\",\"\",Linkwahl!AD577)","v":""},{"$f":"IF(Linkwahl!AE577=\"\",\"\",Linkwahl!AE577)","v":""}]
["",{"$f":"IF(Linkwahl!AD578=\"\",\"\",Linkwahl!AD578)","v":""},{"$f":"IF(Linkwahl!AE578=\"\",\"\",Linkwahl!AE578)","v":""}]
["",{"$f":"IF(Linkwahl!AD579=\"\",\"\",Linkwahl!AD579)","v":""},{"$f":"IF(Linkwahl!AE579=\"\",\"\",Linkwahl!AE579)","v":""}]
["",{"$f":"IF(Linkwahl!AD580=\"\",\"\",Linkwahl!AD580)","v":""},{"$f":"IF(Linkwahl!AE580=\"\",\"\",Linkwahl!AE580)","v":""}]
["",{"$f":"IF(Linkwahl!AD581=\"\",\"\",Linkwahl!AD581)","v":""},{"$f":"IF(Linkwahl!AE581=\"\",\"\",Linkwahl!AE581)","v":""}]
["",{"$f":"IF(Linkwahl!AD582=\"\",\"\",Linkwahl!AD582)","v":""},{"$f":"IF(Linkwahl!AE582=\"\",\"\",Linkwahl!AE582)","v":""}]
[{"$f":"IF(B396=\"\",\"\",HYPERLINK(\"http://www.admin.ch/ch/e/rs/c\"&SUBSTITUTE(B396,\".\",\"_\")&\".html\",\"SR-Link\"))","v":""},{"$f":"IF(Linkwahl!AD583=\"\",\"\",Linkwahl!AD583)","v":""},{"$f":"IF(Linkwahl!AE583=\"\",\"\",Linkwahl!AE583)","v":""}]
["",{"$f":"IF(Linkwahl!AD584=\"\",\"\",Linkwahl!AD584)","v":""},{"$f":"IF(Linkwahl!AE584=\"\",\"\",Linkwahl!AE584)","v":""}]
["",{"$f":"IF(Linkwahl!AD585=\"\",\"\",Linkwahl!AD585)","v":""},{"$f":"IF(Linkwahl!AE585=\"\",\"\",Linkwahl!AE585)","v":""}]
["",{"$f":"IF(Linkwahl!AD586=\"\",\"\",Linkwahl!AD586)","v":""},{"$f":"IF(Linkwahl!AE586=\"\",\"\",Linkwahl!AE586)","v":""}]
["",{"$f":"IF(Linkwahl!AD587=\"\",\"\",Linkwahl!AD587)","v":""},{"$f":"IF(Linkwahl!AE587=\"\",\"\",Linkwahl!AE587)","v":""}]
["",{"$f":"IF(Linkwahl!AD588=\"\",\"\",Linkwahl!AD588)","v":""},{"$f":"IF(Linkwahl!AE588=\"\",\"\",Linkwahl!AE588)","v":""}]
["",{"$f":"IF(Linkwahl!AD589=\"\",\"\",Linkwahl!AD589)","v":""},{"$f":"IF(Linkwahl!AE589=\"\",\"\",Linkwahl!AE589)","v":""}]
["",{"$f":"IF(Linkwahl!AD590=\"\",\"\",Linkwahl!AD590)","v":""},{"$f":"IF(Linkwahl!AE590=\"\",\"\",Linkwahl!AE590)","v":""}]
["",{"$f":"IF(Linkwahl!AD591=\"\",\"\",Linkwahl!AD591)","v":""},{"$f":"IF(Linkwahl!AE591=\"\",\"\",Linkwahl!AE591)","v":""}]
["",{"$f":"IF(Linkwahl!AD592=\"\",\"\",Linkwahl!AD592)","v":""},{"$f":"IF(Linkwahl!AE592=\"\",\"\",Linkwahl!AE592)","v":""}]
["",{"$f":"IF(Linkwahl!AD593=\"\",\"\",Linkwahl!AD593)","v":""},{"$f":"IF(Linkwahl!AE593=\"\",\"\",Linkwahl!AE593)","v":""}]
["",{"$f":"IF(Linkwahl!AD594=\"\",\"\",Linkwahl!AD594)","v":""},{"$f":"IF(Linkwahl!AE594=\"\",\"\",Linkwahl!AE594)","v":""}]
["",{"$f":"IF(Linkwahl!AD595=\"\",\"\",Linkwahl!AD595)","v":""},{"$f":"IF(Linkwahl!AE595=\"\",\"\",Linkwahl!AE595)","v":""}]
["",{"$f":"IF(Linkwahl!AD596=\"\",\"\",Linkwahl!AD596)","v":""},{"$f":"IF(Linkwahl!AE596=\"\",\"\",Linkwahl!AE596)","v":""}]
["",{"$f":"IF(Linkwahl!AD597=\"\",\"\",Linkwahl!AD597)","v":""},{"$f":"IF(Linkwahl!AE597=\"\",\"\",Linkwahl!AE597)","v":""}]

{"sheet":"SR rum.","index":3,"n_rows":402,"n_cols":3,"rows_kept":402,"cut":false,"hidden":false,"merged":[]}
[null,"romanische Übersetzungen Bundesvorschriften (SR)"]
[{"$f":"COUNTA(A3:A402)-COUNTBLANK(A3:A402)","v":59},"SR-Nummer","Bezeichnung                          (Stand 12.2017)"]
[{"$f":"IF(B3=\"\",\"\",HYPERLINK(\"http://www.admin.ch/ch/r/rs/c\"&SUBSTITUTE(B3,\".\",\"_\")&\".html\",\"SR-Link\"))","v":"SR-Link"},{"$f":"IF(Linkwahl!AG133=\"\",\"\",Linkwahl!AG133)","v":"0.107"},{"$f":"IF(Linkwahl!AH133=\"\",\"\",Linkwahl!AH133)","v":"Convenziun dals 20 da november 1989 davart ils dretgs da l’uffant"}]
[{"$f":"IF(B4=\"\",\"\",HYPERLINK(\"http://www.admin.ch/ch/r/rs/c\"&SUBSTITUTE(B4,\".\",\"_\")&\".html\",\"SR-Link\"))","v":"SR-Link"},{"$f":"IF(Linkwahl!AG134=\"\",\"\",Linkwahl!AG134)","v":"0.441.1"},{"$f":"IF(Linkwahl!AH134=\"\",\"\",Linkwahl!AH134)","v":"Convenziun da basa dals 1. da favrer 1995 per proteger las minoritads naziunalas"}]
["SR-Link",{"$f":"IF(Linkwahl!AG135=\"\",\"\",Linkwahl!AG135)","v":"0.441.2"},{"$f":"IF(Linkwahl!AH135=\"\",\"\",Linkwahl!AH135)","v":"Charta europeica dals 5 da november 1992 da las linguas regiunalas u minoritaras"}]
["SR-Link",{"$f":"IF(Linkwahl!AG136=\"\",\"\",Linkwahl!AG136)","v":"101"},{"$f":"IF(Linkwahl!AH136=\"\",\"\",Linkwahl!AH136)","v":"Constituziun federala da la Confederaziun svizra dals 18 d’avrigl 1999"}]
["SR-Link",{"$f":"IF(Linkwahl!AG137=\"\",\"\",Linkwahl!AG137)","v":"131.226"},{"$f":"IF(Linkwahl!AH137=\"\",\"\",Linkwahl!AH137)","v":"Constituziun dal chantun Grischun dals 18 da matg 2003/14 da settember 2003"}]
["SR-Link",{"$f":"IF(Linkwahl!AG138=\"\",\"\",Linkwahl!AG138)","v":"141.0"},{"$f":"IF(Linkwahl!AH138=\"\",\"\",Linkwahl!AH138)","v":"Lescha federala dals 29 da settember 1952 davart l’acquist e la perdita dal dretg da burgais svizzer (Lescha davart il dretg da burgais [LDB])"}]
["SR-Link",{"$f":"IF(Linkwahl!AG139=\"\",\"\",Linkwahl!AG139)","v":"142.20"},{"$f":"IF(Linkwahl!AH139=\"\",\"\",Linkwahl!AH139)","v":"Lescha federala dals 16 da december 2005 davart las persunas estras (LEI)"}]
["SR-Link",{"$f":"IF(Linkwahl!AG140=\"\",\"\",Linkwahl!AG140)","v":"142.31"},{"$f":"IF(Linkwahl!AH140=\"\",\"\",Linkwahl!AH140)","v":"Lescha d’asil dals 26 da zercladur 1998 (LAsil)"}]
["SR-Link",{"$f":"IF(Linkwahl!AG141=\"\",\"\",Linkwahl!AG141)","v":"143.1"},{"$f":"IF(Linkwahl!AH141=\"\",\"\",Linkwahl!AH141)","v":"Lescha federala dals 22 da zercladur 2001 davart ils documents d’identitad da las burgaisas e dals burgais svizzers (Lescha davart ils documents d’identitad, LDI)"}]
["SR-Link",{"$f":"IF(Linkwahl!AG142=\"\",\"\",Linkwahl!AG142)","v":"151.1"},{"$f":"IF(Linkwahl!AH142=\"\",\"\",Linkwahl!AH142)","v":"Lescha federala dals 24 da mars 1995 davart l’egualitad da dunna ed um (Lescha d’egualitad, LEg)"}]
["SR-Link",{"$f":"IF(Linkwahl!AG143=\"\",\"\",Linkwahl!AG143)","v":"152.3"},{"$f":"IF(Linkwahl!AH143=\"\",\"\",Linkwahl!AH143)","v":"Lescha federala dals 17 da december 2004 davart il princip da la transparenza da l’administraziun (Lescha da transparenza, LTrans)"}]
["SR-Link",{"$f":"IF(Linkwahl!AG144=\"\",\"\",Linkwahl!AG144)","v":"152.31"},{"$f":"IF(Linkwahl!AH144=\"\",\"\",Linkwahl!AH144)","v":"Ordinaziun dals 24 da matg 2006 davart il princip da la transparenza da l’administraziun (Ordinaziun da transparenza, OTrans)"}]
["SR-Link",{"$f":"IF(Linkwahl!AG145=\"\",\"\",Linkwahl!AG145)","v":"161.1"},{"$f":"IF(Linkwahl!AH145=\"\",\"\",Linkwahl!AH145)","v":"Lescha federala dals 17 da december davart ils dretgs politics"}]
["SR-Link",{"$f":"IF(Linkwahl!AG146=\"\",\"\",Linkwahl!AG146)","v":"161.11"},{"$f":"IF(Linkwahl!AH146=\"\",\"\",Linkwahl!AH146)","v":"Ordinaziun dals 24 da matg 1978 davart ils dretgs politics (ODP)"}]
["SR-Link",{"$f":"IF(Linkwahl!AG147=\"\",\"\",Linkwahl!AG147)","v":171.1},{"$f":"IF(Linkwahl!AH147=\"\",\"\",Linkwahl!AH147)","v":"Lescha federala dals 13 da december 2002 davart l’Assamblea federala (Lescha dal parlament, LParl)"}]
["SR-Link",{"$f":"IF(Linkwahl!AG148=\"\",\"\",Linkwahl!AG148)","v":"172.010"},{"$f":"IF(Linkwahl!AH148=\"\",\"\",Linkwahl!AH148)","v":"Lescha dals 21 da mars 1997 davart l’organisaziun da la regenza e da l’administraziun (LORA)"}]
["SR-Link",{"$f":"IF(Linkwahl!AG149=\"\",\"\",Linkwahl!AG149)","v":"172.021"},{"$f":"IF(Linkwahl!AH149=\"\",\"\",Linkwahl!AH149)","v":"Lescha federala dals 20 da december 1968 davart la procedura administrativa (PA)"}]
["SR-Link",{"$f":"IF(Linkwahl!AG150=\"\",\"\",Linkwahl!AG150)","v":"172.081"},{"$f":"IF(Linkwahl!AH150=\"\",\"\",Linkwahl!AH150)","v":"Ordinaziun dals 14 da november 2012 davart ils servetschs linguistics da l’administraziun federala (Ordinaziun dals servetschs linguistics, OSLing)"}]
["SR-Link",{"$f":"IF(Linkwahl!AG151=\"\",\"\",Linkwahl!AG151)","v":"172.220.1"},{"$f":"IF(Linkwahl!AH151=\"\",\"\",Linkwahl!AH151)","v":"Lescha dals 24 da mars 2000 davart il persunal da la confederaziun (LPers)"}]
["SR-Link",{"$f":"IF(Linkwahl!AG152=\"\",\"\",Linkwahl!AG152)","v":"173.110"},{"$f":"IF(Linkwahl!AH152=\"\",\"\",Linkwahl!AH152)","v":"Lescha federala dals 20 da december 1968 davart la procedura administrativa (PA)"}]
["SR-Link",{"$f":"IF(Linkwahl!AG153=\"\",\"\",Linkwahl!AG153)","v":"210"},{"$f":"IF(Linkwahl!AH153=\"\",\"\",Linkwahl!AH153)","v":"Cudesch civil svizzer dals 10 da december 1907"}]
["SR-Link",{"$f":"IF(Linkwahl!AG154=\"\",\"\",Linkwahl!AG154)","v":"220"},{"$f":"IF(Linkwahl!AH154=\"\",\"\",Linkwahl!AH154)","v":"Lescha federala dals 30 da mars 1911 davart la cumplettaziun dal cudesch civil svizzer (Tschintgavla part: Dretg d’obligaziuns)"}]
["SR-Link",{"$f":"IF(Linkwahl!AG155=\"\",\"\",Linkwahl!AG155)","v":272},{"$f":"IF(Linkwahl!AH155=\"\",\"\",Linkwahl!AH155)","v":"Cudesch da procedura civila svizzer dals 19 da december 2008 (Cudesch da procedura civila, CPC)"}]
["SR-Link",{"$f":"IF(Linkwahl!AG156=\"\",\"\",Linkwahl!AG156)","v":"311.0"},{"$f":"IF(Linkwahl!AH156=\"\",\"\",Linkwahl!AH156)","v":"Cudesch penal svizzer dals 21 da december 1936"}]
["SR-Link",{"$f":"IF(Linkwahl!AG157=\"\",\"\",Linkwahl!AG157)","v":"311.1"},{"$f":"IF(Linkwahl!AH157=\"\",\"\",Linkwahl!AH157)","v":"Lescha federala dals 20 da zercladur 2003 davart il dretg penal per giuvenils (Dretg penal per giuvenils, DPG)"}]
["SR-Link",{"$f":"IF(Linkwahl!AG158=\"\",\"\",Linkwahl!AG158)","v":"312.0"},{"$f":"IF(Linkwahl!AH158=\"\",\"\",Linkwahl!AH158)","v":"Cudesch da procedura penala svizzer dals 5 d’october 2007 (Cudesch da procedura penala, CPP)"}]
["SR-Link",{"$f":"IF(Linkwahl!AG159=\"\",\"\",Linkwahl!AG159)","v":"313.0"},{"$f":"IF(Linkwahl!AH159=\"\",\"\",Linkwahl!AH159)","v":"Lescha federala dals 22 da mars 1974 davart il dretg penal administrativ (DPA)"}]
["SR-Link",{"$f":"IF(Linkwahl!AG160=\"\",\"\",Linkwahl!AG160)","v":"362"},{"$f":"IF(Linkwahl!AH160=\"\",\"\",Linkwahl!AH160)","v":"Conclus federal dals 17 da december 2004 davart l’approvaziun e la realisaziun da las cunvegnas bilateralas tranter la Svizra e la UE per l’associaziun a la reglamentaziun da Schengen e da Dublin"}]
["SR-Link",{"$f":"IF(Linkwahl!AG161=\"\",\"\",Linkwahl!AG161)","v":"412.10"},{"$f":"IF(Linkwahl!AH161=\"\",\"\",Linkwahl!AH161)","v":"Lescha federala dals 13 da december 2002 davart la furmaziun professiunala (LFPr)"}]
["SR-Link",{"$f":"IF(Linkwahl!AG162=\"\",\"\",Linkwahl!AG162)","v":"412.101"},{"$f":"IF(Linkwahl!AH162=\"\",\"\",Linkwahl!AH162)","v":"Ordinaziun dals 19 da november 2003 davart la furmaziun professiunala (OFPr)"}]
["SR-Link",{"$f":"IF(Linkwahl!AG163=\"\",\"\",Linkwahl!AG163)","v":"420.1"},{"$f":"IF(Linkwahl!AH163=\"\",\"\",Linkwahl!AH163)","v":"Lescha federala dals 14 da december 2012 davart la promoziun da la perscrutaziun e da l’innovaziun (LPPI)"}]
[{"$f":"IF(B34=\"\",\"\",HYPERLINK(\"http://www.admin.ch/ch/r/rs/c\"&SUBSTITUTE(B34,\".\",\"_\")&\".html\",\"SR-Link\"))","v":"SR-Link"},{"$f":"IF(Linkwahl!AG164=\"\",\"\",Linkwahl!AG164)","v":"420.11"},{"$f":"IF(Linkwahl!AH164=\"\",\"\",Linkwahl!AH164)","v":"Ordinaziun dals 29 da november 2013 tar la Lescha federala davart la promoziun da la perscrutaziun e da l’innovaziun (Ordinaziun da perscrutaziun e d’innovaziun, O-LPPI)"}]
["SR-Link",{"$f":"IF(Linkwahl!AG165=\"\",\"\",Linkwahl!AG165)","v":"441.1"},{"$f":"IF(Linkwahl!AH165=\"\",\"\",Linkwahl!AH165)","v":"Lescha federala dals 5 d’october 2007 davart las linguas naziunalas e la chapientscha tranter las cuminanzas linguisticas (lescha da linguas, LLing)"}]
["SR-Link",{"$f":"IF(Linkwahl!AG166=\"\",\"\",Linkwahl!AG166)","v":"441.11"},{"$f":"IF(Linkwahl!AH166=\"\",\"\",Linkwahl!AH166)","v":"Ordinaziun dals 4 da zercladur 2010 davart las linguas naziunalas e la chapientscha tranter las cuminanzas linguisticas (ordinaziun da linguas, OLing)"}]
["SR-Link",{"$f":"IF(Linkwahl!AG167=\"\",\"\",Linkwahl!AG167)","v":442.1},{"$f":"IF(Linkwahl!AH167=\"\",\"\",Linkwahl!AH167)","v":"Lescha federala dals 11 da december 2009 davart la promoziun da la cultura (Lescha per promover la cultura, LPCu)"}]
["SR-Link",{"$f":"IF(Linkwahl!AG168=\"\",\"\",Linkwahl!AG168)","v":442.11},{"$f":"IF(Linkwahl!AH168=\"\",\"\",Linkwahl!AH168)","v":"Ordinaziun dals 23 da november 2011 davart la promoziun da la cultura (OPCu)"}]
[{"$f":"IF(B39=\"\",\"\",HYPERLINK(\"http://www.admin.ch/ch/r/rs/c\"&SUBSTITUTE(B39,\".\",\"_\")&\".html\",\"SR-Link\"))","v":"SR-Link"},{"$f":"IF(Linkwahl!AG169=\"\",\"\",Linkwahl!AG169)","v":"451.1"},{"$f":"IF(Linkwahl!AH169=\"\",\"\",Linkwahl!AH169)","v":"Lescha federala dal 1. da fanadur 1966 davart la protecziun da la natira e da la patria (LPNP)"}]
["SR-Link",{"$f":"IF(Linkwahl!AG170=\"\",\"\",Linkwahl!AG170)","v":"451.11"},{"$f":"IF(Linkwahl!AH170=\"\",\"\",Linkwahl!AH170)","v":"Ordinaziun dals 16 da schaner 1991 davart la protecziun da la natira e da la patria (OPNP)"}]
["SR-Link",{"$f":"IF(Linkwahl!AG171=\"\",\"\",Linkwahl!AG171)","v":"455"},{"$f":"IF(Linkwahl!AH171=\"\",\"\",Linkwahl!AH171)","v":"Lescha federala dals 16 da december 2005 davart la protecziun dals animals (LPAn)"}]
["SR-Link",{"$f":"IF(Linkwahl!AG172=\"\",\"\",Linkwahl!AG172)","v":"520.1"},{"$f":"IF(Linkwahl!AH172=\"\",\"\",Linkwahl!AH172)","v":"Lescha federala dals 4 d’october 2002 davart la protecziun da la populaziun e la protecziun civila (LPPC)"}]
["SR-Link",{"$f":"IF(Linkwahl!AG173=\"\",\"\",Linkwahl!AG173)","v":"672.4"},{"$f":"IF(Linkwahl!AH173=\"\",\"\",Linkwahl!AH173)","v":"Lescha federala dals 15 da zercladur 2012 davart l’imposiziun internaziunala da taglias a la funtauna (LITF)"}]
["SR-Link",{"$f":"IF(Linkwahl!AG174=\"\",\"\",Linkwahl!AG174)","v":"700"},{"$f":"IF(Linkwahl!AH174=\"\",\"\",Linkwahl!AH174)","v":"Lescha federala dals 22 da zercladur 1979 davart la planisaziun dal territori (Lescha davart la planisaziun dal territori, LPT)"}]
["SR-Link",{"$f":"IF(Linkwahl!AG175=\"\",\"\",Linkwahl!AG175)","v":"700.1"},{"$f":"IF(Linkwahl!AH175=\"\",\"\",Linkwahl!AH175)","v":"Ordinaziun dals 28 da zercladur 2000 davart la planisaziun dal territori (OPT)"}]
["SR-Link",{"$f":"IF(Linkwahl!AG176=\"\",\"\",Linkwahl!AG176)","v":"702"},{"$f":"IF(Linkwahl!AH176=\"\",\"\",Linkwahl!AH176)","v":"Lescha federala dals 20 da mars 2015 davart las abitaziuns secundaras (Lescha davart las abitaziuns secundaras, LAS)"}]
["SR-Link",{"$f":"IF(Linkwahl!AG177=\"\",\"\",Linkwahl!AG177)","v":"702.1"},{"$f":"IF(Linkwahl!AH177=\"\",\"\",Linkwahl!AH177)","v":"Ordinaziun dals 4 da december 2015 davart las abitaziuns secundaras (OAS)"}]
["SR-Link",{"$f":"IF(Linkwahl!AG178=\"\",\"\",Linkwahl!AG178)","v":"721.100"},{"$f":"IF(Linkwahl!AH178=\"\",\"\",Linkwahl!AH178)","v":"Lescha federala dals 21 da zercladur 1991 davart la correcziun dals curs d’aua "}]
["SR-Link",{"$f":"IF(Linkwahl!AG179=\"\",\"\",Linkwahl!AG179)","v":"721.100.1"},{"$f":"IF(Linkwahl!AH179=\"\",\"\",Linkwahl!AH179)","v":"Ordinaziun dals 2 da november 1994 davart la correcziun dals curs d’aua (OCCA)"}]
["SR-Link",{"$f":"IF(Linkwahl!AG180=\"\",\"\",Linkwahl!AG180)","v":"741.01"},{"$f":"IF(Linkwahl!AH180=\"\",\"\",Linkwahl!AH180)","v":"Lescha davart il traffic sin via dals 19 da december 1958 (LTV)"}]
["SR-Link",{"$f":"IF(Linkwahl!AG181=\"\",\"\",Linkwahl!AG181)","v":"783.0"},{"$f":"IF(Linkwahl!AH181=\"\",\"\",Linkwahl!AH181)","v":"Lescha da posta dals 17 da december 2010 (LPO)"}]
["SR-Link",{"$f":"IF(Linkwahl!AG182=\"\",\"\",Linkwahl!AG182)","v":"783.01"},{"$f":"IF(Linkwahl!AH182=\"\",\"\",Linkwahl!AH182)","v":"Ordinaziun da posta dals 29 d’avust 2012 (OPO)"}]
["SR-Link",{"$f":"IF(Linkwahl!AG183=\"\",\"\",Linkwahl!AG183)","v":"784.40"},{"$f":"IF(Linkwahl!AH183=\"\",\"\",Linkwahl!AH183)","v":"Lescha federala dals 24 da mars 2006 davart radio e televisiun (LRTV)"}]
["SR-Link",{"$f":"IF(Linkwahl!AG184=\"\",\"\",Linkwahl!AG184)","v":"810.31"},{"$f":"IF(Linkwahl!AH184=\"\",\"\",Linkwahl!AH184)","v":"Lescha federala dals 19 da december 2003 davart la perscrutaziun da cellas embrionalas da basa (Lescha davart las cellas da basa, LCB)"}]
["SR-Link",{"$f":"IF(Linkwahl!AG185=\"\",\"\",Linkwahl!AG185)","v":"814.20"},{"$f":"IF(Linkwahl!AH185=\"\",\"\",Linkwahl!AH185)","v":"Lescha federala dals 24 da schaner 1991 davart la protecziun da las auas (Lescha davart la protecziun da las auas, LPAuas)"}]
["SR-Link",{"$f":"IF(Linkwahl!AG186=\"\",\"\",Linkwahl!AG186)","v":"831.4"},{"$f":"IF(Linkwahl!AH186=\"\",\"\",Linkwahl!AH186)","v":"Lescha federala davart la prevenziun professiunala per vegls, survivents ed invaliditad, LPP "}]
["SR-Link",{"$f":"IF(Linkwahl!AG187=\"\",\"\",Linkwahl!AG187)","v":"836.2"},{"$f":"IF(Linkwahl!AH187=\"\",\"\",Linkwahl!AH187)","v":"Lescha federala dals 24 da mars 2006 davart ils supplements da famiglia (lescha davart ils supplements da famiglia, LSFam)"}]
["SR-Link",{"$f":"IF(Linkwahl!AG188=\"\",\"\",Linkwahl!AG188)","v":"910.1"},{"$f":"IF(Linkwahl!AH188=\"\",\"\",Linkwahl!AH188)","v":"Lescha federala dals 29 d’avrigl 1998 davart l’agricultura (Lescha d’agricultura, LAgr)"}]
["SR-Link",{"$f":"IF(Linkwahl!AG189=\"\",\"\",Linkwahl!AG189)","v":"923.0"},{"$f":"IF(Linkwahl!AH189=\"\",\"\",Linkwahl!AH189)","v":"Lescha federala dals 21 da zercladur 1991 davart la pestga (LFP)"}]
["SR-Link",{"$f":"IF(Linkwahl!AG190=\"\",\"\",Linkwahl!AG190)","v":"923.01"},{"$f":"IF(Linkwahl!AH190=\"\",\"\",Linkwahl!AH190)","v":"Ordinaziun dals 24 da november 1993 tar la lescha federala davart la pestga (OLFP)"}]
["SR-Link",{"$f":"IF(Linkwahl!AG191=\"\",\"\",Linkwahl!AG191)","v":"974.1"},{"$f":"IF(Linkwahl!AH191=\"\",\"\",Linkwahl!AH191)","v":"Lescha federala dals 24 da mars 2006 davart la collavuraziun cun ils stadis da l’Europa da l’ost"}]
["",{"$f":"IF(Linkwahl!AG192=\"\",\"\",Linkwahl!AG192)","v":""},{"$f":"IF(Linkwahl!AH192=\"\",\"\",Linkwahl!AH192)","v":""}]
["",{"$f":"IF(Linkwahl!AG193=\"\",\"\",Linkwahl!AG193)","v":""},{"$f":"IF(Linkwahl!AH193=\"\",\"\",Linkwahl!AH193)","v":""}]
["",{"$f":"IF(Linkwahl!AG194=\"\",\"\",Linkwahl!AG194)","v":""},{"$f":"IF(Linkwahl!AH194=\"\",\"\",Linkwahl!AH194)","v":""}]
["",{"$f":"IF(Linkwahl!AG195=\"\",\"\",Linkwahl!AG195)","v":""},{"$f":"IF(Linkwahl!AH195=\"\",\"\",Linkwahl!AH195)","v":""}]
["",{"$f":"IF(Linkwahl!AG196=\"\",\"\",Linkwahl!AG196)","v":""},{"$f":"IF(Linkwahl!AH196=\"\",\"\",Linkwahl!AH196)","v":""}]
["",{"$f":"IF(Linkwahl!AG197=\"\",\"\",Linkwahl!AG197)","v":""},{"$f":"IF(Linkwahl!AH197=\"\",\"\",Linkwahl!AH197)","v":""}]
[{"$f":"IF(B68=\"\",\"\",HYPERLINK(\"http://www.admin.ch/ch/r/rs/c\"&SUBSTITUTE(B68,\".\",\"_\")&\".html\",\"SR-Link\"))","v":""},{"$f":"IF(Linkwahl!AG198=\"\",\"\",Linkwahl!AG198)","v":""},{"$f":"IF(Linkwahl!AH198=\"\",\"\",Linkwahl!AH198)","v":""}]
["",{"$f":"IF(Linkwahl!AG199=\"\",\"\",Linkwahl!AG199)","v":""},{"$f":"IF(Linkwahl!AH199=\"\",\"\",Linkwahl!AH199)","v":""}]
["",{"$f":"IF(Linkwahl!AG200=\"\",\"\",Linkwahl!AG200)","v":""},{"$f":"IF(Linkwahl!AH200=\"\",\"\",Linkwahl!AH200)","v":""}]
["",{"$f":"IF(Linkwahl!AG201=\"\",\"\",Linkwahl!AG201)","v":""},{"$f":"IF(Linkwahl!AH201=\"\",\"\",Linkwahl!AH201)","v":""}]
["",{"$f":"IF(Linkwahl!AG202=\"\",\"\",Linkwahl!AG202)","v":""},{"$f":"IF(Linkwahl!AH202=\"\",\"\",Linkwahl!AH202)","v":""}]
["",{"$f":"IF(Linkwahl!AG203=\"\",\"\",Linkwahl!AG203)","v":""},{"$f":"IF(Linkwahl!AH203=\"\",\"\",Linkwahl!AH203)","v":""}]
["",{"$f":"IF(Linkwahl!AG204=\"\",\"\",Linkwahl!AG204)","v":""},{"$f":"IF(Linkwahl!AH204=\"\",\"\",Linkwahl!AH204)","v":""}]
["",{"$f":"IF(Linkwahl!AG205=\"\",\"\",Linkwahl!AG205)","v":""},{"$f":"IF(Linkwahl!AH205=\"\",\"\",Linkwahl!AH205)","v":""}]
["",{"$f":"IF(Linkwahl!AG206=\"\",\"\",Linkwahl!AG206)","v":""},{"$f":"IF(Linkwahl!AH206=\"\",\"\",Linkwahl!AH206)","v":""}]
["",{"$f":"IF(Linkwahl!AG207=\"\",\"\",Linkwahl!AG207)","v":""},{"$f":"IF(Linkwahl!AH207=\"\",\"\",Linkwahl!AH207)","v":""}]
["",{"$f":"IF(Linkwahl!AG208=\"\",\"\",Linkwahl!AG208)","v":""},{"$f":"IF(Linkwahl!AH208=\"\",\"\",Linkwahl!AH208)","v":""}]
["",{"$f":"IF(Linkwahl!AG209=\"\",\"\",Linkwahl!AG209)","v":""},{"$f":"IF(Linkwahl!AH209=\"\",\"\",Linkwahl!AH209)","v":""}]
["",{"$f":"IF(Linkwahl!AG210=\"\",\"\",Linkwahl!AG210)","v":""},{"$f":"IF(Linkwahl!AH210=\"\",\"\",Linkwahl!AH210)","v":""}]
["",{"$f":"IF(Linkwahl!AG211=\"\",\"\",Linkwahl!AG211)","v":""},{"$f":"IF(Linkwahl!AH211=\"\",\"\",Linkwahl!AH211)","v":""}]
["",{"$f":"IF(Linkwahl!AG212=\"\",\"\",Linkwahl!AG212)","v":""},{"$f":"IF(Linkwahl!AH212=\"\",\"\",Linkwahl!AH212)","v":""}]
["",{"$f":"IF(Linkwahl!AG213=\"\",\"\",Linkwahl!AG213)","v":""},{"$f":"IF(Linkwahl!AH213=\"\",\"\",Linkwahl!AH213)","v":""}]
["",{"$f":"IF(Linkwahl!AG214=\"\",\"\",Linkwahl!AG214)","v":""},{"$f":"IF(Linkwahl!AH214=\"\",\"\",Linkwahl!AH214)","v":""}]
["",{"$f":"IF(Linkwahl!AG215=\"\",\"\",Linkwahl!AG215)","v":""},{"$f":"IF(Linkwahl!AH215=\"\",\"\",Linkwahl!AH215)","v":""}]
["",{"$f":"IF(Linkwahl!AG216=\"\",\"\",Linkwahl!AG216)","v":""},{"$f":"IF(Linkwahl!AH216=\"\",\"\",Linkwahl!AH216)","v":""}]
["",{"$f":"IF(Linkwahl!AG217=\"\",\"\",Linkwahl!AG217)","v":""},{"$f":"IF(Linkwahl!AH217=\"\",\"\",Linkwahl!AH217)","v":""}]
["",{"$f":"IF(Linkwahl!AG218=\"\",\"\",Linkwahl!AG218)","v":""},{"$f":"IF(Linkwahl!AH218=\"\",\"\",Linkwahl!AH218)","v":""}]
["",{"$f":"IF(Linkwahl!AG219=\"\",\"\",Linkwahl!AG219)","v":""},{"$f":"IF(Linkwahl!AH219=\"\",\"\",Linkwahl!AH219)","v":""}]
["",{"$f":"IF(Linkwahl!AG220=\"\",\"\",Linkwahl!AG220)","v":""},{"$f":"IF(Linkwahl!AH220=\"\",\"\",Linkwahl!AH220)","v":""}]
["",{"$f":"IF(Linkwahl!AG221=\"\",\"\",Linkwahl!AG221)","v":""},{"$f":"IF(Linkwahl!AH221=\"\",\"\",Linkwahl!AH221)","v":""}]
["",{"$f":"IF(Linkwahl!AG222=\"\",\"\",Linkwahl!AG222)","v":""},{"$f":"IF(Linkwahl!AH222=\"\",\"\",Linkwahl!AH222)","v":""}]
["",{"$f":"IF(Linkwahl!AG223=\"\",\"\",Linkwahl!AG223)","v":""},{"$f":"IF(Linkwahl!AH223=\"\",\"\",Linkwahl!AH223)","v":""}]
["",{"$f":"IF(Linkwahl!AG224=\"\",\"\",Linkwahl!AG224)","v":""},{"$f":"IF(Linkwahl!AH224=\"\",\"\",Linkwahl!AH224)","v":""}]
["",{"$f":"IF(Linkwahl!AG225=\"\",\"\",Linkwahl!AG225)","v":""},{"$f":"IF(Linkwahl!AH225=\"\",\"\",Linkwahl!AH225)","v":""}]
["",{"$f":"IF(Linkwahl!AG226=\"\",\"\",Linkwahl!AG226)","v":""},{"$f":"IF(Linkwahl!AH226=\"\",\"\",Linkwahl!AH226)","v":""}]
["",{"$f":"IF(Linkwahl!AG271=\"\",\"\",Linkwahl!AG271)","v":""},{"$f":"IF(Linkwahl!AH271=\"\",\"\",Linkwahl!AH271)","v":""}]
["",{"$f":"IF(Linkwahl!AG272=\"\",\"\",Linkwahl!AG272)","v":""},{"$f":"IF(Linkwahl!AH272=\"\",\"\",Linkwahl!AH272)","v":""}]
["",{"$f":"IF(Linkwahl!AG273=\"\",\"\",Linkwahl!AG273)","v":""},{"$f":"IF(Linkwahl!AH273=\"\",\"\",Linkwahl!AH273)","v":""}]
["",{"$f":"IF(Linkwahl!AG274=\"\",\"\",Linkwahl!AG274)","v":""},{"$f":"IF(Linkwahl!AH274=\"\",\"\",Linkwahl!AH274)","v":""}]
["",{"$f":"IF(Linkwahl!AG275=\"\",\"\",Linkwahl!AG275)","v":""},{"$f":"IF(Linkwahl!AH275=\"\",\"\",Linkwahl!AH275)","v":""}]
["",{"$f":"IF(Linkwahl!AG276=\"\",\"\",Linkwahl!AG276)","v":""},{"$f":"IF(Linkwahl!AH276=\"\",\"\",Linkwahl!AH276)","v":""}]
["",{"$f":"IF(Linkwahl!AG277=\"\",\"\",Linkwahl!AG277)","v":""},{"$f":"IF(Linkwahl!AH277=\"\",\"\",Linkwahl!AH277)","v":""}]
["",{"$f":"IF(Linkwahl!AG278=\"\",\"\",Linkwahl!AG278)","v":""},{"$f":"IF(Linkwahl!AH278=\"\",\"\",Linkwahl!AH278)","v":""}]
["",{"$f":"IF(Linkwahl!AG279=\"\",\"\",Linkwahl!AG279)","v":""},{"$f":"IF(Linkwahl!AH279=\"\",\"\",Linkwahl!AH279)","v":""}]
["",{"$f":"IF(Linkwahl!AG280=\"\",\"\",Linkwahl!AG280)","v":""},{"$f":"IF(Linkwahl!AH280=\"\",\"\",Linkwahl!AH280)","v":""}]
["",{"$f":"IF(Linkwahl!AG281=\"\",\"\",Linkwahl!AG281)","v":""},{"$f":"IF(Linkwahl!AH281=\"\",\"\",Linkwahl!AH281)","v":""}]
["",{"$f":"IF(Linkwahl!AG282=\"\",\"\",Linkwahl!AG282)","v":""},{"$f":"IF(Linkwahl!AH282=\"\",\"\",Linkwahl!AH282)","v":""}]
["",{"$f":"IF(Linkwahl!AG283=\"\",\"\",Linkwahl!AG283)","v":""},{"$f":"IF(Linkwahl!AH283=\"\",\"\",Linkwahl!AH283)","v":""}]
["",{"$f":"IF(Linkwahl!AG284=\"\",\"\",Linkwahl!AG284)","v":""},{"$f":"IF(Linkwahl!AH284=\"\",\"\",Linkwahl!AH284)","v":""}]
["",{"$f":"IF(Linkwahl!AG285=\"\",\"\",Linkwahl!AG285)","v":""},{"$f":"IF(Linkwahl!AH285=\"\",\"\",Linkwahl!AH285)","v":""}]
["",{"$f":"IF(Linkwahl!AG286=\"\",\"\",Linkwahl!AG286)","v":""},{"$f":"IF(Linkwahl!AH286=\"\",\"\",Linkwahl!AH286)","v":""}]
["",{"$f":"IF(Linkwahl!AG287=\"\",\"\",Linkwahl!AG287)","v":""},{"$f":"IF(Linkwahl!AH287=\"\",\"\",Linkwahl!AH287)","v":""}]
["",{"$f":"IF(Linkwahl!AG288=\"\",\"\",Linkwahl!AG288)","v":""},{"$f":"IF(Linkwahl!AH288=\"\",\"\",Linkwahl!AH288)","v":""}]
["",{"$f":"IF(Linkwahl!AG289=\"\",\"\",Linkwahl!AG289)","v":""},{"$f":"IF(Linkwahl!AH289=\"\",\"\",Linkwahl!AH289)","v":""}]
["",{"$f":"IF(Linkwahl!AG290=\"\",\"\",Linkwahl!AG290)","v":""},{"$f":"IF(Linkwahl!AH290=\"\",\"\",Linkwahl!AH290)","v":""}]
["",{"$f":"IF(Linkwahl!AG291=\"\",\"\",Linkwahl!AG291)","v":""},{"$f":"IF(Linkwahl!AH291=\"\",\"\",Linkwahl!AH291)","v":""}]
["",{"$f":"IF(Linkwahl!AG292=\"\",\"\",Linkwahl!AG292)","v":""},{"$f":"IF(Linkwahl!AH292=\"\",\"\",Linkwahl!AH292)","v":""}]
["",{"$f":"IF(Linkwahl!AG293=\"\",\"\",Linkwahl!AG293)","v":""},{"$f":"IF(Linkwahl!AH293=\"\",\"\",Linkwahl!AH293)","v":""}]
["",{"$f":"IF(Linkwahl!AG294=\"\",\"\",Linkwahl!AG294)","v":""},{"$f":"IF(Linkwahl!AH294=\"\",\"\",Linkwahl!AH294)","v":""}]
["",{"$f":"IF(Linkwahl!AG295=\"\",\"\",Linkwahl!AG295)","v":""},{"$f":"IF(Linkwahl!AH295=\"\",\"\",Linkwahl!AH295)","v":""}]
["",{"$f":"IF(Linkwahl!AG296=\"\",\"\",Linkwahl!AG296)","v":""},{"$f":"IF(Linkwahl!AH296=\"\",\"\",Linkwahl!AH296)","v":""}]
["",{"$f":"IF(Linkwahl!AG297=\"\",\"\",Linkwahl!AG297)","v":""},{"$f":"IF(Linkwahl!AH297=\"\",\"\",Linkwahl!AH297)","v":""}]
["",{"$f":"IF(Linkwahl!AG298=\"\",\"\",Linkwahl!AG298)","v":""},{"$f":"IF(Linkwahl!AH298=\"\",\"\",Linkwahl!AH298)","v":""}]
["",{"$f":"IF(Linkwahl!AG299=\"\",\"\",Linkwahl!AG299)","v":""},{"$f":"IF(Linkwahl!AH299=\"\",\"\",Linkwahl!AH299)","v":""}]
["",{"$f":"IF(Linkwahl!AG300=\"\",\"\",Linkwahl!AG300)","v":""},{"$f":"IF(Linkwahl!AH300=\"\",\"\",Linkwahl!AH300)","v":""}]
["",{"$f":"IF(Linkwahl!AG301=\"\",\"\",Linkwahl!AG301)","v":""},{"$f":"IF(Linkwahl!AH301=\"\",\"\",Linkwahl!AH301)","v":""}]
["",{"$f":"IF(Linkwahl!AG302=\"\",\"\",Linkwahl!AG302)","v":""},{"$f":"IF(Linkwahl!AH302=\"\",\"\",Linkwahl!AH302)","v":""}]
["",{"$f":"IF(Linkwahl!AG303=\"\",\"\",Linkwahl!AG303)","v":""},{"$f":"IF(Linkwahl!AH303=\"\",\"\",Linkwahl!AH303)","v":""}]
["",{"$f":"IF(Linkwahl!AG304=\"\",\"\",Linkwahl!AG304)","v":""},{"$f":"IF(Linkwahl!AH304=\"\",\"\",Linkwahl!AH304)","v":""}]
["",{"$f":"IF(Linkwahl!AG305=\"\",\"\",Linkwahl!AG305)","v":""},{"$f":"IF(Linkwahl!AH305=\"\",\"\",Linkwahl!AH305)","v":""}]
[{"$f":"IF(B132=\"\",\"\",HYPERLINK(\"http://www.admin.ch/ch/r/rs/c\"&SUBSTITUTE(B132,\".\",\"_\")&\".html\",\"SR-Link\"))","v":""},{"$f":"IF(Linkwahl!AG306=\"\",\"\",Linkwahl!AG306)","v":""},{"$f":"IF(Linkwahl!AH306=\"\",\"\",Linkwahl!AH306)","v":""}]
["",{"$f":"IF(Linkwahl!AG307=\"\",\"\",Linkwahl!AG307)","v":""},{"$f":"IF(Linkwahl!AH307=\"\",\"\",Linkwahl!AH307)","v":""}]
["",{"$f":"IF(Linkwahl!AG308=\"\",\"\",Linkwahl!AG308)","v":""},{"$f":"IF(Linkwahl!AH308=\"\",\"\",Linkwahl!AH308)","v":""}]
["",{"$f":"IF(Linkwahl!AG309=\"\",\"\",Linkwahl!AG309)","v":""},{"$f":"IF(Linkwahl!AH309=\"\",\"\",Linkwahl!AH309)","v":""}]
["",{"$f":"IF(Linkwahl!AG310=\"\",\"\",Linkwahl!AG310)","v":""},{"$f":"IF(Linkwahl!AH310=\"\",\"\",Linkwahl!AH310)","v":""}]
["",{"$f":"IF(Linkwahl!AG311=\"\",\"\",Linkwahl!AG311)","v":""},{"$f":"IF(Linkwahl!AH311=\"\",\"\",Linkwahl!AH311)","v":""}]
["",{"$f":"IF(Linkwahl!AG312=\"\",\"\",Linkwahl!AG312)","v":""},{"$f":"IF(Linkwahl!AH312=\"\",\"\",Linkwahl!AH312)","v":""}]
["",{"$f":"IF(Linkwahl!AG313=\"\",\"\",Linkwahl!AG313)","v":""},{"$f":"IF(Linkwahl!AH313=\"\",\"\",Linkwahl!AH313)","v":""}]
["",{"$f":"IF(Linkwahl!AG314=\"\",\"\",Linkwahl!AG314)","v":""},{"$f":"IF(Linkwahl!AH314=\"\",\"\",Linkwahl!AH314)","v":""}]
["",{"$f":"IF(Linkwahl!AG315=\"\",\"\",Linkwahl!AG315)","v":""},{"$f":"IF(Linkwahl!AH315=\"\",\"\",Linkwahl!AH315)","v":""}]
["",{"$f":"IF(Linkwahl!AG316=\"\",\"\",Linkwahl!AG316)","v":""},{"$f":"IF(Linkwahl!AH316=\"\",\"\",Linkwahl!AH316)","v":""}]
["",{"$f":"IF(Linkwahl!AG317=\"\",\"\",Linkwahl!AG317)","v":""},{"$f":"IF(Linkwahl!AH317=\"\",\"\",Linkwahl!AH317)","v":""}]
["",{"$f":"IF(Linkwahl!AG318=\"\",\"\",Linkwahl!AG318)","v":""},{"$f":"IF(Linkwahl!AH318=\"\",\"\",Linkwahl!AH318)","v":""}]
["",{"$f":"IF(Linkwahl!AG319=\"\",\"\",Linkwahl!AG319)","v":""},{"$f":"IF(Linkwahl!AH319=\"\",\"\",Linkwahl!AH319)","v":""}]
["",{"$f":"IF(Linkwahl!AG320=\"\",\"\",Linkwahl!AG320)","v":""},{"$f":"IF(Linkwahl!AH320=\"\",\"\",Linkwahl!AH320)","v":""}]
["",{"$f":"IF(Linkwahl!AG321=\"\",\"\",Linkwahl!AG321)","v":""},{"$f":"IF(Linkwahl!AH321=\"\",\"\",Linkwahl!AH321)","v":""}]
["",{"$f":"IF(Linkwahl!AG322=\"\",\"\",Linkwahl!AG322)","v":""},{"$f":"IF(Linkwahl!AH322=\"\",\"\",Linkwahl!AH322)","v":""}]
["",{"$f":"IF(Linkwahl!AG323=\"\",\"\",Linkwahl!AG323)","v":""},{"$f":"IF(Linkwahl!AH323=\"\",\"\",Linkwahl!AH323)","v":""}]
["",{"$f":"IF(Linkwahl!AG324=\"\",\"\",Linkwahl!AG324)","v":""},{"$f":"IF(Linkwahl!AH324=\"\",\"\",Linkwahl!AH324)","v":""}]
["",{"$f":"IF(Linkwahl!AG325=\"\",\"\",Linkwahl!AG325)","v":""},{"$f":"IF(Linkwahl!AH325=\"\",\"\",Linkwahl!AH325)","v":""}]
["",{"$f":"IF(Linkwahl!AG326=\"\",\"\",Linkwahl!AG326)","v":""},{"$f":"IF(Linkwahl!AH326=\"\",\"\",Linkwahl!AH326)","v":""}]
["",{"$f":"IF(Linkwahl!AG327=\"\",\"\",Linkwahl!AG327)","v":""},{"$f":"IF(Linkwahl!AH327=\"\",\"\",Linkwahl!AH327)","v":""}]
["",{"$f":"IF(Linkwahl!AG328=\"\",\"\",Linkwahl!AG328)","v":""},{"$f":"IF(Linkwahl!AH328=\"\",\"\",Linkwahl!AH328)","v":""}]
["",{"$f":"IF(Linkwahl!AG329=\"\",\"\",Linkwahl!AG329)","v":""},{"$f":"IF(Linkwahl!AH329=\"\",\"\",Linkwahl!AH329)","v":""}]
["",{"$f":"IF(Linkwahl!AG330=\"\",\"\",Linkwahl!AG330)","v":""},{"$f":"IF(Linkwahl!AH330=\"\",\"\",Linkwahl!AH330)","v":""}]
["",{"$f":"IF(Linkwahl!AG331=\"\",\"\",Linkwahl!AG331)","v":""},{"$f":"IF(Linkwahl!AH331=\"\",\"\",Linkwahl!AH331)","v":""}]
["",{"$f":"IF(Linkwahl!AG332=\"\",\"\",Linkwahl!AG332)","v":""},{"$f":"IF(Linkwahl!AH332=\"\",\"\",Linkwahl!AH332)","v":""}]
["",{"$f":"IF(Linkwahl!AG333=\"\",\"\",Linkwahl!AG333)","v":""},{"$f":"IF(Linkwahl!AH333=\"\",\"\",Linkwahl!AH333)","v":""}]
["",{"$f":"IF(Linkwahl!AG334=\"\",\"\",Linkwahl!AG334)","v":""},{"$f":"IF(Linkwahl!AH334=\"\",\"\",Linkwahl!AH334)","v":""}]
["",{"$f":"IF(Linkwahl!AG335=\"\",\"\",Linkwahl!AG335)","v":""},{"$f":"IF(Linkwahl!AH335=\"\",\"\",Linkwahl!AH335)","v":""}]
["",{"$f":"IF(Linkwahl!AG336=\"\",\"\",Linkwahl!AG336)","v":""},{"$f":"IF(Linkwahl!AH336=\"\",\"\",Linkwahl!AH336)","v":""}]
["",{"$f":"IF(Linkwahl!AG338=\"\",\"\",Linkwahl!AG338)","v":""},{"$f":"IF(Linkwahl!AH338=\"\",\"\",Linkwahl!AH338)","v":""}]
["",{"$f":"IF(Linkwahl!AG339=\"\",\"\",Linkwahl!AG339)","v":""},{"$f":"IF(Linkwahl!AH339=\"\",\"\",Linkwahl!AH339)","v":""}]
["",{"$f":"IF(Linkwahl!AG343=\"\",\"\",Linkwahl!AG343)","v":""},{"$f":"IF(Linkwahl!AH343=\"\",\"\",Linkwahl!AH343)","v":""}]
["",{"$f":"IF(Linkwahl!AG344=\"\",\"\",Linkwahl!AG344)","v":""},{"$f":"IF(Linkwahl!AH344=\"\",\"\",Linkwahl!AH344)","v":""}]
["",{"$f":"IF(Linkwahl!AG345=\"\",\"\",Linkwahl!AG345)","v":""},{"$f":"IF(Linkwahl!AH345=\"\",\"\",Linkwahl!AH345)","v":""}]
["",{"$f":"IF(Linkwahl!AG346=\"\",\"\",Linkwahl!AG346)","v":""},{"$f":"IF(Linkwahl!AH346=\"\",\"\",Linkwahl!AH346)","v":""}]
["",{"$f":"IF(Linkwahl!AG347=\"\",\"\",Linkwahl!AG347)","v":""},{"$f":"IF(Linkwahl!AH347=\"\",\"\",Linkwahl!AH347)","v":""}]
["",{"$f":"IF(Linkwahl!AG348=\"\",\"\",Linkwahl!AG348)","v":""},{"$f":"IF(Linkwahl!AH348=\"\",\"\",Linkwahl!AH348)","v":""}]
["",{"$f":"IF(Linkwahl!AG349=\"\",\"\",Linkwahl!AG349)","v":""},{"$f":"IF(Linkwahl!AH349=\"\",\"\",Linkwahl!AH349)","v":""}]
["",{"$f":"IF(Linkwahl!AG350=\"\",\"\",Linkwahl!AG350)","v":""},{"$f":"IF(Linkwahl!AH350=\"\",\"\",Linkwahl!AH350)","v":""}]
["",{"$f":"IF(Linkwahl!AG351=\"\",\"\",Linkwahl!AG351)","v":""},{"$f":"IF(Linkwahl!AH351=\"\",\"\",Linkwahl!AH351)","v":""}]
["",{"$f":"IF(Linkwahl!AG352=\"\",\"\",Linkwahl!AG352)","v":""},{"$f":"IF(Linkwahl!AH352=\"\",\"\",Linkwahl!AH352)","v":""}]
["",{"$f":"IF(Linkwahl!AG353=\"\",\"\",Linkwahl!AG353)","v":""},{"$f":"IF(Linkwahl!AH353=\"\",\"\",Linkwahl!AH353)","v":""}]
["",{"$f":"IF(Linkwahl!AG354=\"\",\"\",Linkwahl!AG354)","v":""},{"$f":"IF(Linkwahl!AH354=\"\",\"\",Linkwahl!AH354)","v":""}]
["",{"$f":"IF(Linkwahl!AG355=\"\",\"\",Linkwahl!AG355)","v":""},{"$f":"IF(Linkwahl!AH355=\"\",\"\",Linkwahl!AH355)","v":""}]
["",{"$f":"IF(Linkwahl!AG356=\"\",\"\",Linkwahl!AG356)","v":""},{"$f":"IF(Linkwahl!AH356=\"\",\"\",Linkwahl!AH356)","v":""}]
["",{"$f":"IF(Linkwahl!AG357=\"\",\"\",Linkwahl!AG357)","v":""},{"$f":"IF(Linkwahl!AH357=\"\",\"\",Linkwahl!AH357)","v":""}]
["",{"$f":"IF(Linkwahl!AG358=\"\",\"\",Linkwahl!AG358)","v":""},{"$f":"IF(Linkwahl!AH358=\"\",\"\",Linkwahl!AH358)","v":""}]
["",{"$f":"IF(Linkwahl!AG359=\"\",\"\",Linkwahl!AG359)","v":""},{"$f":"IF(Linkwahl!AH359=\"\",\"\",Linkwahl!AH359)","v":""}]
["",{"$f":"IF(Linkwahl!AG360=\"\",\"\",Linkwahl!AG360)","v":""},{"$f":"IF(Linkwahl!AH360=\"\",\"\",Linkwahl!AH360)","v":""}]
["",{"$f":"IF(Linkwahl!AG361=\"\",\"\",Linkwahl!AG361)","v":""},{"$f":"IF(Linkwahl!AH361=\"\",\"\",Linkwahl!AH361)","v":""}]
["",{"$f":"IF(Linkwahl!AG362=\"\",\"\",Linkwahl!AG362)","v":""},{"$f":"IF(Linkwahl!AH362=\"\",\"\",Linkwahl!AH362)","v":""}]
["",{"$f":"IF(Linkwahl!AG363=\"\",\"\",Linkwahl!AG363)","v":""},{"$f":"IF(Linkwahl!AH363=\"\",\"\",Linkwahl!AH363)","v":""}]
["",{"$f":"IF(Linkwahl!AG364=\"\",\"\",Linkwahl!AG364)","v":""},{"$f":"IF(Linkwahl!AH364=\"\",\"\",Linkwahl!AH364)","v":""}]
["",{"$f":"IF(Linkwahl!AG365=\"\",\"\",Linkwahl!AG365)","v":""},{"$f":"IF(Linkwahl!AH365=\"\",\"\",Linkwahl!AH365)","v":""}]
["",{"$f":"IF(Linkwahl!AG366=\"\",\"\",Linkwahl!AG366)","v":""},{"$f":"IF(Linkwahl!AH366=\"\",\"\",Linkwahl!AH366)","v":""}]
["",{"$f":"IF(Linkwahl!AG367=\"\",\"\",Linkwahl!AG367)","v":""},{"$f":"IF(Linkwahl!AH367=\"\",\"\",Linkwahl!AH367)","v":""}]
["",{"$f":"IF(Linkwahl!AG368=\"\",\"\",Linkwahl!AG368)","v":""},{"$f":"IF(Linkwahl!AH368=\"\",\"\",Linkwahl!AH368)","v":""}]
["",{"$f":"IF(Linkwahl!AG369=\"\",\"\",Linkwahl!AG369)","v":""},{"$f":"IF(Linkwahl!AH369=\"\",\"\",Linkwahl!AH369)","v":""}]
["",{"$f":"IF(Linkwahl!AG370=\"\",\"\",Linkwahl!AG370)","v":""},{"$f":"IF(Linkwahl!AH370=\"\",\"\",Linkwahl!AH370)","v":""}]
["",{"$f":"IF(Linkwahl!AG371=\"\",\"\",Linkwahl!AG371)","v":""},{"$f":"IF(Linkwahl!AH371=\"\",\"\",Linkwahl!AH371)","v":""}]
["",{"$f":"IF(Linkwahl!AG372=\"\",\"\",Linkwahl!AG372)","v":""},{"$f":"IF(Linkwahl!AH372=\"\",\"\",Linkwahl!AH372)","v":""}]
["",{"$f":"IF(Linkwahl!AG373=\"\",\"\",Linkwahl!AG373)","v":""},{"$f":"IF(Linkwahl!AH373=\"\",\"\",Linkwahl!AH373)","v":""}]
[{"$f":"IF(B196=\"\",\"\",HYPERLINK(\"http://www.admin.ch/ch/r/rs/c\"&SUBSTITUTE(B196,\".\",\"_\")&\".html\",\"SR-Link\"))","v":""},{"$f":"IF(Linkwahl!AG374=\"\",\"\",Linkwahl!AG374)","v":""},{"$f":"IF(Linkwahl!AH374=\"\",\"\",Linkwahl!AH374)","v":""}]
["",{"$f":"IF(Linkwahl!AG375=\"\",\"\",Linkwahl!AG375)","v":""},{"$f":"IF(Linkwahl!AH375=\"\",\"\",Linkwahl!AH375)","v":""}]
["",{"$f":"IF(Linkwahl!AG376=\"\",\"\",Linkwahl!AG376)","v":""},{"$f":"IF(Linkwahl!AH376=\"\",\"\",Linkwahl!AH376)","v":""}]
["",{"$f":"IF(Linkwahl!AG377=\"\",\"\",Linkwahl!AG377)","v":""},{"$f":"IF(Linkwahl!AH377=\"\",\"\",Linkwahl!AH377)","v":""}]
["",{"$f":"IF(Linkwahl!AG378=\"\",\"\",Linkwahl!AG378)","v":""},{"$f":"IF(Linkwahl!AH378=\"\",\"\",Linkwahl!AH378)","v":""}]
["",{"$f":"IF(Linkwahl!AG379=\"\",\"\",Linkwahl!AG379)","v":""},{"$f":"IF(Linkwahl!AH379=\"\",\"\",Linkwahl!AH379)","v":""}]
["",{"$f":"IF(Linkwahl!AG380=\"\",\"\",Linkwahl!AG380)","v":""},{"$f":"IF(Linkwahl!AH380=\"\",\"\",Linkwahl!AH380)","v":""}]
["",{"$f":"IF(Linkwahl!AG381=\"\",\"\",Linkwahl!AG381)","v":""},{"$f":"IF(Linkwahl!AH381=\"\",\"\",Linkwahl!AH381)","v":""}]
["",{"$f":"IF(Linkwahl!AG383=\"\",\"\",Linkwahl!AG383)","v":""},{"$f":"IF(Linkwahl!AH383=\"\",\"\",Linkwahl!AH383)","v":""}]
["",{"$f":"IF(Linkwahl!AG384=\"\",\"\",Linkwahl!AG384)","v":""},{"$f":"IF(Linkwahl!AH384=\"\",\"\",Linkwahl!AH384)","v":""}]
["",{"$f":"IF(Linkwahl!AG385=\"\",\"\",Linkwahl!AG385)","v":""},{"$f":"IF(Linkwahl!AH385=\"\",\"\",Linkwahl!AH385)","v":""}]
["",{"$f":"IF(Linkwahl!AG386=\"\",\"\",Linkwahl!AG386)","v":""},{"$f":"IF(Linkwahl!AH386=\"\",\"\",Linkwahl!AH386)","v":""}]
["",{"$f":"IF(Linkwahl!AG387=\"\",\"\",Linkwahl!AG387)","v":""},{"$f":"IF(Linkwahl!AH387=\"\",\"\",Linkwahl!AH387)","v":""}]
["",{"$f":"IF(Linkwahl!AG389=\"\",\"\",Linkwahl!AG389)","v":""},{"$f":"IF(Linkwahl!AH389=\"\",\"\",Linkwahl!AH389)","v":""}]
["",{"$f":"IF(Linkwahl!AG390=\"\",\"\",Linkwahl!AG390)","v":""},{"$f":"IF(Linkwahl!AH390=\"\",\"\",Linkwahl!AH390)","v":""}]
["",{"$f":"IF(Linkwahl!AG391=\"\",\"\",Linkwahl!AG391)","v":""},{"$f":"IF(Linkwahl!AH391=\"\",\"\",Linkwahl!AH391)","v":""}]
["",{"$f":"IF(Linkwahl!AG393=\"\",\"\",Linkwahl!AG393)","v":""},{"$f":"IF(Linkwahl!AH393=\"\",\"\",Linkwahl!AH393)","v":""}]
["",{"$f":"IF(Linkwahl!AG394=\"\",\"\",Linkwahl!AG394)","v":""},{"$f":"IF(Linkwahl!AH394=\"\",\"\",Linkwahl!AH394)","v":""}]
["",{"$f":"IF(Linkwahl!AG397=\"\",\"\",Linkwahl!AG397)","v":""},{"$f":"IF(Linkwahl!AH397=\"\",\"\",Linkwahl!AH397)","v":""}]
["",{"$f":"IF(Linkwahl!AG401=\"\",\"\",Linkwahl!AG401)","v":""},{"$f":"IF(Linkwahl!AH401=\"\",\"\",Linkwahl!AH401)","v":""}]
["",{"$f":"IF(Linkwahl!AG402=\"\",\"\",Linkwahl!AG402)","v":""},{"$f":"IF(Linkwahl!AH402=\"\",\"\",Linkwahl!AH402)","v":""}]
["",{"$f":"IF(Linkwahl!AG403=\"\",\"\",Linkwahl!AG403)","v":""},{"$f":"IF(Linkwahl!AH403=\"\",\"\",Linkwahl!AH403)","v":""}]
["",{"$f":"IF(Linkwahl!AG404=\"\",\"\",Linkwahl!AG404)","v":""},{"$f":"IF(Linkwahl!AH404=\"\",\"\",Linkwahl!AH404)","v":""}]
["",{"$f":"IF(Linkwahl!AG405=\"\",\"\",Linkwahl!AG405)","v":""},{"$f":"IF(Linkwahl!AH405=\"\",\"\",Linkwahl!AH405)","v":""}]
["",{"$f":"IF(Linkwahl!AG406=\"\",\"\",Linkwahl!AG406)","v":""},{"$f":"IF(Linkwahl!AH406=\"\",\"\",Linkwahl!AH406)","v":""}]
["",{"$f":"IF(Linkwahl!AG407=\"\",\"\",Linkwahl!AG407)","v":""},{"$f":"IF(Linkwahl!AH407=\"\",\"\",Linkwahl!AH407)","v":""}]
["",{"$f":"IF(Linkwahl!AG408=\"\",\"\",Linkwahl!AG408)","v":""},{"$f":"IF(Linkwahl!AH408=\"\",\"\",Linkwahl!AH408)","v":""}]
["",{"$f":"IF(Linkwahl!AG409=\"\",\"\",Linkwahl!AG409)","v":""},{"$f":"IF(Linkwahl!AH409=\"\",\"\",Linkwahl!AH409)","v":""}]
["",{"$f":"IF(Linkwahl!AG410=\"\",\"\",Linkwahl!AG410)","v":""},{"$f":"IF(Linkwahl!AH410=\"\",\"\",Linkwahl!AH410)","v":""}]
["",{"$f":"IF(Linkwahl!AG411=\"\",\"\",Linkwahl!AG411)","v":""},{"$f":"IF(Linkwahl!AH411=\"\",\"\",Linkwahl!AH411)","v":""}]
["",{"$f":"IF(Linkwahl!AG412=\"\",\"\",Linkwahl!AG412)","v":""},{"$f":"IF(Linkwahl!AH412=\"\",\"\",Linkwahl!AH412)","v":""}]
["",{"$f":"IF(Linkwahl!AG413=\"\",\"\",Linkwahl!AG413)","v":""},{"$f":"IF(Linkwahl!AH413=\"\",\"\",Linkwahl!AH413)","v":""}]
["",{"$f":"IF(Linkwahl!AG414=\"\",\"\",Linkwahl!AG414)","v":""},{"$f":"IF(Linkwahl!AH414=\"\",\"\",Linkwahl!AH414)","v":""}]
["",{"$f":"IF(Linkwahl!AG415=\"\",\"\",Linkwahl!AG415)","v":""},{"$f":"IF(Linkwahl!AH415=\"\",\"\",Linkwahl!AH415)","v":""}]
["",{"$f":"IF(Linkwahl!AG416=\"\",\"\",Linkwahl!AG416)","v":""},{"$f":"IF(Linkwahl!AH416=\"\",\"\",Linkwahl!AH416)","v":""}]
["",{"$f":"IF(Linkwahl!AG417=\"\",\"\",Linkwahl!AG417)","v":""},{"$f":"IF(Linkwahl!AH417=\"\",\"\",Linkwahl!AH417)","v":""}]
["",{"$f":"IF(Linkwahl!AG418=\"\",\"\",Linkwahl!AG418)","v":""},{"$f":"IF(Linkwahl!AH418=\"\",\"\",Linkwahl!AH418)","v":""}]
["",{"$f":"IF(Linkwahl!AG419=\"\",\"\",Linkwahl!AG419)","v":""},{"$f":"IF(Linkwahl!AH419=\"\",\"\",Linkwahl!AH419)","v":""}]
["",{"$f":"IF(Linkwahl!AG420=\"\",\"\",Linkwahl!AG420)","v":""},{"$f":"IF(Linkwahl!AH420=\"\",\"\",Linkwahl!AH420)","v":""}]
["",{"$f":"IF(Linkwahl!AG421=\"\",\"\",Linkwahl!AG421)","v":""},{"$f":"IF(Linkwahl!AH421=\"\",\"\",Linkwahl!AH421)","v":""}]
["",{"$f":"IF(Linkwahl!AG422=\"\",\"\",Linkwahl!AG422)","v":""},{"$f":"IF(Linkwahl!AH422=\"\",\"\",Linkwahl!AH422)","v":""}]
["",{"$f":"IF(Linkwahl!AG423=\"\",\"\",Linkwahl!AG423)","v":""},{"$f":"IF(Linkwahl!AH423=\"\",\"\",Linkwahl!AH423)","v":""}]
["",{"$f":"IF(Linkwahl!AG424=\"\",\"\",Linkwahl!AG424)","v":""},{"$f":"IF(Linkwahl!AH424=\"\",\"\",Linkwahl!AH424)","v":""}]
["",{"$f":"IF(Linkwahl!AG425=\"\",\"\",Linkwahl!AG425)","v":""},{"$f":"IF(Linkwahl!AH425=\"\",\"\",Linkwahl!AH425)","v":""}]
["",{"$f":"IF(Linkwahl!AG426=\"\",\"\",Linkwahl!AG426)","v":""},{"$f":"IF(Linkwahl!AH426=\"\",\"\",Linkwahl!AH426)","v":""}]
["",{"$f":"IF(Linkwahl!AG427=\"\",\"\",Linkwahl!AG427)","v":""},{"$f":"IF(Linkwahl!AH427=\"\",\"\",Linkwahl!AH427)","v":""}]
["",{"$f":"IF(Linkwahl!AG428=\"\",\"\",Linkwahl!AG428)","v":""},{"$f":"IF(Linkwahl!AH428=\"\",\"\",Linkwahl!AH428)","v":""}]
["",{"$f":"IF(Linkwahl!AG430=\"\",\"\",Linkwahl!AG430)","v":""},{"$f":"IF(Linkwahl!AH430=\"\",\"\",Linkwahl!AH430)","v":""}]
["",{"$f":"IF(Linkwahl!AG431=\"\",\"\",Linkwahl!AG431)","v":""},{"$f":"IF(Linkwahl!AH431=\"\",\"\",Linkwahl!AH431)","v":""}]
["",{"$f":"IF(Linkwahl!AG432=\"\",\"\",Linkwahl!AG432)","v":""},{"$f":"IF(Linkwahl!AH432=\"\",\"\",Linkwahl!AH432)","v":""}]
["",{"$f":"IF(Linkwahl!AG433=\"\",\"\",Linkwahl!AG433)","v":""},{"$f":"IF(Linkwahl!AH433=\"\",\"\",Linkwahl!AH433)","v":""}]
["",{"$f":"IF(Linkwahl!AG434=\"\",\"\",Linkwahl!AG434)","v":""},{"$f":"IF(Linkwahl!AH434=\"\",\"\",Linkwahl!AH434)","v":""}]
["",{"$f":"IF(Linkwahl!AG435=\"\",\"\",Linkwahl!AG435)","v":""},{"$f":"IF(Linkwahl!AH435=\"\",\"\",Linkwahl!AH435)","v":""}]
["",{"$f":"IF(Linkwahl!AG436=\"\",\"\",Linkwahl!AG436)","v":""},{"$f":"IF(Linkwahl!AH436=\"\",\"\",Linkwahl!AH436)","v":""}]
["",{"$f":"IF(Linkwahl!AG437=\"\",\"\",Linkwahl!AG437)","v":""},{"$f":"IF(Linkwahl!AH437=\"\",\"\",Linkwahl!AH437)","v":""}]
["",{"$f":"IF(Linkwahl!AG438=\"\",\"\",Linkwahl!AG438)","v":""},{"$f":"IF(Linkwahl!AH438=\"\",\"\",Linkwahl!AH438)","v":""}]
["",{"$f":"IF(Linkwahl!AG439=\"\",\"\",Linkwahl!AG439)","v":""},{"$f":"IF(Linkwahl!AH439=\"\",\"\",Linkwahl!AH439)","v":""}]
["",{"$f":"IF(Linkwahl!AG440=\"\",\"\",Linkwahl!AG440)","v":""},{"$f":"IF(Linkwahl!AH440=\"\",\"\",Linkwahl!AH440)","v":""}]
["",{"$f":"IF(Linkwahl!AG441=\"\",\"\",Linkwahl!AG441)","v":""},{"$f":"IF(Linkwahl!AH441=\"\",\"\",Linkwahl!AH441)","v":""}]
["",{"$f":"IF(Linkwahl!AG442=\"\",\"\",Linkwahl!AG442)","v":""},{"$f":"IF(Linkwahl!AH442=\"\",\"\",Linkwahl!AH442)","v":""}]
["",{"$f":"IF(Linkwahl!AG443=\"\",\"\",Linkwahl!AG443)","v":""},{"$f":"IF(Linkwahl!AH443=\"\",\"\",Linkwahl!AH443)","v":""}]
["",{"$f":"IF(Linkwahl!AG444=\"\",\"\",Linkwahl!AG444)","v":""},{"$f":"IF(Linkwahl!AH444=\"\",\"\",Linkwahl!AH444)","v":""}]
["",{"$f":"IF(Linkwahl!AG445=\"\",\"\",Linkwahl!AG445)","v":""},{"$f":"IF(Linkwahl!AH445=\"\",\"\",Linkwahl!AH445)","v":""}]
["",{"$f":"IF(Linkwahl!AG446=\"\",\"\",Linkwahl!AG446)","v":""},{"$f":"IF(Linkwahl!AH446=\"\",\"\",Linkwahl!AH446)","v":""}]
[{"$f":"IF(B260=\"\",\"\",HYPERLINK(\"http://www.admin.ch/ch/r/rs/c\"&SUBSTITUTE(B260,\".\",\"_\")&\".html\",\"SR-Link\"))","v":""},{"$f":"IF(Linkwahl!AG447=\"\",\"\",Linkwahl!AG447)","v":""},{"$f":"IF(Linkwahl!AH447=\"\",\"\",Linkwahl!AH447)","v":""}]
["",{"$f":"IF(Linkwahl!AG448=\"\",\"\",Linkwahl!AG448)","v":""},{"$f":"IF(Linkwahl!AH448=\"\",\"\",Linkwahl!AH448)","v":""}]
["",{"$f":"IF(Linkwahl!AG449=\"\",\"\",Linkwahl!AG449)","v":""},{"$f":"IF(Linkwahl!AH449=\"\",\"\",Linkwahl!AH449)","v":""}]
["",{"$f":"IF(Linkwahl!AG450=\"\",\"\",Linkwahl!AG450)","v":""},{"$f":"IF(Linkwahl!AH450=\"\",\"\",Linkwahl!AH450)","v":""}]
["",{"$f":"IF(Linkwahl!AG451=\"\",\"\",Linkwahl!AG451)","v":""},{"$f":"IF(Linkwahl!AH451=\"\",\"\",Linkwahl!AH451)","v":""}]
["",{"$f":"IF(Linkwahl!AG452=\"\",\"\",Linkwahl!AG452)","v":""},{"$f":"IF(Linkwahl!AH452=\"\",\"\",Linkwahl!AH452)","v":""}]
["",{"$f":"IF(Linkwahl!AG453=\"\",\"\",Linkwahl!AG453)","v":""},{"$f":"IF(Linkwahl!AH453=\"\",\"\",Linkwahl!AH453)","v":""}]
["",{"$f":"IF(Linkwahl!AG454=\"\",\"\",Linkwahl!AG454)","v":""},{"$f":"IF(Linkwahl!AH454=\"\",\"\",Linkwahl!AH454)","v":""}]
["",{"$f":"IF(Linkwahl!AG455=\"\",\"\",Linkwahl!AG455)","v":""},{"$f":"IF(Linkwahl!AH455=\"\",\"\",Linkwahl!AH455)","v":""}]
["",{"$f":"IF(Linkwahl!AG456=\"\",\"\",Linkwahl!AG456)","v":""},{"$f":"IF(Linkwahl!AH456=\"\",\"\",Linkwahl!AH456)","v":""}]
["",{"$f":"IF(Linkwahl!AG457=\"\",\"\",Linkwahl!AG457)","v":""},{"$f":"IF(Linkwahl!AH457=\"\",\"\",Linkwahl!AH457)","v":""}]
["",{"$f":"IF(Linkwahl!AG458=\"\",\"\",Linkwahl!AG458)","v":""},{"$f":"IF(Linkwahl!AH458=\"\",\"\",Linkwahl!AH458)","v":""}]
["",{"$f":"IF(Linkwahl!AG459=\"\",\"\",Linkwahl!AG459)","v":""},{"$f":"IF(Linkwahl!AH459=\"\",\"\",Linkwahl!AH459)","v":""}]
["",{"$f":"IF(Linkwahl!AG460=\"\",\"\",Linkwahl!AG460)","v":""},{"$f":"IF(Linkwahl!AH460=\"\",\"\",Linkwahl!AH460)","v":""}]
["",{"$f":"IF(Linkwahl!AG461=\"\",\"\",Linkwahl!AG461)","v":""},{"$f":"IF(Linkwahl!AH461=\"\",\"\",Linkwahl!AH461)","v":""}]
["",{"$f":"IF(Linkwahl!AG462=\"\",\"\",Linkwahl!AG462)","v":""},{"$f":"IF(Linkwahl!AH462=\"\",\"\",Linkwahl!AH462)","v":""}]
["",{"$f":"IF(Linkwahl!AG463=\"\",\"\",Linkwahl!AG463)","v":""},{"$f":"IF(Linkwahl!AH463=\"\",\"\",Linkwahl!AH463)","v":""}]
["",{"$f":"IF(Linkwahl!AG464=\"\",\"\",Linkwahl!AG464)","v":""},{"$f":"IF(Linkwahl!AH464=\"\",\"\",Linkwahl!AH464)","v":""}]
["",{"$f":"IF(Linkwahl!AG465=\"\",\"\",Linkwahl!AG465)","v":""},{"$f":"IF(Linkwahl!AH465=\"\",\"\",Linkwahl!AH465)","v":""}]
["",{"$f":"IF(Linkwahl!AG466=\"\",\"\",Linkwahl!AG466)","v":""},{"$f":"IF(Linkwahl!AH466=\"\",\"\",Linkwahl!AH466)","v":""}]
["",{"$f":"IF(Linkwahl!AG467=\"\",\"\",Linkwahl!AG467)","v":""},{"$f":"IF(Linkwahl!AH467=\"\",\"\",Linkwahl!AH467)","v":""}]
["",{"$f":"IF(Linkwahl!AG468=\"\",\"\",Linkwahl!AG468)","v":""},{"$f":"IF(Linkwahl!AH468=\"\",\"\",Linkwahl!AH468)","v":""}]
["",{"$f":"IF(Linkwahl!AG469=\"\",\"\",Linkwahl!AG469)","v":""},{"$f":"IF(Linkwahl!AH469=\"\",\"\",Linkwahl!AH469)","v":""}]
["",{"$f":"IF(Linkwahl!AG470=\"\",\"\",Linkwahl!AG470)","v":""},{"$f":"IF(Linkwahl!AH470=\"\",\"\",Linkwahl!AH470)","v":""}]
["",{"$f":"IF(Linkwahl!AG471=\"\",\"\",Linkwahl!AG471)","v":""},{"$f":"IF(Linkwahl!AH471=\"\",\"\",Linkwahl!AH471)","v":""}]
["",{"$f":"IF(Linkwahl!AG472=\"\",\"\",Linkwahl!AG472)","v":""},{"$f":"IF(Linkwahl!AH472=\"\",\"\",Linkwahl!AH472)","v":""}]
["",{"$f":"IF(Linkwahl!AG473=\"\",\"\",Linkwahl!AG473)","v":""},{"$f":"IF(Linkwahl!AH473=\"\",\"\",Linkwahl!AH473)","v":""}]
["",{"$f":"IF(Linkwahl!AG474=\"\",\"\",Linkwahl!AG474)","v":""},{"$f":"IF(Linkwahl!AH474=\"\",\"\",Linkwahl!AH474)","v":""}]
["",{"$f":"IF(Linkwahl!AG475=\"\",\"\",Linkwahl!AG475)","v":""},{"$f":"IF(Linkwahl!AH475=\"\",\"\",Linkwahl!AH475)","v":""}]
["",{"$f":"IF(Linkwahl!AG476=\"\",\"\",Linkwahl!AG476)","v":""},{"$f":"IF(Linkwahl!AH476=\"\",\"\",Linkwahl!AH476)","v":""}]
["",{"$f":"IF(Linkwahl!AG477=\"\",\"\",Linkwahl!AG477)","v":""},{"$f":"IF(Linkwahl!AH477=\"\",\"\",Linkwahl!AH477)","v":""}]
["",{"$f":"IF(Linkwahl!AG478=\"\",\"\",Linkwahl!AG478)","v":""},{"$f":"IF(Linkwahl!AH478=\"\",\"\",Linkwahl!AH478)","v":""}]
["",{"$f":"IF(Linkwahl!AG479=\"\",\"\",Linkwahl!AG479)","v":""},{"$f":"IF(Linkwahl!AH479=\"\",\"\",Linkwahl!AH479)","v":""}]
["",{"$f":"IF(Linkwahl!AG480=\"\",\"\",Linkwahl!AG480)","v":""},{"$f":"IF(Linkwahl!AH480=\"\",\"\",Linkwahl!AH480)","v":""}]
["",{"$f":"IF(Linkwahl!AG481=\"\",\"\",Linkwahl!AG481)","v":""},{"$f":"IF(Linkwahl!AH481=\"\",\"\",Linkwahl!AH481)","v":""}]
["",{"$f":"IF(Linkwahl!AG482=\"\",\"\",Linkwahl!AG482)","v":""},{"$f":"IF(Linkwahl!AH482=\"\",\"\",Linkwahl!AH482)","v":""}]
["",{"$f":"IF(Linkwahl!AG483=\"\",\"\",Linkwahl!AG483)","v":""},{"$f":"IF(Linkwahl!AH483=\"\",\"\",Linkwahl!AH483)","v":""}]
["",{"$f":"IF(Linkwahl!AG484=\"\",\"\",Linkwahl!AG484)","v":""},{"$f":"IF(Linkwahl!AH484=\"\",\"\",Linkwahl!AH484)","v":""}]
["",{"$f":"IF(Linkwahl!AG485=\"\",\"\",Linkwahl!AG485)","v":""},{"$f":"IF(Linkwahl!AH485=\"\",\"\",Linkwahl!AH485)","v":""}]
["",{"$f":"IF(Linkwahl!AG486=\"\",\"\",Linkwahl!AG486)","v":""},{"$f":"IF(Linkwahl!AH486=\"\",\"\",Linkwahl!AH486)","v":""}]
["",{"$f":"IF(Linkwahl!AG487=\"\",\"\",Linkwahl!AG487)","v":""},{"$f":"IF(Linkwahl!AH487=\"\",\"\",Linkwahl!AH487)","v":""}]
["",{"$f":"IF(Linkwahl!AG488=\"\",\"\",Linkwahl!AG488)","v":""},{"$f":"IF(Linkwahl!AH488=\"\",\"\",Linkwahl!AH488)","v":""}]
["",{"$f":"IF(Linkwahl!AG489=\"\",\"\",Linkwahl!AG489)","v":""},{"$f":"IF(Linkwahl!AH489=\"\",\"\",Linkwahl!AH489)","v":""}]
["",{"$f":"IF(Linkwahl!AG490=\"\",\"\",Linkwahl!AG490)","v":""},{"$f":"IF(Linkwahl!AH490=\"\",\"\",Linkwahl!AH490)","v":""}]
["",{"$f":"IF(Linkwahl!AG491=\"\",\"\",Linkwahl!AG491)","v":""},{"$f":"IF(Linkwahl!AH491=\"\",\"\",Linkwahl!AH491)","v":""}]
["",{"$f":"IF(Linkwahl!AG492=\"\",\"\",Linkwahl!AG492)","v":""},{"$f":"IF(Linkwahl!AH492=\"\",\"\",Linkwahl!AH492)","v":""}]
["",{"$f":"IF(Linkwahl!AG493=\"\",\"\",Linkwahl!AG493)","v":""},{"$f":"IF(Linkwahl!AH493=\"\",\"\",Linkwahl!AH493)","v":""}]
["",{"$f":"IF(Linkwahl!AG494=\"\",\"\",Linkwahl!AG494)","v":""},{"$f":"IF(Linkwahl!AH494=\"\",\"\",Linkwahl!AH494)","v":""}]
["",{"$f":"IF(Linkwahl!AG495=\"\",\"\",Linkwahl!AG495)","v":""},{"$f":"IF(Linkwahl!AH495=\"\",\"\",Linkwahl!AH495)","v":""}]
["",{"$f":"IF(Linkwahl!AG496=\"\",\"\",Linkwahl!AG496)","v":""},{"$f":"IF(Linkwahl!AH496=\"\",\"\",Linkwahl!AH496)","v":""}]
["",{"$f":"IF(Linkwahl!AG497=\"\",\"\",Linkwahl!AG497)","v":""},{"$f":"IF(Linkwahl!AH497=\"\",\"\",Linkwahl!AH497)","v":""}]
["",{"$f":"IF(Linkwahl!AG498=\"\",\"\",Linkwahl!AG498)","v":""},{"$f":"IF(Linkwahl!AH498=\"\",\"\",Linkwahl!AH498)","v":""}]
["",{"$f":"IF(Linkwahl!AG499=\"\",\"\",Linkwahl!AG499)","v":""},{"$f":"IF(Linkwahl!AH499=\"\",\"\",Linkwahl!AH499)","v":""}]
["",{"$f":"IF(Linkwahl!AG500=\"\",\"\",Linkwahl!AG500)","v":""},{"$f":"IF(Linkwahl!AH500=\"\",\"\",Linkwahl!AH500)","v":""}]
["",{"$f":"IF(Linkwahl!AG501=\"\",\"\",Linkwahl!AG501)","v":""},{"$f":"IF(Linkwahl!AH501=\"\",\"\",Linkwahl!AH501)","v":""}]
["",{"$f":"IF(Linkwahl!AG502=\"\",\"\",Linkwahl!AG502)","v":""},{"$f":"IF(Linkwahl!AH502=\"\",\"\",Linkwahl!AH502)","v":""}]
["",{"$f":"IF(Linkwahl!AG503=\"\",\"\",Linkwahl!AG503)","v":""},{"$f":"IF(Linkwahl!AH503=\"\",\"\",Linkwahl!AH503)","v":""}]
["",{"$f":"IF(Linkwahl!AG504=\"\",\"\",Linkwahl!AG504)","v":""},{"$f":"IF(Linkwahl!AH504=\"\",\"\",Linkwahl!AH504)","v":""}]
["",{"$f":"IF(Linkwahl!AG505=\"\",\"\",Linkwahl!AG505)","v":""},{"$f":"IF(Linkwahl!AH505=\"\",\"\",Linkwahl!AH505)","v":""}]
["",{"$f":"IF(Linkwahl!AG506=\"\",\"\",Linkwahl!AG506)","v":""},{"$f":"IF(Linkwahl!AH506=\"\",\"\",Linkwahl!AH506)","v":""}]
["",{"$f":"IF(Linkwahl!AG507=\"\",\"\",Linkwahl!AG507)","v":""},{"$f":"IF(Linkwahl!AH507=\"\",\"\",Linkwahl!AH507)","v":""}]
["",{"$f":"IF(Linkwahl!AG508=\"\",\"\",Linkwahl!AG508)","v":""},{"$f":"IF(Linkwahl!AH508=\"\",\"\",Linkwahl!AH508)","v":""}]
["",{"$f":"IF(Linkwahl!AG509=\"\",\"\",Linkwahl!AG509)","v":""},{"$f":"IF(Linkwahl!AH509=\"\",\"\",Linkwahl!AH509)","v":""}]
["",{"$f":"IF(Linkwahl!AG510=\"\",\"\",Linkwahl!AG510)","v":""},{"$f":"IF(Linkwahl!AH510=\"\",\"\",Linkwahl!AH510)","v":""}]
[{"$f":"IF(B324=\"\",\"\",HYPERLINK(\"http://www.admin.ch/ch/r/rs/c\"&SUBSTITUTE(B324,\".\",\"_\")&\".html\",\"SR-Link\"))","v":""},{"$f":"IF(Linkwahl!AG511=\"\",\"\",Linkwahl!AG511)","v":""},{"$f":"IF(Linkwahl!AH511=\"\",\"\",Linkwahl!AH511)","v":""}]
["",{"$f":"IF(Linkwahl!AG512=\"\",\"\",Linkwahl!AG512)","v":""},{"$f":"IF(Linkwahl!AH512=\"\",\"\",Linkwahl!AH512)","v":""}]
["",{"$f":"IF(Linkwahl!AG513=\"\",\"\",Linkwahl!AG513)","v":""},{"$f":"IF(Linkwahl!AH513=\"\",\"\",Linkwahl!AH513)","v":""}]
["",{"$f":"IF(Linkwahl!AG514=\"\",\"\",Linkwahl!AG514)","v":""},{"$f":"IF(Linkwahl!AH514=\"\",\"\",Linkwahl!AH514)","v":""}]
["",{"$f":"IF(Linkwahl!AG515=\"\",\"\",Linkwahl!AG515)","v":""},{"$f":"IF(Linkwahl!AH515=\"\",\"\",Linkwahl!AH515)","v":""}]
["",{"$f":"IF(Linkwahl!AG516=\"\",\"\",Linkwahl!AG516)","v":""},{"$f":"IF(Linkwahl!AH516=\"\",\"\",Linkwahl!AH516)","v":""}]
["",{"$f":"IF(Linkwahl!AG517=\"\",\"\",Linkwahl!AG517)","v":""},{"$f":"IF(Linkwahl!AH517=\"\",\"\",Linkwahl!AH517)","v":""}]
["",{"$f":"IF(Linkwahl!AG518=\"\",\"\",Linkwahl!AG518)","v":""},{"$f":"IF(Linkwahl!AH518=\"\",\"\",Linkwahl!AH518)","v":""}]
["",{"$f":"IF(Linkwahl!AG519=\"\",\"\",Linkwahl!AG519)","v":""},{"$f":"IF(Linkwahl!AH519=\"\",\"\",Linkwahl!AH519)","v":""}]
["",{"$f":"IF(Linkwahl!AG520=\"\",\"\",Linkwahl!AG520)","v":""},{"$f":"IF(Linkwahl!AH520=\"\",\"\",Linkwahl!AH520)","v":""}]
["",{"$f":"IF(Linkwahl!AG521=\"\",\"\",Linkwahl!AG521)","v":""},{"$f":"IF(Linkwahl!AH521=\"\",\"\",Linkwahl!AH521)","v":""}]
["",{"$f":"IF(Linkwahl!AG522=\"\",\"\",Linkwahl!AG522)","v":""},{"$f":"IF(Linkwahl!AH522=\"\",\"\",Linkwahl!AH522)","v":""}]
["",{"$f":"IF(Linkwahl!AG523=\"\",\"\",Linkwahl!AG523)","v":""},{"$f":"IF(Linkwahl!AH523=\"\",\"\",Linkwahl!AH523)","v":""}]
["",{"$f":"IF(Linkwahl!AG524=\"\",\"\",Linkwahl!AG524)","v":""},{"$f":"IF(Linkwahl!AH524=\"\",\"\",Linkwahl!AH524)","v":""}]
["",{"$f":"IF(Linkwahl!AG525=\"\",\"\",Linkwahl!AG525)","v":""},{"$f":"IF(Linkwahl!AH525=\"\",\"\",Linkwahl!AH525)","v":""}]
["",{"$f":"IF(Linkwahl!AG526=\"\",\"\",Linkwahl!AG526)","v":""},{"$f":"IF(Linkwahl!AH526=\"\",\"\",Linkwahl!AH526)","v":""}]
["",{"$f":"IF(Linkwahl!AG527=\"\",\"\",Linkwahl!AG527)","v":""},{"$f":"IF(Linkwahl!AH527=\"\",\"\",Linkwahl!AH527)","v":""}]
["",{"$f":"IF(Linkwahl!AG528=\"\",\"\",Linkwahl!AG528)","v":""},{"$f":"IF(Linkwahl!AH528=\"\",\"\",Linkwahl!AH528)","v":""}]
["",{"$f":"IF(Linkwahl!AG529=\"\",\"\",Linkwahl!AG529)","v":""},{"$f":"IF(Linkwahl!AH529=\"\",\"\",Linkwahl!AH529)","v":""}]
["",{"$f":"IF(Linkwahl!AG530=\"\",\"\",Linkwahl!AG530)","v":""},{"$f":"IF(Linkwahl!AH530=\"\",\"\",Linkwahl!AH530)","v":""}]
["",{"$f":"IF(Linkwahl!AG531=\"\",\"\",Linkwahl!AG531)","v":""},{"$f":"IF(Linkwahl!AH531=\"\",\"\",Linkwahl!AH531)","v":""}]
["",{"$f":"IF(Linkwahl!AG532=\"\",\"\",Linkwahl!AG532)","v":""},{"$f":"IF(Linkwahl!AH532=\"\",\"\",Linkwahl!AH532)","v":""}]
["",{"$f":"IF(Linkwahl!AG533=\"\",\"\",Linkwahl!AG533)","v":""},{"$f":"IF(Linkwahl!AH533=\"\",\"\",Linkwahl!AH533)","v":""}]
["",{"$f":"IF(Linkwahl!AG534=\"\",\"\",Linkwahl!AG534)","v":""},{"$f":"IF(Linkwahl!AH534=\"\",\"\",Linkwahl!AH534)","v":""}]
["",{"$f":"IF(Linkwahl!AG535=\"\",\"\",Linkwahl!AG535)","v":""},{"$f":"IF(Linkwahl!AH535=\"\",\"\",Linkwahl!AH535)","v":""}]
["",{"$f":"IF(Linkwahl!AG536=\"\",\"\",Linkwahl!AG536)","v":""},{"$f":"IF(Linkwahl!AH536=\"\",\"\",Linkwahl!AH536)","v":""}]
["",{"$f":"IF(Linkwahl!AG537=\"\",\"\",Linkwahl!AG537)","v":""},{"$f":"IF(Linkwahl!AH537=\"\",\"\",Linkwahl!AH537)","v":""}]
["",{"$f":"IF(Linkwahl!AG538=\"\",\"\",Linkwahl!AG538)","v":""},{"$f":"IF(Linkwahl!AH538=\"\",\"\",Linkwahl!AH538)","v":""}]
["",{"$f":"IF(Linkwahl!AG539=\"\",\"\",Linkwahl!AG539)","v":""},{"$f":"IF(Linkwahl!AH539=\"\",\"\",Linkwahl!AH539)","v":""}]
["",{"$f":"IF(Linkwahl!AG540=\"\",\"\",Linkwahl!AG540)","v":""},{"$f":"IF(Linkwahl!AH540=\"\",\"\",Linkwahl!AH540)","v":""}]
["",{"$f":"IF(Linkwahl!AG541=\"\",\"\",Linkwahl!AG541)","v":""},{"$f":"IF(Linkwahl!AH541=\"\",\"\",Linkwahl!AH541)","v":""}]
["",{"$f":"IF(Linkwahl!AG542=\"\",\"\",Linkwahl!AG542)","v":""},{"$f":"IF(Linkwahl!AH542=\"\",\"\",Linkwahl!AH542)","v":""}]
["",{"$f":"IF(Linkwahl!AG543=\"\",\"\",Linkwahl!AG543)","v":""},{"$f":"IF(Linkwahl!AH543=\"\",\"\",Linkwahl!AH543)","v":""}]
["",{"$f":"IF(Linkwahl!AG544=\"\",\"\",Linkwahl!AG544)","v":""},{"$f":"IF(Linkwahl!AH544=\"\",\"\",Linkwahl!AH544)","v":""}]
["",{"$f":"IF(Linkwahl!AG545=\"\",\"\",Linkwahl!AG545)","v":""},{"$f":"IF(Linkwahl!AH545=\"\",\"\",Linkwahl!AH545)","v":""}]
["",{"$f":"IF(Linkwahl!AG546=\"\",\"\",Linkwahl!AG546)","v":""},{"$f":"IF(Linkwahl!AH546=\"\",\"\",Linkwahl!AH546)","v":""}]
["",{"$f":"IF(Linkwahl!AG547=\"\",\"\",Linkwahl!AG547)","v":""},{"$f":"IF(Linkwahl!AH547=\"\",\"\",Linkwahl!AH547)","v":""}]
["",{"$f":"IF(Linkwahl!AG548=\"\",\"\",Linkwahl!AG548)","v":""},{"$f":"IF(Linkwahl!AH548=\"\",\"\",Linkwahl!AH548)","v":""}]
["",{"$f":"IF(Linkwahl!AG549=\"\",\"\",Linkwahl!AG549)","v":""},{"$f":"IF(Linkwahl!AH549=\"\",\"\",Linkwahl!AH549)","v":""}]
["",{"$f":"IF(Linkwahl!AG550=\"\",\"\",Linkwahl!AG550)","v":""},{"$f":"IF(Linkwahl!AH550=\"\",\"\",Linkwahl!AH550)","v":""}]
["",{"$f":"IF(Linkwahl!AG551=\"\",\"\",Linkwahl!AG551)","v":""},{"$f":"IF(Linkwahl!AH551=\"\",\"\",Linkwahl!AH551)","v":""}]
["",{"$f":"IF(Linkwahl!AG552=\"\",\"\",Linkwahl!AG552)","v":""},{"$f":"IF(Linkwahl!AH552=\"\",\"\",Linkwahl!AH552)","v":""}]
["",{"$f":"IF(Linkwahl!AG553=\"\",\"\",Linkwahl!AG553)","v":""},{"$f":"IF(Linkwahl!AH553=\"\",\"\",Linkwahl!AH553)","v":""}]
["",{"$f":"IF(Linkwahl!AG554=\"\",\"\",Linkwahl!AG554)","v":""},{"$f":"IF(Linkwahl!AH554=\"\",\"\",Linkwahl!AH554)","v":""}]
["",{"$f":"IF(Linkwahl!AG555=\"\",\"\",Linkwahl!AG555)","v":""},{"$f":"IF(Linkwahl!AH555=\"\",\"\",Linkwahl!AH555)","v":""}]
["",{"$f":"IF(Linkwahl!AG556=\"\",\"\",Linkwahl!AG556)","v":""},{"$f":"IF(Linkwahl!AH556=\"\",\"\",Linkwahl!AH556)","v":""}]
["",{"$f":"IF(Linkwahl!AG557=\"\",\"\",Linkwahl!AG557)","v":""},{"$f":"IF(Linkwahl!AH557=\"\",\"\",Linkwahl!AH557)","v":""}]
["",{"$f":"IF(Linkwahl!AG558=\"\",\"\",Linkwahl!AG558)","v":""},{"$f":"IF(Linkwahl!AH558=\"\",\"\",Linkwahl!AH558)","v":""}]
["",{"$f":"IF(Linkwahl!AG559=\"\",\"\",Linkwahl!AG559)","v":""},{"$f":"IF(Linkwahl!AH559=\"\",\"\",Linkwahl!AH559)","v":""}]
["",{"$f":"IF(Linkwahl!AG560=\"\",\"\",Linkwahl!AG560)","v":""},{"$f":"IF(Linkwahl!AH560=\"\",\"\",Linkwahl!AH560)","v":""}]
["",{"$f":"IF(Linkwahl!AG561=\"\",\"\",Linkwahl!AG561)","v":""},{"$f":"IF(Linkwahl!AH561=\"\",\"\",Linkwahl!AH561)","v":""}]
["",{"$f":"IF(Linkwahl!AG562=\"\",\"\",Linkwahl!AG562)","v":""},{"$f":"IF(Linkwahl!AH562=\"\",\"\",Linkwahl!AH562)","v":""}]
["",{"$f":"IF(Linkwahl!AG563=\"\",\"\",Linkwahl!AG563)","v":""},{"$f":"IF(Linkwahl!AH563=\"\",\"\",Linkwahl!AH563)","v":""}]
["",{"$f":"IF(Linkwahl!AG564=\"\",\"\",Linkwahl!AG564)","v":""},{"$f":"IF(Linkwahl!AH564=\"\",\"\",Linkwahl!AH564)","v":""}]
["",{"$f":"IF(Linkwahl!AG565=\"\",\"\",Linkwahl!AG565)","v":""},{"$f":"IF(Linkwahl!AH565=\"\",\"\",Linkwahl!AH565)","v":""}]
["",{"$f":"IF(Linkwahl!AG566=\"\",\"\",Linkwahl!AG566)","v":""},{"$f":"IF(Linkwahl!AH566=\"\",\"\",Linkwahl!AH566)","v":""}]
["",{"$f":"IF(Linkwahl!AG567=\"\",\"\",Linkwahl!AG567)","v":""},{"$f":"IF(Linkwahl!AH567=\"\",\"\",Linkwahl!AH567)","v":""}]
["",{"$f":"IF(Linkwahl!AG568=\"\",\"\",Linkwahl!AG568)","v":""},{"$f":"IF(Linkwahl!AH568=\"\",\"\",Linkwahl!AH568)","v":""}]
["",{"$f":"IF(Linkwahl!AG569=\"\",\"\",Linkwahl!AG569)","v":""},{"$f":"IF(Linkwahl!AH569=\"\",\"\",Linkwahl!AH569)","v":""}]
["",{"$f":"IF(Linkwahl!AG570=\"\",\"\",Linkwahl!AG570)","v":""},{"$f":"IF(Linkwahl!AH570=\"\",\"\",Linkwahl!AH570)","v":""}]
["",{"$f":"IF(Linkwahl!AG571=\"\",\"\",Linkwahl!AG571)","v":""},{"$f":"IF(Linkwahl!AH571=\"\",\"\",Linkwahl!AH571)","v":""}]
["",{"$f":"IF(Linkwahl!AG572=\"\",\"\",Linkwahl!AG572)","v":""},{"$f":"IF(Linkwahl!AH572=\"\",\"\",Linkwahl!AH572)","v":""}]
["",{"$f":"IF(Linkwahl!AG573=\"\",\"\",Linkwahl!AG573)","v":""},{"$f":"IF(Linkwahl!AH573=\"\",\"\",Linkwahl!AH573)","v":""}]
["",{"$f":"IF(Linkwahl!AG574=\"\",\"\",Linkwahl!AG574)","v":""},{"$f":"IF(Linkwahl!AH574=\"\",\"\",Linkwahl!AH574)","v":""}]
[{"$f":"IF(B388=\"\",\"\",HYPERLINK(\"http://www.admin.ch/ch/r/rs/c\"&SUBSTITUTE(B388,\".\",\"_\")&\".html\",\"SR-Link\"))","v":""},{"$f":"IF(Linkwahl!AG575=\"\",\"\",Linkwahl!AG575)","v":""},{"$f":"IF(Linkwahl!AH575=\"\",\"\",Linkwahl!AH575)","v":""}]
["",{"$f":"IF(Linkwahl!AG576=\"\",\"\",Linkwahl!AG576)","v":""},{"$f":"IF(Linkwahl!AH576=\"\",\"\",Linkwahl!AH576)","v":""}]
["",{"$f":"IF(Linkwahl!AG577=\"\",\"\",Linkwahl!AG577)","v":""},{"$f":"IF(Linkwahl!AH577=\"\",\"\",Linkwahl!AH577)","v":""}]
["",{"$f":"IF(Linkwahl!AG578=\"\",\"\",Linkwahl!AG578)","v":""},{"$f":"IF(Linkwahl!AH578=\"\",\"\",Linkwahl!AH578)","v":""}]
["",{"$f":"IF(Linkwahl!AG579=\"\",\"\",Linkwahl!AG579)","v":""},{"$f":"IF(Linkwahl!AH579=\"\",\"\",Linkwahl!AH579)","v":""}]
["",{"$f":"IF(Linkwahl!AG580=\"\",\"\",Linkwahl!AG580)","v":""},{"$f":"IF(Linkwahl!AH580=\"\",\"\",Linkwahl!AH580)","v":""}]
["",{"$f":"IF(Linkwahl!AG581=\"\",\"\",Linkwahl!AG581)","v":""},{"$f":"IF(Linkwahl!AH581=\"\",\"\",Linkwahl!AH581)","v":""}]
["",{"$f":"IF(Linkwahl!AG582=\"\",\"\",Linkwahl!AG582)","v":""},{"$f":"IF(Linkwahl!AH582=\"\",\"\",Linkwahl!AH582)","v":""}]
["",{"$f":"IF(Linkwahl!AG583=\"\",\"\",Linkwahl!AG583)","v":""},{"$f":"IF(Linkwahl!AH583=\"\",\"\",Linkwahl!AH583)","v":""}]
["",{"$f":"IF(Linkwahl!AG584=\"\",\"\",Linkwahl!AG584)","v":""},{"$f":"IF(Linkwahl!AH584=\"\",\"\",Linkwahl!AH584)","v":""}]
["",{"$f":"IF(Linkwahl!AG585=\"\",\"\",Linkwahl!AG585)","v":""},{"$f":"IF(Linkwahl!AH585=\"\",\"\",Linkwahl!AH585)","v":""}]
["",{"$f":"IF(Linkwahl!AG586=\"\",\"\",Linkwahl!AG586)","v":""},{"$f":"IF(Linkwahl!AH586=\"\",\"\",Linkwahl!AH586)","v":""}]
["",{"$f":"IF(Linkwahl!AG587=\"\",\"\",Linkwahl!AG587)","v":""},{"$f":"IF(Linkwahl!AH587=\"\",\"\",Linkwahl!AH587)","v":""}]
["",{"$f":"IF(Linkwahl!AG588=\"\",\"\",Linkwahl!AG588)","v":""},{"$f":"IF(Linkwahl!AH588=\"\",\"\",Linkwahl!AH588)","v":""}]
["",{"$f":"IF(Linkwahl!AG589=\"\",\"\",Linkwahl!AG589)","v":""},{"$f":"IF(Linkwahl!AH589=\"\",\"\",Linkwahl!AH589)","v":""}]

{"sheet":"LS ZH Abk.","index":4,"n_rows":402,"n_cols":4,"rows_kept":402,"cut":false,"hidden":false,"merged":[]}
[null,"Abkürzungen Vorschriften Kanton Zürich (LS)"]
[{"$f":"COUNTA(A3:A402)-COUNTBLANK(A3:A402)","v":79},"Abk.","LS-Nummer","Kurzbezeichnung "]
[{"$f":"IF(B3=\"\",\"\",HYPERLINK(\"http://www.zhlex.zh.ch/Erlass.html?Open&Ordnr=\"&C3,\"LS-Link\"))","v":"LS-Link"},{"$f":"IF(Linkwahl!AI133=\"\",\"\",CELL(\"Inhalt\",Linkwahl!AI133))","v":"AnwG"},{"$f":"IF(Linkwahl!AJ133=\"\",\"\",CELL(\"Inhalt\",Linkwahl!AJ133))","v":"215.1"},{"$f":"IF(Linkwahl!AK133=\"\",\"\",CELL(\"Inhalt\",Linkwahl!AK133))","v":"Anwaltsgesetz"}]
[{"$f":"IF(B4=\"\",\"\",HYPERLINK(\"http://www.zhlex.zh.ch/Erlass.html?Open&Ordnr=\"&C4,\"LS-Link\"))","v":"LS-Link"},{"$f":"IF(Linkwahl!AI134=\"\",\"\",CELL(\"Inhalt\",Linkwahl!AI134))","v":"AnwGebV"},{"$f":"IF(Linkwahl!AJ134=\"\",\"\",CELL(\"Inhalt\",Linkwahl!AJ134))","v":"215.3"},{"$f":"IF(Linkwahl!AK134=\"\",\"\",CELL(\"Inhalt\",Linkwahl!AK134))","v":"Anwaltsgebührenverordnung"}]
["LS-Link",{"$f":"IF(Linkwahl!AI135=\"\",\"\",CELL(\"Inhalt\",Linkwahl!AI135))","v":"AnwPrüfV"},{"$f":"IF(Linkwahl!AJ135=\"\",\"\",CELL(\"Inhalt\",Linkwahl!AJ135))","v":"215.11"},{"$f":"IF(Linkwahl!AK135=\"\",\"\",CELL(\"Inhalt\",Linkwahl!AK135))","v":"VO über die Fähigkeitsprüfung zum Anwaltsberuf"}]
["LS-Link",{"$f":"IF(Linkwahl!AI136=\"\",\"\",CELL(\"Inhalt\",Linkwahl!AI136))","v":"BiG"},{"$f":"IF(Linkwahl!AJ136=\"\",\"\",CELL(\"Inhalt\",Linkwahl!AJ136))","v":"410.1"},{"$f":"IF(Linkwahl!AK136=\"\",\"\",CELL(\"Inhalt\",Linkwahl!AK136))","v":"Bildungsgesetz"}]
["LS-Link",{"$f":"IF(Linkwahl!AI137=\"\",\"\",CELL(\"Inhalt\",Linkwahl!AI137))","v":"BüV"},{"$f":"IF(Linkwahl!AJ137=\"\",\"\",CELL(\"Inhalt\",Linkwahl!AJ137))","v":"141.11"},{"$f":"IF(Linkwahl!AK137=\"\",\"\",CELL(\"Inhalt\",Linkwahl!AK137))","v":"Bürgerrechtsverordnung"}]
["LS-Link",{"$f":"IF(Linkwahl!AI138=\"\",\"\",CELL(\"Inhalt\",Linkwahl!AI138))","v":"BVKG"},{"$f":"IF(Linkwahl!AJ138=\"\",\"\",CELL(\"Inhalt\",Linkwahl!AJ138))","v":"172.2"},{"$f":"IF(Linkwahl!AK138=\"\",\"\",CELL(\"Inhalt\",Linkwahl!AK138))","v":"G über Versicherungskasse Staatspersonal"}]
["LS-Link",{"$f":"IF(Linkwahl!AI139=\"\",\"\",CELL(\"Inhalt\",Linkwahl!AI139))","v":"BVK-Statut"},{"$f":"IF(Linkwahl!AJ139=\"\",\"\",CELL(\"Inhalt\",Linkwahl!AJ139))","v":"172.21"},{"$f":"IF(Linkwahl!AK139=\"\",\"\",CELL(\"Inhalt\",Linkwahl!AK139))","v":"Statuten Versicherungskasse Staatspersonal"}]
["LS-Link",{"$f":"IF(Linkwahl!AI140=\"\",\"\",CELL(\"Inhalt\",Linkwahl!AI140))","v":"EG AHVG/IVG"},{"$f":"IF(Linkwahl!AJ140=\"\",\"\",CELL(\"Inhalt\",Linkwahl!AJ140))","v":831.1},{"$f":"IF(Linkwahl!AK140=\"\",\"\",CELL(\"Inhalt\",Linkwahl!AK140))","v":"EG zum AHVG"}]
["LS-Link",{"$f":"IF(Linkwahl!AI141=\"\",\"\",CELL(\"Inhalt\",Linkwahl!AI141))","v":"EG AVIG"},{"$f":"IF(Linkwahl!AJ141=\"\",\"\",CELL(\"Inhalt\",Linkwahl!AJ141))","v":"837.1"},{"$f":"IF(Linkwahl!AK141=\"\",\"\",CELL(\"Inhalt\",Linkwahl!AK141))","v":"EG zum AVIG"}]
["LS-Link",{"$f":"IF(Linkwahl!AI142=\"\",\"\",CELL(\"Inhalt\",Linkwahl!AI142))","v":"EG BewG"},{"$f":"IF(Linkwahl!AJ142=\"\",\"\",CELL(\"Inhalt\",Linkwahl!AJ142))","v":"234.1"},{"$f":"IF(Linkwahl!AK142=\"\",\"\",CELL(\"Inhalt\",Linkwahl!AK142))","v":"EG zum BG Erwerb Grundstücke Personen im Ausland"}]
["LS-Link",{"$f":"IF(Linkwahl!AI143=\"\",\"\",CELL(\"Inhalt\",Linkwahl!AI143))","v":"EG FamZG"},{"$f":"IF(Linkwahl!AJ143=\"\",\"\",CELL(\"Inhalt\",Linkwahl!AJ143))","v":"836.1"},{"$f":"IF(Linkwahl!AK143=\"\",\"\",CELL(\"Inhalt\",Linkwahl!AK143))","v":"EinführungsG zum Familienzulagengesetz"}]
["LS-Link",{"$f":"IF(Linkwahl!AI144=\"\",\"\",CELL(\"Inhalt\",Linkwahl!AI144))","v":"EG GlG"},{"$f":"IF(Linkwahl!AJ144=\"\",\"\",CELL(\"Inhalt\",Linkwahl!AJ144))","v":151},{"$f":"IF(Linkwahl!AK144=\"\",\"\",CELL(\"Inhalt\",Linkwahl!AK144))","v":"EG zum Gleichstellungsgesetz"}]
["LS-Link",{"$f":"IF(Linkwahl!AI145=\"\",\"\",CELL(\"Inhalt\",Linkwahl!AI145))","v":"EG KVG"},{"$f":"IF(Linkwahl!AJ145=\"\",\"\",CELL(\"Inhalt\",Linkwahl!AJ145))","v":"832.01"},{"$f":"IF(Linkwahl!AK145=\"\",\"\",CELL(\"Inhalt\",Linkwahl!AK145))","v":"EG zum Krankenversicherungsgesetz"}]
["LS-Link",{"$f":"IF(Linkwahl!AI146=\"\",\"\",CELL(\"Inhalt\",Linkwahl!AI146))","v":"EG OHG"},{"$f":"IF(Linkwahl!AJ146=\"\",\"\",CELL(\"Inhalt\",Linkwahl!AJ146))","v":"341"},{"$f":"IF(Linkwahl!AK146=\"\",\"\",CELL(\"Inhalt\",Linkwahl!AK146))","v":"EG zum Opferhilfegesetz"}]
["LS-Link",{"$f":"IF(Linkwahl!AI147=\"\",\"\",CELL(\"Inhalt\",Linkwahl!AI147))","v":"EG ZGB"},{"$f":"IF(Linkwahl!AJ147=\"\",\"\",CELL(\"Inhalt\",Linkwahl!AJ147))","v":"230"},{"$f":"IF(Linkwahl!AK147=\"\",\"\",CELL(\"Inhalt\",Linkwahl!AK147))","v":"EG zum ZGB"}]
["LS-Link",{"$f":"IF(Linkwahl!AI148=\"\",\"\",CELL(\"Inhalt\",Linkwahl!AI148))","v":"ESchG"},{"$f":"IF(Linkwahl!AJ148=\"\",\"\",CELL(\"Inhalt\",Linkwahl!AJ148))","v":632.1},{"$f":"IF(Linkwahl!AK148=\"\",\"\",CELL(\"Inhalt\",Linkwahl!AK148))","v":"Erbschafts- und Schenkungssteuergesetz"}]
["LS-Link",{"$f":"IF(Linkwahl!AI149=\"\",\"\",CELL(\"Inhalt\",Linkwahl!AI149))","v":"GebV OG"},{"$f":"IF(Linkwahl!AJ149=\"\",\"\",CELL(\"Inhalt\",Linkwahl!AJ149))","v":"211.11"},{"$f":"IF(Linkwahl!AK149=\"\",\"\",CELL(\"Inhalt\",Linkwahl!AK149))","v":"Gebührenverordnung Obergericht"}]
["LS-Link",{"$f":"IF(Linkwahl!AI150=\"\",\"\",CELL(\"Inhalt\",Linkwahl!AI150))","v":"GebV StrV"},{"$f":"IF(Linkwahl!AJ150=\"\",\"\",CELL(\"Inhalt\",Linkwahl!AJ150))","v":"323.1"},{"$f":"IF(Linkwahl!AK150=\"\",\"\",CELL(\"Inhalt\",Linkwahl!AK150))","v":"Gebührenverordnung Strafverfolgungsbehörden"}]
["LS-Link",{"$f":"IF(Linkwahl!AI151=\"\",\"\",CELL(\"Inhalt\",Linkwahl!AI151))","v":"GebV VGr"},{"$f":"IF(Linkwahl!AJ151=\"\",\"\",CELL(\"Inhalt\",Linkwahl!AJ151))","v":"175.252"},{"$f":"IF(Linkwahl!AK151=\"\",\"\",CELL(\"Inhalt\",Linkwahl!AK151))","v":"Gebührenverordnung Verwaltungsgericht"}]
["LS-Link",{"$f":"IF(Linkwahl!AI152=\"\",\"\",CELL(\"Inhalt\",Linkwahl!AI152))","v":"GG"},{"$f":"IF(Linkwahl!AJ152=\"\",\"\",CELL(\"Inhalt\",Linkwahl!AJ152))","v":131.1},{"$f":"IF(Linkwahl!AK152=\"\",\"\",CELL(\"Inhalt\",Linkwahl!AK152))","v":"Gemeindegesetz"}]
["LS-Link",{"$f":"IF(Linkwahl!AI153=\"\",\"\",CELL(\"Inhalt\",Linkwahl!AI153))","v":"GOG"},{"$f":"IF(Linkwahl!AJ153=\"\",\"\",CELL(\"Inhalt\",Linkwahl!AJ153))","v":"211.1"},{"$f":"IF(Linkwahl!AK153=\"\",\"\",CELL(\"Inhalt\",Linkwahl!AK153))","v":"Gerichtsorganisationsgesetz"}]
["LS-Link",{"$f":"IF(Linkwahl!AI154=\"\",\"\",CELL(\"Inhalt\",Linkwahl!AI154))","v":"GPR"},{"$f":"IF(Linkwahl!AJ154=\"\",\"\",CELL(\"Inhalt\",Linkwahl!AJ154))","v":161},{"$f":"IF(Linkwahl!AK154=\"\",\"\",CELL(\"Inhalt\",Linkwahl!AK154))","v":"G über die politischen Rechte"}]
["LS-Link",{"$f":"IF(Linkwahl!AI155=\"\",\"\",CELL(\"Inhalt\",Linkwahl!AI155))","v":"GSG"},{"$f":"IF(Linkwahl!AJ155=\"\",\"\",CELL(\"Inhalt\",Linkwahl!AJ155))","v":"351"},{"$f":"IF(Linkwahl!AK155=\"\",\"\",CELL(\"Inhalt\",Linkwahl!AK155))","v":"Gewaltsschutzgesetz"}]
["LS-Link",{"$f":"IF(Linkwahl!AI156=\"\",\"\",CELL(\"Inhalt\",Linkwahl!AI156))","v":"GSVGer"},{"$f":"IF(Linkwahl!AJ156=\"\",\"\",CELL(\"Inhalt\",Linkwahl!AJ156))","v":"351.3"},{"$f":"IF(Linkwahl!AK156=\"\",\"\",CELL(\"Inhalt\",Linkwahl!AK156))","v":"VO zum Gewaltsschutzsgesetz"}]
["LS-Link",{"$f":"IF(Linkwahl!AI157=\"\",\"\",CELL(\"Inhalt\",Linkwahl!AI157))","v":"GSVGer"},{"$f":"IF(Linkwahl!AJ157=\"\",\"\",CELL(\"Inhalt\",Linkwahl!AJ157))","v":"212.81"},{"$f":"IF(Linkwahl!AK157=\"\",\"\",CELL(\"Inhalt\",Linkwahl!AK157))","v":"G über das Sozialversicherungsgericht"}]
["LS-Link",{"$f":"IF(Linkwahl!AI158=\"\",\"\",CELL(\"Inhalt\",Linkwahl!AI158))","v":"IDG"},{"$f":"IF(Linkwahl!AJ158=\"\",\"\",CELL(\"Inhalt\",Linkwahl!AJ158))","v":"170.4"},{"$f":"IF(Linkwahl!AK158=\"\",\"\",CELL(\"Inhalt\",Linkwahl!AK158))","v":"G über die Information und den Datenschutz"}]
["LS-Link",{"$f":"IF(Linkwahl!AI159=\"\",\"\",CELL(\"Inhalt\",Linkwahl!AI159))","v":"IDV"},{"$f":"IF(Linkwahl!AJ159=\"\",\"\",CELL(\"Inhalt\",Linkwahl!AJ159))","v":"170.41"},{"$f":"IF(Linkwahl!AK159=\"\",\"\",CELL(\"Inhalt\",Linkwahl!AK159))","v":"VO über die Information und den Datenschutz"}]
["LS-Link",{"$f":"IF(Linkwahl!AI160=\"\",\"\",CELL(\"Inhalt\",Linkwahl!AI160))","v":"JHG"},{"$f":"IF(Linkwahl!AJ160=\"\",\"\",CELL(\"Inhalt\",Linkwahl!AJ160))","v":"852.1"},{"$f":"IF(Linkwahl!AK160=\"\",\"\",CELL(\"Inhalt\",Linkwahl!AK160))","v":"Jugendhilfegesetz"}]
["LS-Link",{"$f":"IF(Linkwahl!AI161=\"\",\"\",CELL(\"Inhalt\",Linkwahl!AI161))","v":"JStrV"},{"$f":"IF(Linkwahl!AJ161=\"\",\"\",CELL(\"Inhalt\",Linkwahl!AJ161))","v":"322"},{"$f":"IF(Linkwahl!AK161=\"\",\"\",CELL(\"Inhalt\",Linkwahl!AK161))","v":"VO über die Jugendstrafrechtspflege"}]
["LS-Link",{"$f":"IF(Linkwahl!AI162=\"\",\"\",CELL(\"Inhalt\",Linkwahl!AI162))","v":"JVV"},{"$f":"IF(Linkwahl!AJ162=\"\",\"\",CELL(\"Inhalt\",Linkwahl!AJ162))","v":"331.1"},{"$f":"IF(Linkwahl!AK162=\"\",\"\",CELL(\"Inhalt\",Linkwahl!AK162))","v":"Justizvollzugsverordnung"}]
["LS-Link",{"$f":"IF(Linkwahl!AI163=\"\",\"\",CELL(\"Inhalt\",Linkwahl!AI163))","v":"KGBV"},{"$f":"IF(Linkwahl!AJ163=\"\",\"\",CELL(\"Inhalt\",Linkwahl!AJ163))","v":"252"},{"$f":"IF(Linkwahl!AK163=\"\",\"\",CELL(\"Inhalt\",Linkwahl!AK163))","v":"Kantonale Grundbuchverordnung"}]
["LS-Link",{"$f":"IF(Linkwahl!AI164=\"\",\"\",CELL(\"Inhalt\",Linkwahl!AI164))","v":"KRG"},{"$f":"IF(Linkwahl!AJ164=\"\",\"\",CELL(\"Inhalt\",Linkwahl!AJ164))","v":171.1},{"$f":"IF(Linkwahl!AK164=\"\",\"\",CELL(\"Inhalt\",Linkwahl!AK164))","v":"Kantonsratsgesetz"}]
["LS-Link",{"$f":"IF(Linkwahl!AI165=\"\",\"\",CELL(\"Inhalt\",Linkwahl!AI165))","v":"KV"},{"$f":"IF(Linkwahl!AJ165=\"\",\"\",CELL(\"Inhalt\",Linkwahl!AJ165))","v":101},{"$f":"IF(Linkwahl!AK165=\"\",\"\",CELL(\"Inhalt\",Linkwahl!AK165))","v":"Verfassung des Kantons Zürich "}]
["LS-Link",{"$f":"IF(Linkwahl!AI166=\"\",\"\",CELL(\"Inhalt\",Linkwahl!AI166))","v":"KZG"},{"$f":"IF(Linkwahl!AJ166=\"\",\"\",CELL(\"Inhalt\",Linkwahl!AJ166))","v":"836.1"},{"$f":"IF(Linkwahl!AK166=\"\",\"\",CELL(\"Inhalt\",Linkwahl!AK166))","v":"Kinderzulagengesetz"}]
["LS-Link",{"$f":"IF(Linkwahl!AI167=\"\",\"\",CELL(\"Inhalt\",Linkwahl!AI167))","v":"LG"},{"$f":"IF(Linkwahl!AJ167=\"\",\"\",CELL(\"Inhalt\",Linkwahl!AJ167))","v":910.1},{"$f":"IF(Linkwahl!AK167=\"\",\"\",CELL(\"Inhalt\",Linkwahl!AK167))","v":"Landwirtschaftsgesetz"}]
["LS-Link",{"$f":"IF(Linkwahl!AI168=\"\",\"\",CELL(\"Inhalt\",Linkwahl!AI168))","v":"LPG"},{"$f":"IF(Linkwahl!AJ168=\"\",\"\",CELL(\"Inhalt\",Linkwahl!AJ168))","v":412.31},{"$f":"IF(Linkwahl!AK168=\"\",\"\",CELL(\"Inhalt\",Linkwahl!AK168))","v":"Lehrpersonalgesetz"}]
["LS-Link",{"$f":"IF(Linkwahl!AI169=\"\",\"\",CELL(\"Inhalt\",Linkwahl!AI169))","v":"LPVO"},{"$f":"IF(Linkwahl!AJ169=\"\",\"\",CELL(\"Inhalt\",Linkwahl!AJ169))","v":"412.311"},{"$f":"IF(Linkwahl!AK169=\"\",\"\",CELL(\"Inhalt\",Linkwahl!AK169))","v":"Lehrpersonalverordnung"}]
[{"$f":"IF(B40=\"\",\"\",HYPERLINK(\"http://www.zhlex.zh.ch/Erlass.html?Open&Ordnr=\"&C40,\"LS-Link\"))","v":"LS-Link"},{"$f":"IF(Linkwahl!AI170=\"\",\"\",CELL(\"Inhalt\",Linkwahl!AI170))","v":"NAV Hausw"},{"$f":"IF(Linkwahl!AJ170=\"\",\"\",CELL(\"Inhalt\",Linkwahl!AJ170))","v":821.12},{"$f":"IF(Linkwahl!AK170=\"\",\"\",CELL(\"Inhalt\",Linkwahl!AK170))","v":"NAV für hauswirtschaftliche Arbeitnehmer"}]
[{"$f":"IF(B41=\"\",\"\",HYPERLINK(\"http://www.zhlex.zh.ch/Erlass.html?Open&Ordnr=\"&C41,\"LS-Link\"))","v":"LS-Link"},{"$f":"IF(Linkwahl!AI172=\"\",\"\",CELL(\"Inhalt\",Linkwahl!AI172))","v":"NAV Landw"},{"$f":"IF(Linkwahl!AJ172=\"\",\"\",CELL(\"Inhalt\",Linkwahl!AJ172))","v":821.13},{"$f":"IF(Linkwahl!AK172=\"\",\"\",CELL(\"Inhalt\",Linkwahl!AK172))","v":"NAV für das landwirtschaftliche Arbeitsverhältnis"}]
["LS-Link",{"$f":"IF(Linkwahl!AI173=\"\",\"\",CELL(\"Inhalt\",Linkwahl!AI173))","v":"NofV"},{"$f":"IF(Linkwahl!AJ173=\"\",\"\",CELL(\"Inhalt\",Linkwahl!AJ173))","v":"242.2"},{"$f":"IF(Linkwahl!AK173=\"\",\"\",CELL(\"Inhalt\",Linkwahl!AK173))","v":"Notariatsverordnung"}]
["LS-Link",{"$f":"IF(Linkwahl!AI174=\"\",\"\",CELL(\"Inhalt\",Linkwahl!AI174))","v":"NotG"},{"$f":"IF(Linkwahl!AJ174=\"\",\"\",CELL(\"Inhalt\",Linkwahl!AJ174))","v":"242"},{"$f":"IF(Linkwahl!AK174=\"\",\"\",CELL(\"Inhalt\",Linkwahl!AK174))","v":"Notariatsgesetz"}]
["LS-Link",{"$f":"IF(Linkwahl!AI175=\"\",\"\",CELL(\"Inhalt\",Linkwahl!AI175))","v":"NotGebV"},{"$f":"IF(Linkwahl!AJ175=\"\",\"\",CELL(\"Inhalt\",Linkwahl!AJ175))","v":"243"},{"$f":"IF(Linkwahl!AK175=\"\",\"\",CELL(\"Inhalt\",Linkwahl!AK175))","v":"Notariatsgebührenverordnung"}]
["LS-Link",{"$f":"IF(Linkwahl!AI176=\"\",\"\",CELL(\"Inhalt\",Linkwahl!AI176))","v":"OG RR"},{"$f":"IF(Linkwahl!AJ176=\"\",\"\",CELL(\"Inhalt\",Linkwahl!AJ176))","v":172.1},{"$f":"IF(Linkwahl!AK176=\"\",\"\",CELL(\"Inhalt\",Linkwahl!AK176))","v":"G über die Organisation des RR + Verwaltung"}]
["LS-Link",{"$f":"IF(Linkwahl!AI177=\"\",\"\",CELL(\"Inhalt\",Linkwahl!AI177))","v":"OHV"},{"$f":"IF(Linkwahl!AJ177=\"\",\"\",CELL(\"Inhalt\",Linkwahl!AJ177))","v":"341.1"},{"$f":"IF(Linkwahl!AK177=\"\",\"\",CELL(\"Inhalt\",Linkwahl!AK177))","v":"Kantonale Opferhilfeverordnung"}]
["LS-Link",{"$f":"IF(Linkwahl!AI178=\"\",\"\",CELL(\"Inhalt\",Linkwahl!AI178))","v":"PBG"},{"$f":"IF(Linkwahl!AJ178=\"\",\"\",CELL(\"Inhalt\",Linkwahl!AJ178))","v":700.1},{"$f":"IF(Linkwahl!AK178=\"\",\"\",CELL(\"Inhalt\",Linkwahl!AK178))","v":"Planungs- und Baugesetz"}]
["LS-Link",{"$f":"IF(Linkwahl!AI179=\"\",\"\",CELL(\"Inhalt\",Linkwahl!AI179))","v":"PG"},{"$f":"IF(Linkwahl!AJ179=\"\",\"\",CELL(\"Inhalt\",Linkwahl!AJ179))","v":"177.10"},{"$f":"IF(Linkwahl!AK179=\"\",\"\",CELL(\"Inhalt\",Linkwahl!AK179))","v":"Personalgesetz"}]
["LS-Link",{"$f":"IF(Linkwahl!AI180=\"\",\"\",CELL(\"Inhalt\",Linkwahl!AI180))","v":"PHG"},{"$f":"IF(Linkwahl!AJ180=\"\",\"\",CELL(\"Inhalt\",Linkwahl!AJ180))","v":414.41},{"$f":"IF(Linkwahl!AK180=\"\",\"\",CELL(\"Inhalt\",Linkwahl!AK180))","v":"G über die Pädagogische Hochschule"}]
["LS-Link",{"$f":"IF(Linkwahl!AI181=\"\",\"\",CELL(\"Inhalt\",Linkwahl!AI181))","v":"POG"},{"$f":"IF(Linkwahl!AJ181=\"\",\"\",CELL(\"Inhalt\",Linkwahl!AJ181))","v":551.1},{"$f":"IF(Linkwahl!AK181=\"\",\"\",CELL(\"Inhalt\",Linkwahl!AK181))","v":"Polizeiorganisationsgesetz"}]
["LS-Link",{"$f":"IF(Linkwahl!AI182=\"\",\"\",CELL(\"Inhalt\",Linkwahl!AI182))","v":"PublG"},{"$f":"IF(Linkwahl!AJ182=\"\",\"\",CELL(\"Inhalt\",Linkwahl!AJ182))","v":"170.5"},{"$f":"IF(Linkwahl!AK182=\"\",\"\",CELL(\"Inhalt\",Linkwahl!AK182))","v":"Publikationsgesetz"}]
["LS-Link",{"$f":"IF(Linkwahl!AI183=\"\",\"\",CELL(\"Inhalt\",Linkwahl!AI183))","v":"PublV"},{"$f":"IF(Linkwahl!AJ183=\"\",\"\",CELL(\"Inhalt\",Linkwahl!AJ183))","v":"170.51"},{"$f":"IF(Linkwahl!AK183=\"\",\"\",CELL(\"Inhalt\",Linkwahl!AK183))","v":"Publikationsverordnung"}]
["LS-Link",{"$f":"IF(Linkwahl!AI184=\"\",\"\",CELL(\"Inhalt\",Linkwahl!AI184))","v":"PVO"},{"$f":"IF(Linkwahl!AJ184=\"\",\"\",CELL(\"Inhalt\",Linkwahl!AJ184))","v":177.11},{"$f":"IF(Linkwahl!AK184=\"\",\"\",CELL(\"Inhalt\",Linkwahl!AK184))","v":"Personalverordnung"}]
["LS-Link",{"$f":"IF(Linkwahl!AI185=\"\",\"\",CELL(\"Inhalt\",Linkwahl!AI185))","v":"RLG"},{"$f":"IF(Linkwahl!AJ185=\"\",\"\",CELL(\"Inhalt\",Linkwahl!AJ185))","v":822.4},{"$f":"IF(Linkwahl!AK185=\"\",\"\",CELL(\"Inhalt\",Linkwahl!AK185))","v":"Ruhetags- und Ladenöffnungsgesetz"}]
["LS-Link",{"$f":"IF(Linkwahl!AI186=\"\",\"\",CELL(\"Inhalt\",Linkwahl!AI186))","v":"SchlVerf GLG"},{"$f":"IF(Linkwahl!AJ186=\"\",\"\",CELL(\"Inhalt\",Linkwahl!AJ186))","v":"177.12"},{"$f":"IF(Linkwahl!AK186=\"\",\"\",CELL(\"Inhalt\",Linkwahl!AK186))","v":"Schlichtungsverfahren für Streitigkeiten nach GlG"}]
["LS-Link",{"$f":"IF(Linkwahl!AI187=\"\",\"\",CELL(\"Inhalt\",Linkwahl!AI187))","v":"SHG"},{"$f":"IF(Linkwahl!AJ187=\"\",\"\",CELL(\"Inhalt\",Linkwahl!AJ187))","v":851.1},{"$f":"IF(Linkwahl!AK187=\"\",\"\",CELL(\"Inhalt\",Linkwahl!AK187))","v":"Sozialhilfegesetz"}]
["LS-Link",{"$f":"IF(Linkwahl!AI189=\"\",\"\",CELL(\"Inhalt\",Linkwahl!AI189))","v":"SHV"},{"$f":"IF(Linkwahl!AJ189=\"\",\"\",CELL(\"Inhalt\",Linkwahl!AJ189))","v":"851.11"},{"$f":"IF(Linkwahl!AK189=\"\",\"\",CELL(\"Inhalt\",Linkwahl!AK189))","v":"Sozialhilfeverordnung"}]
["LS-Link",{"$f":"IF(Linkwahl!AI190=\"\",\"\",CELL(\"Inhalt\",Linkwahl!AI190))","v":"StG"},{"$f":"IF(Linkwahl!AJ190=\"\",\"\",CELL(\"Inhalt\",Linkwahl!AJ190))","v":631.1},{"$f":"IF(Linkwahl!AK190=\"\",\"\",CELL(\"Inhalt\",Linkwahl!AK190))","v":"Steuergesetz"}]
["LS-Link",{"$f":"IF(Linkwahl!AI191=\"\",\"\",CELL(\"Inhalt\",Linkwahl!AI191))","v":"StJVG"},{"$f":"IF(Linkwahl!AJ191=\"\",\"\",CELL(\"Inhalt\",Linkwahl!AJ191))","v":331},{"$f":"IF(Linkwahl!AK191=\"\",\"\",CELL(\"Inhalt\",Linkwahl!AK191))","v":"Straf- und Justizvollzugsgesetz"}]
["LS-Link",{"$f":"IF(Linkwahl!AI192=\"\",\"\",CELL(\"Inhalt\",Linkwahl!AI192))","v":"StrG"},{"$f":"IF(Linkwahl!AJ192=\"\",\"\",CELL(\"Inhalt\",Linkwahl!AJ192))","v":722.1},{"$f":"IF(Linkwahl!AK192=\"\",\"\",CELL(\"Inhalt\",Linkwahl!AK192))","v":"Strassengesetz"}]
[{"$f":"IF(B61=\"\",\"\",HYPERLINK(\"http://www.zhlex.zh.ch/Erlass.html?Open&Ordnr=\"&C61,\"LS-Link\"))","v":"LS-Link"},{"$f":"IF(Linkwahl!AI193=\"\",\"\",CELL(\"Inhalt\",Linkwahl!AI193))","v":"StV"},{"$f":"IF(Linkwahl!AJ193=\"\",\"\",CELL(\"Inhalt\",Linkwahl!AJ193))","v":631.11},{"$f":"IF(Linkwahl!AK193=\"\",\"\",CELL(\"Inhalt\",Linkwahl!AK193))","v":"VO zum Steuergesetz"}]
[{"$f":"IF(B62=\"\",\"\",HYPERLINK(\"http://www.zhlex.zh.ch/Erlass.html?Open&Ordnr=\"&C62,\"LS-Link\"))","v":"LS-Link"},{"$f":"IF(Linkwahl!AI194=\"\",\"\",CELL(\"Inhalt\",Linkwahl!AI194))","v":"UniG"},{"$f":"IF(Linkwahl!AJ194=\"\",\"\",CELL(\"Inhalt\",Linkwahl!AJ194))","v":415.11},{"$f":"IF(Linkwahl!AK194=\"\",\"\",CELL(\"Inhalt\",Linkwahl!AK194))","v":"Universitätsgesetz"}]
["LS-Link",{"$f":"IF(Linkwahl!AI195=\"\",\"\",CELL(\"Inhalt\",Linkwahl!AI195))","v":"VBewG"},{"$f":"IF(Linkwahl!AJ195=\"\",\"\",CELL(\"Inhalt\",Linkwahl!AJ195))","v":"234.1"},{"$f":"IF(Linkwahl!AK195=\"\",\"\",CELL(\"Inhalt\",Linkwahl!AK195))","v":"VO zum EG BewG"}]
["LS-Link",{"$f":"IF(Linkwahl!AI196=\"\",\"\",CELL(\"Inhalt\",Linkwahl!AI196))","v":"VBG"},{"$f":"IF(Linkwahl!AJ196=\"\",\"\",CELL(\"Inhalt\",Linkwahl!AJ196))","v":"281.1"},{"$f":"IF(Linkwahl!AK196=\"\",\"\",CELL(\"Inhalt\",Linkwahl!AK196))","v":"VO über Betreibungs- und Gemeindeammannämter"}]
["LS-Link",{"$f":"IF(Linkwahl!AI197=\"\",\"\",CELL(\"Inhalt\",Linkwahl!AI197))","v":"VO ArG"},{"$f":"IF(Linkwahl!AJ197=\"\",\"\",CELL(\"Inhalt\",Linkwahl!AJ197))","v":822.1},{"$f":"IF(Linkwahl!AK197=\"\",\"\",CELL(\"Inhalt\",Linkwahl!AK197))","v":"VO zum Arbeitsgesetz"}]
["LS-Link",{"$f":"IF(Linkwahl!AI198=\"\",\"\",CELL(\"Inhalt\",Linkwahl!AI198))","v":"VO AVEG"},{"$f":"IF(Linkwahl!AJ198=\"\",\"\",CELL(\"Inhalt\",Linkwahl!AJ198))","v":"821.11"},{"$f":"IF(Linkwahl!AK198=\"\",\"\",CELL(\"Inhalt\",Linkwahl!AK198))","v":"VO über den Vollzug des AVEG"}]
["LS-Link",{"$f":"IF(Linkwahl!AI199=\"\",\"\",CELL(\"Inhalt\",Linkwahl!AI199))","v":"VO EG AVIG"},{"$f":"IF(Linkwahl!AJ199=\"\",\"\",CELL(\"Inhalt\",Linkwahl!AJ199))","v":"837.11"},{"$f":"IF(Linkwahl!AK199=\"\",\"\",CELL(\"Inhalt\",Linkwahl!AK199))","v":"VO zum EG AVIG"}]
[{"$f":"IF(B68=\"\",\"\",HYPERLINK(\"http://www.zhlex.zh.ch/Erlass.html?Open&Ordnr=\"&C68,\"LS-Link\"))","v":"LS-Link"},{"$f":"IF(Linkwahl!AI200=\"\",\"\",CELL(\"Inhalt\",Linkwahl!AI200))","v":"VO EG KVG"},{"$f":"IF(Linkwahl!AJ200=\"\",\"\",CELL(\"Inhalt\",Linkwahl!AJ200))","v":"832.1"},{"$f":"IF(Linkwahl!AK200=\"\",\"\",CELL(\"Inhalt\",Linkwahl!AK200))","v":"Verordnung zum EG KVG"}]
[{"$f":"IF(B69=\"\",\"\",HYPERLINK(\"http://www.zhlex.zh.ch/Erlass.html?Open&Ordnr=\"&C69,\"LS-Link\"))","v":"LS-Link"},{"$f":"IF(Linkwahl!AI201=\"\",\"\",CELL(\"Inhalt\",Linkwahl!AI201))","v":"VO RLG"},{"$f":"IF(Linkwahl!AJ201=\"\",\"\",CELL(\"Inhalt\",Linkwahl!AJ201))","v":822.41},{"$f":"IF(Linkwahl!AK201=\"\",\"\",CELL(\"Inhalt\",Linkwahl!AK201))","v":"VO zum Ruhetags- und Ladenöffnungsgesetz"}]
["LS-Link",{"$f":"IF(Linkwahl!AI202=\"\",\"\",CELL(\"Inhalt\",Linkwahl!AI202))","v":"VO UVG"},{"$f":"IF(Linkwahl!AJ202=\"\",\"\",CELL(\"Inhalt\",Linkwahl!AJ202))","v":"832.21"},{"$f":"IF(Linkwahl!AK202=\"\",\"\",CELL(\"Inhalt\",Linkwahl!AK202))","v":"VO zum Unfallversicherungsgesetz"}]
["LS-Link",{"$f":"IF(Linkwahl!AI203=\"\",\"\",CELL(\"Inhalt\",Linkwahl!AI203))","v":"VOG RR"},{"$f":"IF(Linkwahl!AJ203=\"\",\"\",CELL(\"Inhalt\",Linkwahl!AJ203))","v":"172.11"},{"$f":"IF(Linkwahl!AK203=\"\",\"\",CELL(\"Inhalt\",Linkwahl!AK203))","v":"VO über die Organisation des RR + Verwaltung"}]
["LS-Link",{"$f":"IF(Linkwahl!AI204=\"\",\"\",CELL(\"Inhalt\",Linkwahl!AI204))","v":"VPR"},{"$f":"IF(Linkwahl!AJ204=\"\",\"\",CELL(\"Inhalt\",Linkwahl!AJ204))","v":161.1},{"$f":"IF(Linkwahl!AK204=\"\",\"\",CELL(\"Inhalt\",Linkwahl!AK204))","v":"VO über die politischen Rechte"}]
["LS-Link",{"$f":"IF(Linkwahl!AI205=\"\",\"\",CELL(\"Inhalt\",Linkwahl!AI205))","v":"VRG"},{"$f":"IF(Linkwahl!AJ205=\"\",\"\",CELL(\"Inhalt\",Linkwahl!AJ205))","v":175.2},{"$f":"IF(Linkwahl!AK205=\"\",\"\",CELL(\"Inhalt\",Linkwahl!AK205))","v":"Verwaltungsrechtspflegegesetz"}]
["LS-Link",{"$f":"IF(Linkwahl!AI206=\"\",\"\",CELL(\"Inhalt\",Linkwahl!AI206))","v":"VSG"},{"$f":"IF(Linkwahl!AJ206=\"\",\"\",CELL(\"Inhalt\",Linkwahl!AJ206))","v":"412.100"},{"$f":"IF(Linkwahl!AK206=\"\",\"\",CELL(\"Inhalt\",Linkwahl!AK206))","v":"Volksschulgesetz"}]
["LS-Link",{"$f":"IF(Linkwahl!AI207=\"\",\"\",CELL(\"Inhalt\",Linkwahl!AI207))","v":"VSV"},{"$f":"IF(Linkwahl!AJ207=\"\",\"\",CELL(\"Inhalt\",Linkwahl!AJ207))","v":"412.101"},{"$f":"IF(Linkwahl!AK207=\"\",\"\",CELL(\"Inhalt\",Linkwahl!AK207))","v":"Volksschulverordnung"}]
["LS-Link",{"$f":"IF(Linkwahl!AI208=\"\",\"\",CELL(\"Inhalt\",Linkwahl!AI208))","v":"VV KZG"},{"$f":"IF(Linkwahl!AJ208=\"\",\"\",CELL(\"Inhalt\",Linkwahl!AJ208))","v":"836.11"},{"$f":"IF(Linkwahl!AK208=\"\",\"\",CELL(\"Inhalt\",Linkwahl!AK208))","v":"VollziehungsVO zum Kinderzulagengesetz"}]
["LS-Link",{"$f":"IF(Linkwahl!AI209=\"\",\"\",CELL(\"Inhalt\",Linkwahl!AI209))","v":"VVO PG"},{"$f":"IF(Linkwahl!AJ209=\"\",\"\",CELL(\"Inhalt\",Linkwahl!AJ209))","v":177.11099999999999},{"$f":"IF(Linkwahl!AK209=\"\",\"\",CELL(\"Inhalt\",Linkwahl!AK209))","v":"VollzugsVO zum Personalgesetz"}]
["LS-Link",{"$f":"IF(Linkwahl!AI210=\"\",\"\",CELL(\"Inhalt\",Linkwahl!AI210))","v":"VVSA"},{"$f":"IF(Linkwahl!AJ210=\"\",\"\",CELL(\"Inhalt\",Linkwahl!AJ210))","v":823.44},{"$f":"IF(Linkwahl!AK210=\"\",\"\",CELL(\"Inhalt\",Linkwahl!AK210))","v":"VollzugsVG zum Schwarzarbeitsgesetz"}]
["LS-Link",{"$f":"IF(Linkwahl!AI211=\"\",\"\",CELL(\"Inhalt\",Linkwahl!AI211))","v":"ZLG"},{"$f":"IF(Linkwahl!AJ211=\"\",\"\",CELL(\"Inhalt\",Linkwahl!AJ211))","v":"831.3"},{"$f":"IF(Linkwahl!AK211=\"\",\"\",CELL(\"Inhalt\",Linkwahl!AK211))","v":"Zusatzleistungengesetz"}]
["LS-Link",{"$f":"IF(Linkwahl!AI212=\"\",\"\",CELL(\"Inhalt\",Linkwahl!AI212))","v":"ZLV"},{"$f":"IF(Linkwahl!AJ212=\"\",\"\",CELL(\"Inhalt\",Linkwahl!AJ212))","v":"831.31"},{"$f":"IF(Linkwahl!AK212=\"\",\"\",CELL(\"Inhalt\",Linkwahl!AK212))","v":"Zusatzleistungsverordnung"}]
["LS-Link",{"$f":"IF(Linkwahl!AI213=\"\",\"\",CELL(\"Inhalt\",Linkwahl!AI213))","v":"ZVO"},{"$f":"IF(Linkwahl!AJ213=\"\",\"\",CELL(\"Inhalt\",Linkwahl!AJ213))","v":231.1},{"$f":"IF(Linkwahl!AK213=\"\",\"\",CELL(\"Inhalt\",Linkwahl!AK213))","v":"Zivilstandsverordnung, Kantonale "}]
[{"$f":"IF(B82=\"\",\"\",HYPERLINK(\"http://www.zhlex.zh.ch/Erlass.html?Open&Ordnr=\"&C82,\"LS-Link\"))","v":""},{"$f":"IF(Linkwahl!AI214=\"\",\"\",CELL(\"Inhalt\",Linkwahl!AI214))","v":""},{"$f":"IF(Linkwahl!AJ214=\"\",\"\",CELL(\"Inhalt\",Linkwahl!AJ214))","v":""},{"$f":"IF(Linkwahl!AK214=\"\",\"\",CELL(\"Inhalt\",Linkwahl!AK214))","v":""}]
["",{"$f":"IF(Linkwahl!AI215=\"\",\"\",CELL(\"Inhalt\",Linkwahl!AI215))","v":""},{"$f":"IF(Linkwahl!AJ215=\"\",\"\",CELL(\"Inhalt\",Linkwahl!AJ215))","v":""},{"$f":"IF(Linkwahl!AK215=\"\",\"\",CELL(\"Inhalt\",Linkwahl!AK215))","v":""}]
["",{"$f":"IF(Linkwahl!AI216=\"\",\"\",CELL(\"Inhalt\",Linkwahl!AI216))","v":""},{"$f":"IF(Linkwahl!AJ216=\"\",\"\",CELL(\"Inhalt\",Linkwahl!AJ216))","v":""},{"$f":"IF(Linkwahl!AK216=\"\",\"\",CELL(\"Inhalt\",Linkwahl!AK216))","v":""}]
["",{"$f":"IF(Linkwahl!AI217=\"\",\"\",CELL(\"Inhalt\",Linkwahl!AI217))","v":""},{"$f":"IF(Linkwahl!AJ217=\"\",\"\",CELL(\"Inhalt\",Linkwahl!AJ217))","v":""},{"$f":"IF(Linkwahl!AK217=\"\",\"\",CELL(\"Inhalt\",Linkwahl!AK217))","v":""}]
["",{"$f":"IF(Linkwahl!AI218=\"\",\"\",CELL(\"Inhalt\",Linkwahl!AI218))","v":""},{"$f":"IF(Linkwahl!AJ218=\"\",\"\",CELL(\"Inhalt\",Linkwahl!AJ218))","v":""},{"$f":"IF(Linkwahl!AK218=\"\",\"\",CELL(\"Inhalt\",Linkwahl!AK218))","v":""}]
["",{"$f":"IF(Linkwahl!AI219=\"\",\"\",CELL(\"Inhalt\",Linkwahl!AI219))","v":""},{"$f":"IF(Linkwahl!AJ219=\"\",\"\",CELL(\"Inhalt\",Linkwahl!AJ219))","v":""},{"$f":"IF(Linkwahl!AK219=\"\",\"\",CELL(\"Inhalt\",Linkwahl!AK219))","v":""}]
[{"$f":"IF(B88=\"\",\"\",HYPERLINK(\"http://www.zhlex.zh.ch/Erlass.html?Open&Ordnr=\"&C88,\"LS-Link\"))","v":""},{"$f":"IF(Linkwahl!AI243=\"\",\"\",CELL(\"Inhalt\",Linkwahl!AI243))","v":""},{"$f":"IF(Linkwahl!AJ243=\"\",\"\",CELL(\"Inhalt\",Linkwahl!AJ243))","v":""},{"$f":"IF(Linkwahl!AK243=\"\",\"\",CELL(\"Inhalt\",Linkwahl!AK243))","v":""}]
["",{"$f":"IF(Linkwahl!AI244=\"\",\"\",CELL(\"Inhalt\",Linkwahl!AI244))","v":""},{"$f":"IF(Linkwahl!AJ244=\"\",\"\",CELL(\"Inhalt\",Linkwahl!AJ244))","v":""},{"$f":"IF(Linkwahl!AK244=\"\",\"\",CELL(\"Inhalt\",Linkwahl!AK244))","v":""}]
["",{"$f":"IF(Linkwahl!AI245=\"\",\"\",CELL(\"Inhalt\",Linkwahl!AI245))","v":""},{"$f":"IF(Linkwahl!AJ245=\"\",\"\",CELL(\"Inhalt\",Linkwahl!AJ245))","v":""},{"$f":"IF(Linkwahl!AK245=\"\",\"\",CELL(\"Inhalt\",Linkwahl!AK245))","v":""}]
["",{"$f":"IF(Linkwahl!AI246=\"\",\"\",CELL(\"Inhalt\",Linkwahl!AI246))","v":""},{"$f":"IF(Linkwahl!AJ246=\"\",\"\",CELL(\"Inhalt\",Linkwahl!AJ246))","v":""},{"$f":"IF(Linkwahl!AK246=\"\",\"\",CELL(\"Inhalt\",Linkwahl!AK246))","v":""}]
["",{"$f":"IF(Linkwahl!AI247=\"\",\"\",CELL(\"Inhalt\",Linkwahl!AI247))","v":""},{"$f":"IF(Linkwahl!AJ247=\"\",\"\",CELL(\"Inhalt\",Linkwahl!AJ247))","v":""},{"$f":"IF(Linkwahl!AK247=\"\",\"\",CELL(\"Inhalt\",Linkwahl!AK247))","v":""}]
["",{"$f":"IF(Linkwahl!AI248=\"\",\"\",CELL(\"Inhalt\",Linkwahl!AI248))","v":""},{"$f":"IF(Linkwahl!AJ248=\"\",\"\",CELL(\"Inhalt\",Linkwahl!AJ248))","v":""},{"$f":"IF(Linkwahl!AK248=\"\",\"\",CELL(\"Inhalt\",Linkwahl!AK248))","v":""}]
["",{"$f":"IF(Linkwahl!AI249=\"\",\"\",CELL(\"Inhalt\",Linkwahl!AI249))","v":""},{"$f":"IF(Linkwahl!AJ249=\"\",\"\",CELL(\"Inhalt\",Linkwahl!AJ249))","v":""},{"$f":"IF(Linkwahl!AK249=\"\",\"\",CELL(\"Inhalt\",Linkwahl!AK249))","v":""}]
["",{"$f":"IF(Linkwahl!AI250=\"\",\"\",CELL(\"Inhalt\",Linkwahl!AI250))","v":""},{"$f":"IF(Linkwahl!AJ250=\"\",\"\",CELL(\"Inhalt\",Linkwahl!AJ250))","v":""},{"$f":"IF(Linkwahl!AK250=\"\",\"\",CELL(\"Inhalt\",Linkwahl!AK250))","v":""}]
["",{"$f":"IF(Linkwahl!AI251=\"\",\"\",CELL(\"Inhalt\",Linkwahl!AI251))","v":""},{"$f":"IF(Linkwahl!AJ251=\"\",\"\",CELL(\"Inhalt\",Linkwahl!AJ251))","v":""},{"$f":"IF(Linkwahl!AK251=\"\",\"\",CELL(\"Inhalt\",Linkwahl!AK251))","v":""}]
["",{"$f":"IF(Linkwahl!AI252=\"\",\"\",CELL(\"Inhalt\",Linkwahl!AI252))","v":""},{"$f":"IF(Linkwahl!AJ252=\"\",\"\",CELL(\"Inhalt\",Linkwahl!AJ252))","v":""},{"$f":"IF(Linkwahl!AK252=\"\",\"\",CELL(\"Inhalt\",Linkwahl!AK252))","v":""}]
["",{"$f":"IF(Linkwahl!AI253=\"\",\"\",CELL(\"Inhalt\",Linkwahl!AI253))","v":""},{"$f":"IF(Linkwahl!AJ253=\"\",\"\",CELL(\"Inhalt\",Linkwahl!AJ253))","v":""},{"$f":"IF(Linkwahl!AK253=\"\",\"\",CELL(\"Inhalt\",Linkwahl!AK253))","v":""}]
["",{"$f":"IF(Linkwahl!AI254=\"\",\"\",CELL(\"Inhalt\",Linkwahl!AI254))","v":""},{"$f":"IF(Linkwahl!AJ254=\"\",\"\",CELL(\"Inhalt\",Linkwahl!AJ254))","v":""},{"$f":"IF(Linkwahl!AK254=\"\",\"\",CELL(\"Inhalt\",Linkwahl!AK254))","v":""}]
["",{"$f":"IF(Linkwahl!AI255=\"\",\"\",CELL(\"Inhalt\",Linkwahl!AI255))","v":""},{"$f":"IF(Linkwahl!AJ255=\"\",\"\",CELL(\"Inhalt\",Linkwahl!AJ255))","v":""},{"$f":"IF(Linkwahl!AK255=\"\",\"\",CELL(\"Inhalt\",Linkwahl!AK255))","v":""}]
["",{"$f":"IF(Linkwahl!AI256=\"\",\"\",CELL(\"Inhalt\",Linkwahl!AI256))","v":""},{"$f":"IF(Linkwahl!AJ256=\"\",\"\",CELL(\"Inhalt\",Linkwahl!AJ256))","v":""},{"$f":"IF(Linkwahl!AK256=\"\",\"\",CELL(\"Inhalt\",Linkwahl!AK256))","v":""}]
["",{"$f":"IF(Linkwahl!AI257=\"\",\"\",CELL(\"Inhalt\",Linkwahl!AI257))","v":""},{"$f":"IF(Linkwahl!AJ257=\"\",\"\",CELL(\"Inhalt\",Linkwahl!AJ257))","v":""},{"$f":"IF(Linkwahl!AK257=\"\",\"\",CELL(\"Inhalt\",Linkwahl!AK257))","v":""}]
["",{"$f":"IF(Linkwahl!AI258=\"\",\"\",CELL(\"Inhalt\",Linkwahl!AI258))","v":""},{"$f":"IF(Linkwahl!AJ258=\"\",\"\",CELL(\"Inhalt\",Linkwahl!AJ258))","v":""},{"$f":"IF(Linkwahl!AK258=\"\",\"\",CELL(\"Inhalt\",Linkwahl!AK258))","v":""}]
["",{"$f":"IF(Linkwahl!AI259=\"\",\"\",CELL(\"Inhalt\",Linkwahl!AI259))","v":""},{"$f":"IF(Linkwahl!AJ259=\"\",\"\",CELL(\"Inhalt\",Linkwahl!AJ259))","v":""},{"$f":"IF(Linkwahl!AK259=\"\",\"\",CELL(\"Inhalt\",Linkwahl!AK259))","v":""}]
["",{"$f":"IF(Linkwahl!AI260=\"\",\"\",CELL(\"Inhalt\",Linkwahl!AI260))","v":""},{"$f":"IF(Linkwahl!AJ260=\"\",\"\",CELL(\"Inhalt\",Linkwahl!AJ260))","v":""},{"$f":"IF(Linkwahl!AK260=\"\",\"\",CELL(\"Inhalt\",Linkwahl!AK260))","v":""}]
["",{"$f":"IF(Linkwahl!AI261=\"\",\"\",CELL(\"Inhalt\",Linkwahl!AI261))","v":""},{"$f":"IF(Linkwahl!AJ261=\"\",\"\",CELL(\"Inhalt\",Linkwahl!AJ261))","v":""},{"$f":"IF(Linkwahl!AK261=\"\",\"\",CELL(\"Inhalt\",Linkwahl!AK261))","v":""}]
["",{"$f":"IF(Linkwahl!AI262=\"\",\"\",CELL(\"Inhalt\",Linkwahl!AI262))","v":""},{"$f":"IF(Linkwahl!AJ262=\"\",\"\",CELL(\"Inhalt\",Linkwahl!AJ262))","v":""},{"$f":"IF(Linkwahl!AK262=\"\",\"\",CELL(\"Inhalt\",Linkwahl!AK262))","v":""}]
["",{"$f":"IF(Linkwahl!AI263=\"\",\"\",CELL(\"Inhalt\",Linkwahl!AI263))","v":""},{"$f":"IF(Linkwahl!AJ263=\"\",\"\",CELL(\"Inhalt\",Linkwahl!AJ263))","v":""},{"$f":"IF(Linkwahl!AK263=\"\",\"\",CELL(\"Inhalt\",Linkwahl!AK263))","v":""}]
["",{"$f":"IF(Linkwahl!AI264=\"\",\"\",CELL(\"Inhalt\",Linkwahl!AI264))","v":""},{"$f":"IF(Linkwahl!AJ264=\"\",\"\",CELL(\"Inhalt\",Linkwahl!AJ264))","v":""},{"$f":"IF(Linkwahl!AK264=\"\",\"\",CELL(\"Inhalt\",Linkwahl!AK264))","v":""}]
["",{"$f":"IF(Linkwahl!AI265=\"\",\"\",CELL(\"Inhalt\",Linkwahl!AI265))","v":""},{"$f":"IF(Linkwahl!AJ265=\"\",\"\",CELL(\"Inhalt\",Linkwahl!AJ265))","v":""},{"$f":"IF(Linkwahl!AK265=\"\",\"\",CELL(\"Inhalt\",Linkwahl!AK265))","v":""}]
[{"$f":"IF(B111=\"\",\"\",HYPERLINK(\"http://www.zhlex.zh.ch/Erlass.html?Open&Ordnr=\"&C111,\"LS-Link\"))","v":""},{"$f":"IF(Linkwahl!AI264=\"\",\"\",CELL(\"Inhalt\",Linkwahl!AI264))","v":""},{"$f":"IF(Linkwahl!AJ264=\"\",\"\",CELL(\"Inhalt\",Linkwahl!AJ264))","v":""},{"$f":"IF(Linkwahl!AK264=\"\",\"\",CELL(\"Inhalt\",Linkwahl!AK264))","v":""}]
["",{"$f":"IF(Linkwahl!AI265=\"\",\"\",CELL(\"Inhalt\",Linkwahl!AI265))","v":""},{"$f":"IF(Linkwahl!AJ265=\"\",\"\",CELL(\"Inhalt\",Linkwahl!AJ265))","v":""},{"$f":"IF(Linkwahl!AK265=\"\",\"\",CELL(\"Inhalt\",Linkwahl!AK265))","v":""}]
["",{"$f":"IF(Linkwahl!AI267=\"\",\"\",CELL(\"Inhalt\",Linkwahl!AI267))","v":""},{"$f":"IF(Linkwahl!AJ267=\"\",\"\",CELL(\"Inhalt\",Linkwahl!AJ267))","v":""},{"$f":"IF(Linkwahl!AK267=\"\",\"\",CELL(\"Inhalt\",Linkwahl!AK267))","v":""}]
["",{"$f":"IF(Linkwahl!AI268=\"\",\"\",CELL(\"Inhalt\",Linkwahl!AI268))","v":""},{"$f":"IF(Linkwahl!AJ268=\"\",\"\",CELL(\"Inhalt\",Linkwahl!AJ268))","v":""},{"$f":"IF(Linkwahl!AK268=\"\",\"\",CELL(\"Inhalt\",Linkwahl!AK268))","v":""}]
["",{"$f":"IF(Linkwahl!AI269=\"\",\"\",CELL(\"Inhalt\",Linkwahl!AI269))","v":""},{"$f":"IF(Linkwahl!AJ269=\"\",\"\",CELL(\"Inhalt\",Linkwahl!AJ269))","v":""},{"$f":"IF(Linkwahl!AK269=\"\",\"\",CELL(\"Inhalt\",Linkwahl!AK269))","v":""}]
["",{"$f":"IF(Linkwahl!AI270=\"\",\"\",CELL(\"Inhalt\",Linkwahl!AI270))","v":""},{"$f":"IF(Linkwahl!AJ270=\"\",\"\",CELL(\"Inhalt\",Linkwahl!AJ270))","v":""},{"$f":"IF(Linkwahl!AK270=\"\",\"\",CELL(\"Inhalt\",Linkwahl!AK270))","v":""}]
["",{"$f":"IF(Linkwahl!AI271=\"\",\"\",CELL(\"Inhalt\",Linkwahl!AI271))","v":""},{"$f":"IF(Linkwahl!AJ271=\"\",\"\",CELL(\"Inhalt\",Linkwahl!AJ271))","v":""},{"$f":"IF(Linkwahl!AK271=\"\",\"\",CELL(\"Inhalt\",Linkwahl!AK271))","v":""}]
["",{"$f":"IF(Linkwahl!AI272=\"\",\"\",CELL(\"Inhalt\",Linkwahl!AI272))","v":""},{"$f":"IF(Linkwahl!AJ272=\"\",\"\",CELL(\"Inhalt\",Linkwahl!AJ272))","v":""},{"$f":"IF(Linkwahl!AK272=\"\",\"\",CELL(\"Inhalt\",Linkwahl!AK272))","v":""}]
["",{"$f":"IF(Linkwahl!AI273=\"\",\"\",CELL(\"Inhalt\",Linkwahl!AI273))","v":""},{"$f":"IF(Linkwahl!AJ273=\"\",\"\",CELL(\"Inhalt\",Linkwahl!AJ273))","v":""},{"$f":"IF(Linkwahl!AK273=\"\",\"\",CELL(\"Inhalt\",Linkwahl!AK273))","v":""}]
["",{"$f":"IF(Linkwahl!AI274=\"\",\"\",CELL(\"Inhalt\",Linkwahl!AI274))","v":""},{"$f":"IF(Linkwahl!AJ274=\"\",\"\",CELL(\"Inhalt\",Linkwahl!AJ274))","v":""},{"$f":"IF(Linkwahl!AK274=\"\",\"\",CELL(\"Inhalt\",Linkwahl!AK274))","v":""}]
["",{"$f":"IF(Linkwahl!AI275=\"\",\"\",CELL(\"Inhalt\",Linkwahl!AI275))","v":""},{"$f":"IF(Linkwahl!AJ275=\"\",\"\",CELL(\"Inhalt\",Linkwahl!AJ275))","v":""},{"$f":"IF(Linkwahl!AK275=\"\",\"\",CELL(\"Inhalt\",Linkwahl!AK275))","v":""}]
["",{"$f":"IF(Linkwahl!AI276=\"\",\"\",CELL(\"Inhalt\",Linkwahl!AI276))","v":""},{"$f":"IF(Linkwahl!AJ276=\"\",\"\",CELL(\"Inhalt\",Linkwahl!AJ276))","v":""},{"$f":"IF(Linkwahl!AK276=\"\",\"\",CELL(\"Inhalt\",Linkwahl!AK276))","v":""}]
["",{"$f":"IF(Linkwahl!AI277=\"\",\"\",CELL(\"Inhalt\",Linkwahl!AI277))","v":""},{"$f":"IF(Linkwahl!AJ277=\"\",\"\",CELL(\"Inhalt\",Linkwahl!AJ277))","v":""},{"$f":"IF(Linkwahl!AK277=\"\",\"\",CELL(\"Inhalt\",Linkwahl!AK277))","v":""}]
["",{"$f":"IF(Linkwahl!AI278=\"\",\"\",CELL(\"Inhalt\",Linkwahl!AI278))","v":""},{"$f":"IF(Linkwahl!AJ278=\"\",\"\",CELL(\"Inhalt\",Linkwahl!AJ278))","v":""},{"$f":"IF(Linkwahl!AK278=\"\",\"\",CELL(\"Inhalt\",Linkwahl!AK278))","v":""}]
["",{"$f":"IF(Linkwahl!AI279=\"\",\"\",CELL(\"Inhalt\",Linkwahl!AI279))","v":""},{"$f":"IF(Linkwahl!AJ279=\"\",\"\",CELL(\"Inhalt\",Linkwahl!AJ279))","v":""},{"$f":"IF(Linkwahl!AK279=\"\",\"\",CELL(\"Inhalt\",Linkwahl!AK279))","v":""}]
["",{"$f":"IF(Linkwahl!AI280=\"\",\"\",CELL(\"Inhalt\",Linkwahl!AI280))","v":""},{"$f":"IF(Linkwahl!AJ280=\"\",\"\",CELL(\"Inhalt\",Linkwahl!AJ280))","v":""},{"$f":"IF(Linkwahl!AK280=\"\",\"\",CELL(\"Inhalt\",Linkwahl!AK280))","v":""}]
["",{"$f":"IF(Linkwahl!AI281=\"\",\"\",CELL(\"Inhalt\",Linkwahl!AI281))","v":""},{"$f":"IF(Linkwahl!AJ281=\"\",\"\",CELL(\"Inhalt\",Linkwahl!AJ281))","v":""},{"$f":"IF(Linkwahl!AK281=\"\",\"\",CELL(\"Inhalt\",Linkwahl!AK281))","v":""}]
["",{"$f":"IF(Linkwahl!AI282=\"\",\"\",CELL(\"Inhalt\",Linkwahl!AI282))","v":""},{"$f":"IF(Linkwahl!AJ282=\"\",\"\",CELL(\"Inhalt\",Linkwahl!AJ282))","v":""},{"$f":"IF(Linkwahl!AK282=\"\",\"\",CELL(\"Inhalt\",Linkwahl!AK282))","v":""}]
["",{"$f":"IF(Linkwahl!AI283=\"\",\"\",CELL(\"Inhalt\",Linkwahl!AI283))","v":""},{"$f":"IF(Linkwahl!AJ283=\"\",\"\",CELL(\"Inhalt\",Linkwahl!AJ283))","v":""},{"$f":"IF(Linkwahl!AK283=\"\",\"\",CELL(\"Inhalt\",Linkwahl!AK283))","v":""}]
["",{"$f":"IF(Linkwahl!AI284=\"\",\"\",CELL(\"Inhalt\",Linkwahl!AI284))","v":""},{"$f":"IF(Linkwahl!AJ284=\"\",\"\",CELL(\"Inhalt\",Linkwahl!AJ284))","v":""},{"$f":"IF(Linkwahl!AK284=\"\",\"\",CELL(\"Inhalt\",Linkwahl!AK284))","v":""}]
["",{"$f":"IF(Linkwahl!AI285=\"\",\"\",CELL(\"Inhalt\",Linkwahl!AI285))","v":""},{"$f":"IF(Linkwahl!AJ285=\"\",\"\",CELL(\"Inhalt\",Linkwahl!AJ285))","v":""},{"$f":"IF(Linkwahl!AK285=\"\",\"\",CELL(\"Inhalt\",Linkwahl!AK285))","v":""}]
[{"$f":"IF(B132=\"\",\"\",HYPERLINK(\"http://www.zhlex.zh.ch/Erlass.html?Open&Ordnr=\"&C132,\"LS-Link\"))","v":""},{"$f":"IF(Linkwahl!AI286=\"\",\"\",CELL(\"Inhalt\",Linkwahl!AI286))","v":""},{"$f":"IF(Linkwahl!AJ286=\"\",\"\",CELL(\"Inhalt\",Linkwahl!AJ286))","v":""},{"$f":"IF(Linkwahl!AK286=\"\",\"\",CELL(\"Inhalt\",Linkwahl!AK286))","v":""}]
["",{"$f":"IF(Linkwahl!AI287=\"\",\"\",CELL(\"Inhalt\",Linkwahl!AI287))","v":""},{"$f":"IF(Linkwahl!AJ287=\"\",\"\",CELL(\"Inhalt\",Linkwahl!AJ287))","v":""},{"$f":"IF(Linkwahl!AK287=\"\",\"\",CELL(\"Inhalt\",Linkwahl!AK287))","v":""}]
["",{"$f":"IF(Linkwahl!AI288=\"\",\"\",CELL(\"Inhalt\",Linkwahl!AI288))","v":""},{"$f":"IF(Linkwahl!AJ288=\"\",\"\",CELL(\"Inhalt\",Linkwahl!AJ288))","v":""},{"$f":"IF(Linkwahl!AK288=\"\",\"\",CELL(\"Inhalt\",Linkwahl!AK288))","v":""}]
["",{"$f":"IF(Linkwahl!AI289=\"\",\"\",CELL(\"Inhalt\",Linkwahl!AI289))","v":""},{"$f":"IF(Linkwahl!AJ289=\"\",\"\",CELL(\"Inhalt\",Linkwahl!AJ289))","v":""},{"$f":"IF(Linkwahl!AK289=\"\",\"\",CELL(\"Inhalt\",Linkwahl!AK289))","v":""}]
["",{"$f":"IF(Linkwahl!AI290=\"\",\"\",CELL(\"Inhalt\",Linkwahl!AI290))","v":""},{"$f":"IF(Linkwahl!AJ290=\"\",\"\",CELL(\"Inhalt\",Linkwahl!AJ290))","v":""},{"$f":"IF(Linkwahl!AK290=\"\",\"\",CELL(\"Inhalt\",Linkwahl!AK290))","v":""}]
["",{"$f":"IF(Linkwahl!AI291=\"\",\"\",CELL(\"Inhalt\",Linkwahl!AI291))","v":""},{"$f":"IF(Linkwahl!AJ291=\"\",\"\",CELL(\"Inhalt\",Linkwahl!AJ291))","v":""},{"$f":"IF(Linkwahl!AK291=\"\",\"\",CELL(\"Inhalt\",Linkwahl!AK291))","v":""}]
["",{"$f":"IF(Linkwahl!AI292=\"\",\"\",CELL(\"Inhalt\",Linkwahl!AI292))","v":""},{"$f":"IF(Linkwahl!AJ292=\"\",\"\",CELL(\"Inhalt\",Linkwahl!AJ292))","v":""},{"$f":"IF(Linkwahl!AK292=\"\",\"\",CELL(\"Inhalt\",Linkwahl!AK292))","v":""}]
["",{"$f":"IF(Linkwahl!AI293=\"\",\"\",CELL(\"Inhalt\",Linkwahl!AI293))","v":""},{"$f":"IF(Linkwahl!AJ293=\"\",\"\",CELL(\"Inhalt\",Linkwahl!AJ293))","v":""},{"$f":"IF(Linkwahl!AK293=\"\",\"\",CELL(\"Inhalt\",Linkwahl!AK293))","v":""}]
["",{"$f":"IF(Linkwahl!AI294=\"\",\"\",CELL(\"Inhalt\",Linkwahl!AI294))","v":""},{"$f":"IF(Linkwahl!AJ294=\"\",\"\",CELL(\"Inhalt\",Linkwahl!AJ294))","v":""},{"$f":"IF(Linkwahl!AK294=\"\",\"\",CELL(\"Inhalt\",Linkwahl!AK294))","v":""}]
["",{"$f":"IF(Linkwahl!AI295=\"\",\"\",CELL(\"Inhalt\",Linkwahl!AI295))","v":""},{"$f":"IF(Linkwahl!AJ295=\"\",\"\",CELL(\"Inhalt\",Linkwahl!AJ295))","v":""},{"$f":"IF(Linkwahl!AK295=\"\",\"\",CELL(\"Inhalt\",Linkwahl!AK295))","v":""}]
["",{"$f":"IF(Linkwahl!AI296=\"\",\"\",CELL(\"Inhalt\",Linkwahl!AI296))","v":""},{"$f":"IF(Linkwahl!AJ296=\"\",\"\",CELL(\"Inhalt\",Linkwahl!AJ296))","v":""},{"$f":"IF(Linkwahl!AK296=\"\",\"\",CELL(\"Inhalt\",Linkwahl!AK296))","v":""}]
["",{"$f":"IF(Linkwahl!AI297=\"\",\"\",CELL(\"Inhalt\",Linkwahl!AI297))","v":""},{"$f":"IF(Linkwahl!AJ297=\"\",\"\",CELL(\"Inhalt\",Linkwahl!AJ297))","v":""},{"$f":"IF(Linkwahl!AK297=\"\",\"\",CELL(\"Inhalt\",Linkwahl!AK297))","v":""}]
["",{"$f":"IF(Linkwahl!AI298=\"\",\"\",CELL(\"Inhalt\",Linkwahl!AI298))","v":""},{"$f":"IF(Linkwahl!AJ298=\"\",\"\",CELL(\"Inhalt\",Linkwahl!AJ298))","v":""},{"$f":"IF(Linkwahl!AK298=\"\",\"\",CELL(\"Inhalt\",Linkwahl!AK298))","v":""}]
["",{"$f":"IF(Linkwahl!AI299=\"\",\"\",CELL(\"Inhalt\",Linkwahl!AI299))","v":""},{"$f":"IF(Linkwahl!AJ299=\"\",\"\",CELL(\"Inhalt\",Linkwahl!AJ299))","v":""},{"$f":"IF(Linkwahl!AK299=\"\",\"\",CELL(\"Inhalt\",Linkwahl!AK299))","v":""}]
["",{"$f":"IF(Linkwahl!AI300=\"\",\"\",CELL(\"Inhalt\",Linkwahl!AI300))","v":""},{"$f":"IF(Linkwahl!AJ300=\"\",\"\",CELL(\"Inhalt\",Linkwahl!AJ300))","v":""},{"$f":"IF(Linkwahl!AK300=\"\",\"\",CELL(\"Inhalt\",Linkwahl!AK300))","v":""}]
["",{"$f":"IF(Linkwahl!AI301=\"\",\"\",CELL(\"Inhalt\",Linkwahl!AI301))","v":""},{"$f":"IF(Linkwahl!AJ301=\"\",\"\",CELL(\"Inhalt\",Linkwahl!AJ301))","v":""},{"$f":"IF(Linkwahl!AK301=\"\",\"\",CELL(\"Inhalt\",Linkwahl!AK301))","v":""}]
["",{"$f":"IF(Linkwahl!AI302=\"\",\"\",CELL(\"Inhalt\",Linkwahl!AI302))","v":""},{"$f":"IF(Linkwahl!AJ302=\"\",\"\",CELL(\"Inhalt\",Linkwahl!AJ302))","v":""},{"$f":"IF(Linkwahl!AK302=\"\",\"\",CELL(\"Inhalt\",Linkwahl!AK302))","v":""}]
["",{"$f":"IF(Linkwahl!AI304=\"\",\"\",CELL(\"Inhalt\",Linkwahl!AI304))","v":""},{"$f":"IF(Linkwahl!AJ304=\"\",\"\",CELL(\"Inhalt\",Linkwahl!AJ304))","v":""},{"$f":"IF(Linkwahl!AK304=\"\",\"\",CELL(\"Inhalt\",Linkwahl!AK304))","v":""}]
["",{"$f":"IF(Linkwahl!AI305=\"\",\"\",CELL(\"Inhalt\",Linkwahl!AI305))","v":""},{"$f":"IF(Linkwahl!AJ305=\"\",\"\",CELL(\"Inhalt\",Linkwahl!AJ305))","v":""},{"$f":"IF(Linkwahl!AK305=\"\",\"\",CELL(\"Inhalt\",Linkwahl!AK305))","v":""}]
["",{"$f":"IF(Linkwahl!AI309=\"\",\"\",CELL(\"Inhalt\",Linkwahl!AI309))","v":""},{"$f":"IF(Linkwahl!AJ309=\"\",\"\",CELL(\"Inhalt\",Linkwahl!AJ309))","v":""},{"$f":"IF(Linkwahl!AK309=\"\",\"\",CELL(\"Inhalt\",Linkwahl!AK309))","v":""}]
["",{"$f":"IF(Linkwahl!AI310=\"\",\"\",CELL(\"Inhalt\",Linkwahl!AI310))","v":""},{"$f":"IF(Linkwahl!AJ310=\"\",\"\",CELL(\"Inhalt\",Linkwahl!AJ310))","v":""},{"$f":"IF(Linkwahl!AK310=\"\",\"\",CELL(\"Inhalt\",Linkwahl!AK310))","v":""}]
["",{"$f":"IF(Linkwahl!AI311=\"\",\"\",CELL(\"Inhalt\",Linkwahl!AI311))","v":""},{"$f":"IF(Linkwahl!AJ311=\"\",\"\",CELL(\"Inhalt\",Linkwahl!AJ311))","v":""},{"$f":"IF(Linkwahl!AK311=\"\",\"\",CELL(\"Inhalt\",Linkwahl!AK311))","v":""}]
["",{"$f":"IF(Linkwahl!AI312=\"\",\"\",CELL(\"Inhalt\",Linkwahl!AI312))","v":""},{"$f":"IF(Linkwahl!AJ312=\"\",\"\",CELL(\"Inhalt\",Linkwahl!AJ312))","v":""},{"$f":"IF(Linkwahl!AK312=\"\",\"\",CELL(\"Inhalt\",Linkwahl!AK312))","v":""}]
["",{"$f":"IF(Linkwahl!AI313=\"\",\"\",CELL(\"Inhalt\",Linkwahl!AI313))","v":""},{"$f":"IF(Linkwahl!AJ313=\"\",\"\",CELL(\"Inhalt\",Linkwahl!AJ313))","v":""},{"$f":"IF(Linkwahl!AK313=\"\",\"\",CELL(\"Inhalt\",Linkwahl!AK313))","v":""}]
["",{"$f":"IF(Linkwahl!AI314=\"\",\"\",CELL(\"Inhalt\",Linkwahl!AI314))","v":""},{"$f":"IF(Linkwahl!AJ314=\"\",\"\",CELL(\"Inhalt\",Linkwahl!AJ314))","v":""},{"$f":"IF(Linkwahl!AK314=\"\",\"\",CELL(\"Inhalt\",Linkwahl!AK314))","v":""}]
["",{"$f":"IF(Linkwahl!AI315=\"\",\"\",CELL(\"Inhalt\",Linkwahl!AI315))","v":""},{"$f":"IF(Linkwahl!AJ315=\"\",\"\",CELL(\"Inhalt\",Linkwahl!AJ315))","v":""},{"$f":"IF(Linkwahl!AK315=\"\",\"\",CELL(\"Inhalt\",Linkwahl!AK315))","v":""}]
["",{"$f":"IF(Linkwahl!AI316=\"\",\"\",CELL(\"Inhalt\",Linkwahl!AI316))","v":""},{"$f":"IF(Linkwahl!AJ316=\"\",\"\",CELL(\"Inhalt\",Linkwahl!AJ316))","v":""},{"$f":"IF(Linkwahl!AK316=\"\",\"\",CELL(\"Inhalt\",Linkwahl!AK316))","v":""}]
["",{"$f":"IF(Linkwahl!AI317=\"\",\"\",CELL(\"Inhalt\",Linkwahl!AI317))","v":""},{"$f":"IF(Linkwahl!AJ317=\"\",\"\",CELL(\"Inhalt\",Linkwahl!AJ317))","v":""},{"$f":"IF(Linkwahl!AK317=\"\",\"\",CELL(\"Inhalt\",Linkwahl!AK317))","v":""}]
["",{"$f":"IF(Linkwahl!AI318=\"\",\"\",CELL(\"Inhalt\",Linkwahl!AI318))","v":""},{"$f":"IF(Linkwahl!AJ318=\"\",\"\",CELL(\"Inhalt\",Linkwahl!AJ318))","v":""},{"$f":"IF(Linkwahl!AK318=\"\",\"\",CELL(\"Inhalt\",Linkwahl!AK318))","v":""}]
["",{"$f":"IF(Linkwahl!AI319=\"\",\"\",CELL(\"Inhalt\",Linkwahl!AI319))","v":""},{"$f":"IF(Linkwahl!AJ319=\"\",\"\",CELL(\"Inhalt\",Linkwahl!AJ319))","v":""},{"$f":"IF(Linkwahl!AK319=\"\",\"\",CELL(\"Inhalt\",Linkwahl!AK319))","v":""}]
["",{"$f":"IF(Linkwahl!AI320=\"\",\"\",CELL(\"Inhalt\",Linkwahl!AI320))","v":""},{"$f":"IF(Linkwahl!AJ320=\"\",\"\",CELL(\"Inhalt\",Linkwahl!AJ320))","v":""},{"$f":"IF(Linkwahl!AK320=\"\",\"\",CELL(\"Inhalt\",Linkwahl!AK320))","v":""}]
["",{"$f":"IF(Linkwahl!AI321=\"\",\"\",CELL(\"Inhalt\",Linkwahl!AI321))","v":""},{"$f":"IF(Linkwahl!AJ321=\"\",\"\",CELL(\"Inhalt\",Linkwahl!AJ321))","v":""},{"$f":"IF(Linkwahl!AK321=\"\",\"\",CELL(\"Inhalt\",Linkwahl!AK321))","v":""}]
["",{"$f":"IF(Linkwahl!AI322=\"\",\"\",CELL(\"Inhalt\",Linkwahl!AI322))","v":""},{"$f":"IF(Linkwahl!AJ322=\"\",\"\",CELL(\"Inhalt\",Linkwahl!AJ322))","v":""},{"$f":"IF(Linkwahl!AK322=\"\",\"\",CELL(\"Inhalt\",Linkwahl!AK322))","v":""}]
["",{"$f":"IF(Linkwahl!AI323=\"\",\"\",CELL(\"Inhalt\",Linkwahl!AI323))","v":""},{"$f":"IF(Linkwahl!AJ323=\"\",\"\",CELL(\"Inhalt\",Linkwahl!AJ323))","v":""},{"$f":"IF(Linkwahl!AK323=\"\",\"\",CELL(\"Inhalt\",Linkwahl!AK323))","v":""}]
["",{"$f":"IF(Linkwahl!AI324=\"\",\"\",CELL(\"Inhalt\",Linkwahl!AI324))","v":""},{"$f":"IF(Linkwahl!AJ324=\"\",\"\",CELL(\"Inhalt\",Linkwahl!AJ324))","v":""},{"$f":"IF(Linkwahl!AK324=\"\",\"\",CELL(\"Inhalt\",Linkwahl!AK324))","v":""}]
["",{"$f":"IF(Linkwahl!AI325=\"\",\"\",CELL(\"Inhalt\",Linkwahl!AI325))","v":""},{"$f":"IF(Linkwahl!AJ325=\"\",\"\",CELL(\"Inhalt\",Linkwahl!AJ325))","v":""},{"$f":"IF(Linkwahl!AK325=\"\",\"\",CELL(\"Inhalt\",Linkwahl!AK325))","v":""}]
["",{"$f":"IF(Linkwahl!AI326=\"\",\"\",CELL(\"Inhalt\",Linkwahl!AI326))","v":""},{"$f":"IF(Linkwahl!AJ326=\"\",\"\",CELL(\"Inhalt\",Linkwahl!AJ326))","v":""},{"$f":"IF(Linkwahl!AK326=\"\",\"\",CELL(\"Inhalt\",Linkwahl!AK326))","v":""}]
["",{"$f":"IF(Linkwahl!AI327=\"\",\"\",CELL(\"Inhalt\",Linkwahl!AI327))","v":""},{"$f":"IF(Linkwahl!AJ327=\"\",\"\",CELL(\"Inhalt\",Linkwahl!AJ327))","v":""},{"$f":"IF(Linkwahl!AK327=\"\",\"\",CELL(\"Inhalt\",Linkwahl!AK327))","v":""}]
["",{"$f":"IF(Linkwahl!AI328=\"\",\"\",CELL(\"Inhalt\",Linkwahl!AI328))","v":""},{"$f":"IF(Linkwahl!AJ328=\"\",\"\",CELL(\"Inhalt\",Linkwahl!AJ328))","v":""},{"$f":"IF(Linkwahl!AK328=\"\",\"\",CELL(\"Inhalt\",Linkwahl!AK328))","v":""}]
["",{"$f":"IF(Linkwahl!AI329=\"\",\"\",CELL(\"Inhalt\",Linkwahl!AI329))","v":""},{"$f":"IF(Linkwahl!AJ329=\"\",\"\",CELL(\"Inhalt\",Linkwahl!AJ329))","v":""},{"$f":"IF(Linkwahl!AK329=\"\",\"\",CELL(\"Inhalt\",Linkwahl!AK329))","v":""}]
["",{"$f":"IF(Linkwahl!AI330=\"\",\"\",CELL(\"Inhalt\",Linkwahl!AI330))","v":""},{"$f":"IF(Linkwahl!AJ330=\"\",\"\",CELL(\"Inhalt\",Linkwahl!AJ330))","v":""},{"$f":"IF(Linkwahl!AK330=\"\",\"\",CELL(\"Inhalt\",Linkwahl!AK330))","v":""}]
["",{"$f":"IF(Linkwahl!AI331=\"\",\"\",CELL(\"Inhalt\",Linkwahl!AI331))","v":""},{"$f":"IF(Linkwahl!AJ331=\"\",\"\",CELL(\"Inhalt\",Linkwahl!AJ331))","v":""},{"$f":"IF(Linkwahl!AK331=\"\",\"\",CELL(\"Inhalt\",Linkwahl!AK331))","v":""}]
["",{"$f":"IF(Linkwahl!AI332=\"\",\"\",CELL(\"Inhalt\",Linkwahl!AI332))","v":""},{"$f":"IF(Linkwahl!AJ332=\"\",\"\",CELL(\"Inhalt\",Linkwahl!AJ332))","v":""},{"$f":"IF(Linkwahl!AK332=\"\",\"\",CELL(\"Inhalt\",Linkwahl!AK332))","v":""}]
["",{"$f":"IF(Linkwahl!AI333=\"\",\"\",CELL(\"Inhalt\",Linkwahl!AI333))","v":""},{"$f":"IF(Linkwahl!AJ333=\"\",\"\",CELL(\"Inhalt\",Linkwahl!AJ333))","v":""},{"$f":"IF(Linkwahl!AK333=\"\",\"\",CELL(\"Inhalt\",Linkwahl!AK333))","v":""}]
["",{"$f":"IF(Linkwahl!AI334=\"\",\"\",CELL(\"Inhalt\",Linkwahl!AI334))","v":""},{"$f":"IF(Linkwahl!AJ334=\"\",\"\",CELL(\"Inhalt\",Linkwahl!AJ334))","v":""},{"$f":"IF(Linkwahl!AK334=\"\",\"\",CELL(\"Inhalt\",Linkwahl!AK334))","v":""}]
["",{"$f":"IF(Linkwahl!AI335=\"\",\"\",CELL(\"Inhalt\",Linkwahl!AI335))","v":""},{"$f":"IF(Linkwahl!AJ335=\"\",\"\",CELL(\"Inhalt\",Linkwahl!AJ335))","v":""},{"$f":"IF(Linkwahl!AK335=\"\",\"\",CELL(\"Inhalt\",Linkwahl!AK335))","v":""}]
["",{"$f":"IF(Linkwahl!AI336=\"\",\"\",CELL(\"Inhalt\",Linkwahl!AI336))","v":""},{"$f":"IF(Linkwahl!AJ336=\"\",\"\",CELL(\"Inhalt\",Linkwahl!AJ336))","v":""},{"$f":"IF(Linkwahl!AK336=\"\",\"\",CELL(\"Inhalt\",Linkwahl!AK336))","v":""}]
["",{"$f":"IF(Linkwahl!AI337=\"\",\"\",CELL(\"Inhalt\",Linkwahl!AI337))","v":""},{"$f":"IF(Linkwahl!AJ337=\"\",\"\",CELL(\"Inhalt\",Linkwahl!AJ337))","v":""},{"$f":"IF(Linkwahl!AK337=\"\",\"\",CELL(\"Inhalt\",Linkwahl!AK337))","v":""}]
["",{"$f":"IF(Linkwahl!AI338=\"\",\"\",CELL(\"Inhalt\",Linkwahl!AI338))","v":""},{"$f":"IF(Linkwahl!AJ338=\"\",\"\",CELL(\"Inhalt\",Linkwahl!AJ338))","v":""},{"$f":"IF(Linkwahl!AK338=\"\",\"\",CELL(\"Inhalt\",Linkwahl!AK338))","v":""}]
["",{"$f":"IF(Linkwahl!AI339=\"\",\"\",CELL(\"Inhalt\",Linkwahl!AI339))","v":""},{"$f":"IF(Linkwahl!AJ339=\"\",\"\",CELL(\"Inhalt\",Linkwahl!AJ339))","v":""},{"$f":"IF(Linkwahl!AK339=\"\",\"\",CELL(\"Inhalt\",Linkwahl!AK339))","v":""}]
["",{"$f":"IF(Linkwahl!AI340=\"\",\"\",CELL(\"Inhalt\",Linkwahl!AI340))","v":""},{"$f":"IF(Linkwahl!AJ340=\"\",\"\",CELL(\"Inhalt\",Linkwahl!AJ340))","v":""},{"$f":"IF(Linkwahl!AK340=\"\",\"\",CELL(\"Inhalt\",Linkwahl!AK340))","v":""}]
["",{"$f":"IF(Linkwahl!AI341=\"\",\"\",CELL(\"Inhalt\",Linkwahl!AI341))","v":""},{"$f":"IF(Linkwahl!AJ341=\"\",\"\",CELL(\"Inhalt\",Linkwahl!AJ341))","v":""},{"$f":"IF(Linkwahl!AK341=\"\",\"\",CELL(\"Inhalt\",Linkwahl!AK341))","v":""}]
["",{"$f":"IF(Linkwahl!AI342=\"\",\"\",CELL(\"Inhalt\",Linkwahl!AI342))","v":""},{"$f":"IF(Linkwahl!AJ342=\"\",\"\",CELL(\"Inhalt\",Linkwahl!AJ342))","v":""},{"$f":"IF(Linkwahl!AK342=\"\",\"\",CELL(\"Inhalt\",Linkwahl!AK342))","v":""}]
["",{"$f":"IF(Linkwahl!AI343=\"\",\"\",CELL(\"Inhalt\",Linkwahl!AI343))","v":""},{"$f":"IF(Linkwahl!AJ343=\"\",\"\",CELL(\"Inhalt\",Linkwahl!AJ343))","v":""},{"$f":"IF(Linkwahl!AK343=\"\",\"\",CELL(\"Inhalt\",Linkwahl!AK343))","v":""}]
["",{"$f":"IF(Linkwahl!AI344=\"\",\"\",CELL(\"Inhalt\",Linkwahl!AI344))","v":""},{"$f":"IF(Linkwahl!AJ344=\"\",\"\",CELL(\"Inhalt\",Linkwahl!AJ344))","v":""},{"$f":"IF(Linkwahl!AK344=\"\",\"\",CELL(\"Inhalt\",Linkwahl!AK344))","v":""}]
["",{"$f":"IF(Linkwahl!AI345=\"\",\"\",CELL(\"Inhalt\",Linkwahl!AI345))","v":""},{"$f":"IF(Linkwahl!AJ345=\"\",\"\",CELL(\"Inhalt\",Linkwahl!AJ345))","v":""},{"$f":"IF(Linkwahl!AK345=\"\",\"\",CELL(\"Inhalt\",Linkwahl!AK345))","v":""}]
["",{"$f":"IF(Linkwahl!AI346=\"\",\"\",CELL(\"Inhalt\",Linkwahl!AI346))","v":""},{"$f":"IF(Linkwahl!AJ346=\"\",\"\",CELL(\"Inhalt\",Linkwahl!AJ346))","v":""},{"$f":"IF(Linkwahl!AK346=\"\",\"\",CELL(\"Inhalt\",Linkwahl!AK346))","v":""}]
["",{"$f":"IF(Linkwahl!AI347=\"\",\"\",CELL(\"Inhalt\",Linkwahl!AI347))","v":""},{"$f":"IF(Linkwahl!AJ347=\"\",\"\",CELL(\"Inhalt\",Linkwahl!AJ347))","v":""},{"$f":"IF(Linkwahl!AK347=\"\",\"\",CELL(\"Inhalt\",Linkwahl!AK347))","v":""}]
["",{"$f":"IF(Linkwahl!AI348=\"\",\"\",CELL(\"Inhalt\",Linkwahl!AI348))","v":""},{"$f":"IF(Linkwahl!AJ348=\"\",\"\",CELL(\"Inhalt\",Linkwahl!AJ348))","v":""},{"$f":"IF(Linkwahl!AK348=\"\",\"\",CELL(\"Inhalt\",Linkwahl!AK348))","v":""}]
["",{"$f":"IF(Linkwahl!AI349=\"\",\"\",CELL(\"Inhalt\",Linkwahl!AI349))","v":""},{"$f":"IF(Linkwahl!AJ349=\"\",\"\",CELL(\"Inhalt\",Linkwahl!AJ349))","v":""},{"$f":"IF(Linkwahl!AK349=\"\",\"\",CELL(\"Inhalt\",Linkwahl!AK349))","v":""}]
["",{"$f":"IF(Linkwahl!AI350=\"\",\"\",CELL(\"Inhalt\",Linkwahl!AI350))","v":""},{"$f":"IF(Linkwahl!AJ350=\"\",\"\",CELL(\"Inhalt\",Linkwahl!AJ350))","v":""},{"$f":"IF(Linkwahl!AK350=\"\",\"\",CELL(\"Inhalt\",Linkwahl!AK350))","v":""}]
["",{"$f":"IF(Linkwahl!AI351=\"\",\"\",CELL(\"Inhalt\",Linkwahl!AI351))","v":""},{"$f":"IF(Linkwahl!AJ351=\"\",\"\",CELL(\"Inhalt\",Linkwahl!AJ351))","v":""},{"$f":"IF(Linkwahl!AK351=\"\",\"\",CELL(\"Inhalt\",Linkwahl!AK351))","v":""}]
["",{"$f":"IF(Linkwahl!AI352=\"\",\"\",CELL(\"Inhalt\",Linkwahl!AI352))","v":""},{"$f":"IF(Linkwahl!AJ352=\"\",\"\",CELL(\"Inhalt\",Linkwahl!AJ352))","v":""},{"$f":"IF(Linkwahl!AK352=\"\",\"\",CELL(\"Inhalt\",Linkwahl!AK352))","v":""}]
["",{"$f":"IF(Linkwahl!AI353=\"\",\"\",CELL(\"Inhalt\",Linkwahl!AI353))","v":""},{"$f":"IF(Linkwahl!AJ353=\"\",\"\",CELL(\"Inhalt\",Linkwahl!AJ353))","v":""},{"$f":"IF(Linkwahl!AK353=\"\",\"\",CELL(\"Inhalt\",Linkwahl!AK353))","v":""}]
[{"$f":"IF(B196=\"\",\"\",HYPERLINK(\"http://www.zhlex.zh.ch/Erlass.html?Open&Ordnr=\"&C196,\"LS-Link\"))","v":""},{"$f":"IF(Linkwahl!AI355=\"\",\"\",CELL(\"Inhalt\",Linkwahl!AI355))","v":""},{"$f":"IF(Linkwahl!AJ355=\"\",\"\",CELL(\"Inhalt\",Linkwahl!AJ355))","v":""},{"$f":"IF(Linkwahl!AK355=\"\",\"\",CELL(\"Inhalt\",Linkwahl!AK355))","v":""}]
["",{"$f":"IF(Linkwahl!AI358=\"\",\"\",CELL(\"Inhalt\",Linkwahl!AI358))","v":""},{"$f":"IF(Linkwahl!AJ358=\"\",\"\",CELL(\"Inhalt\",Linkwahl!AJ358))","v":""},{"$f":"IF(Linkwahl!AK358=\"\",\"\",CELL(\"Inhalt\",Linkwahl!AK358))","v":""}]
["",{"$f":"IF(Linkwahl!AI359=\"\",\"\",CELL(\"Inhalt\",Linkwahl!AI359))","v":""},{"$f":"IF(Linkwahl!AJ359=\"\",\"\",CELL(\"Inhalt\",Linkwahl!AJ359))","v":""},{"$f":"IF(Linkwahl!AK359=\"\",\"\",CELL(\"Inhalt\",Linkwahl!AK359))","v":""}]
["",{"$f":"IF(Linkwahl!AI360=\"\",\"\",CELL(\"Inhalt\",Linkwahl!AI360))","v":""},{"$f":"IF(Linkwahl!AJ360=\"\",\"\",CELL(\"Inhalt\",Linkwahl!AJ360))","v":""},{"$f":"IF(Linkwahl!AK360=\"\",\"\",CELL(\"Inhalt\",Linkwahl!AK360))","v":""}]
["",{"$f":"IF(Linkwahl!AI361=\"\",\"\",CELL(\"Inhalt\",Linkwahl!AI361))","v":""},{"$f":"IF(Linkwahl!AJ361=\"\",\"\",CELL(\"Inhalt\",Linkwahl!AJ361))","v":""},{"$f":"IF(Linkwahl!AK361=\"\",\"\",CELL(\"Inhalt\",Linkwahl!AK361))","v":""}]
["",{"$f":"IF(Linkwahl!AI362=\"\",\"\",CELL(\"Inhalt\",Linkwahl!AI362))","v":""},{"$f":"IF(Linkwahl!AJ362=\"\",\"\",CELL(\"Inhalt\",Linkwahl!AJ362))","v":""},{"$f":"IF(Linkwahl!AK362=\"\",\"\",CELL(\"Inhalt\",Linkwahl!AK362))","v":""}]
["",{"$f":"IF(Linkwahl!AI363=\"\",\"\",CELL(\"Inhalt\",Linkwahl!AI363))","v":""},{"$f":"IF(Linkwahl!AJ363=\"\",\"\",CELL(\"Inhalt\",Linkwahl!AJ363))","v":""},{"$f":"IF(Linkwahl!AK363=\"\",\"\",CELL(\"Inhalt\",Linkwahl!AK363))","v":""}]
["",{"$f":"IF(Linkwahl!AI364=\"\",\"\",CELL(\"Inhalt\",Linkwahl!AI364))","v":""},{"$f":"IF(Linkwahl!AJ364=\"\",\"\",CELL(\"Inhalt\",Linkwahl!AJ364))","v":""},{"$f":"IF(Linkwahl!AK364=\"\",\"\",CELL(\"Inhalt\",Linkwahl!AK364))","v":""}]
["",{"$f":"IF(Linkwahl!AI365=\"\",\"\",CELL(\"Inhalt\",Linkwahl!AI365))","v":""},{"$f":"IF(Linkwahl!AJ365=\"\",\"\",CELL(\"Inhalt\",Linkwahl!AJ365))","v":""},{"$f":"IF(Linkwahl!AK365=\"\",\"\",CELL(\"Inhalt\",Linkwahl!AK365))","v":""}]
["",{"$f":"IF(Linkwahl!AI367=\"\",\"\",CELL(\"Inhalt\",Linkwahl!AI367))","v":""},{"$f":"IF(Linkwahl!AJ367=\"\",\"\",CELL(\"Inhalt\",Linkwahl!AJ367))","v":""},{"$f":"IF(Linkwahl!AK367=\"\",\"\",CELL(\"Inhalt\",Linkwahl!AK367))","v":""}]
["",{"$f":"IF(Linkwahl!AI368=\"\",\"\",CELL(\"Inhalt\",Linkwahl!AI368))","v":""},{"$f":"IF(Linkwahl!AJ368=\"\",\"\",CELL(\"Inhalt\",Linkwahl!AJ368))","v":""},{"$f":"IF(Linkwahl!AK368=\"\",\"\",CELL(\"Inhalt\",Linkwahl!AK368))","v":""}]
["",{"$f":"IF(Linkwahl!AI369=\"\",\"\",CELL(\"Inhalt\",Linkwahl!AI369))","v":""},{"$f":"IF(Linkwahl!AJ369=\"\",\"\",CELL(\"Inhalt\",Linkwahl!AJ369))","v":""},{"$f":"IF(Linkwahl!AK369=\"\",\"\",CELL(\"Inhalt\",Linkwahl!AK369))","v":""}]
["",{"$f":"IF(Linkwahl!AI370=\"\",\"\",CELL(\"Inhalt\",Linkwahl!AI370))","v":""},{"$f":"IF(Linkwahl!AJ370=\"\",\"\",CELL(\"Inhalt\",Linkwahl!AJ370))","v":""},{"$f":"IF(Linkwahl!AK370=\"\",\"\",CELL(\"Inhalt\",Linkwahl!AK370))","v":""}]
["",{"$f":"IF(Linkwahl!AI371=\"\",\"\",CELL(\"Inhalt\",Linkwahl!AI371))","v":""},{"$f":"IF(Linkwahl!AJ371=\"\",\"\",CELL(\"Inhalt\",Linkwahl!AJ371))","v":""},{"$f":"IF(Linkwahl!AK371=\"\",\"\",CELL(\"Inhalt\",Linkwahl!AK371))","v":""}]
["",{"$f":"IF(Linkwahl!AI373=\"\",\"\",CELL(\"Inhalt\",Linkwahl!AI373))","v":""},{"$f":"IF(Linkwahl!AJ373=\"\",\"\",CELL(\"Inhalt\",Linkwahl!AJ373))","v":""},{"$f":"IF(Linkwahl!AK373=\"\",\"\",CELL(\"Inhalt\",Linkwahl!AK373))","v":""}]
["",{"$f":"IF(Linkwahl!AI374=\"\",\"\",CELL(\"Inhalt\",Linkwahl!AI374))","v":""},{"$f":"IF(Linkwahl!AJ374=\"\",\"\",CELL(\"Inhalt\",Linkwahl!AJ374))","v":""},{"$f":"IF(Linkwahl!AK374=\"\",\"\",CELL(\"Inhalt\",Linkwahl!AK374))","v":""}]
["",{"$f":"IF(Linkwahl!AI375=\"\",\"\",CELL(\"Inhalt\",Linkwahl!AI375))","v":""},{"$f":"IF(Linkwahl!AJ375=\"\",\"\",CELL(\"Inhalt\",Linkwahl!AJ375))","v":""},{"$f":"IF(Linkwahl!AK375=\"\",\"\",CELL(\"Inhalt\",Linkwahl!AK375))","v":""}]
["",{"$f":"IF(Linkwahl!AI377=\"\",\"\",CELL(\"Inhalt\",Linkwahl!AI377))","v":""},{"$f":"IF(Linkwahl!AJ377=\"\",\"\",CELL(\"Inhalt\",Linkwahl!AJ377))","v":""},{"$f":"IF(Linkwahl!AK377=\"\",\"\",CELL(\"Inhalt\",Linkwahl!AK377))","v":""}]
["",{"$f":"IF(Linkwahl!AI378=\"\",\"\",CELL(\"Inhalt\",Linkwahl!AI378))","v":""},{"$f":"IF(Linkwahl!AJ378=\"\",\"\",CELL(\"Inhalt\",Linkwahl!AJ378))","v":""},{"$f":"IF(Linkwahl!AK378=\"\",\"\",CELL(\"Inhalt\",Linkwahl!AK378))","v":""}]
["",{"$f":"IF(Linkwahl!AI380=\"\",\"\",CELL(\"Inhalt\",Linkwahl!AI380))","v":""},{"$f":"IF(Linkwahl!AJ380=\"\",\"\",CELL(\"Inhalt\",Linkwahl!AJ380))","v":""},{"$f":"IF(Linkwahl!AK380=\"\",\"\",CELL(\"Inhalt\",Linkwahl!AK380))","v":""}]
["",{"$f":"IF(Linkwahl!AI382=\"\",\"\",CELL(\"Inhalt\",Linkwahl!AI382))","v":""},{"$f":"IF(Linkwahl!AJ382=\"\",\"\",CELL(\"Inhalt\",Linkwahl!AJ382))","v":""},{"$f":"IF(Linkwahl!AK382=\"\",\"\",CELL(\"Inhalt\",Linkwahl!AK382))","v":""}]
["",{"$f":"IF(Linkwahl!AI383=\"\",\"\",CELL(\"Inhalt\",Linkwahl!AI383))","v":""},{"$f":"IF(Linkwahl!AJ383=\"\",\"\",CELL(\"Inhalt\",Linkwahl!AJ383))","v":""},{"$f":"IF(Linkwahl!AK383=\"\",\"\",CELL(\"Inhalt\",Linkwahl!AK383))","v":""}]
["",{"$f":"IF(Linkwahl!AI384=\"\",\"\",CELL(\"Inhalt\",Linkwahl!AI384))","v":""},{"$f":"IF(Linkwahl!AJ384=\"\",\"\",CELL(\"Inhalt\",Linkwahl!AJ384))","v":""},{"$f":"IF(Linkwahl!AK384=\"\",\"\",CELL(\"Inhalt\",Linkwahl!AK384))","v":""}]
["",{"$f":"IF(Linkwahl!AI385=\"\",\"\",CELL(\"Inhalt\",Linkwahl!AI385))","v":""},{"$f":"IF(Linkwahl!AJ385=\"\",\"\",CELL(\"Inhalt\",Linkwahl!AJ385))","v":""},{"$f":"IF(Linkwahl!AK385=\"\",\"\",CELL(\"Inhalt\",Linkwahl!AK385))","v":""}]
["",{"$f":"IF(Linkwahl!AI386=\"\",\"\",CELL(\"Inhalt\",Linkwahl!AI386))","v":""},{"$f":"IF(Linkwahl!AJ386=\"\",\"\",CELL(\"Inhalt\",Linkwahl!AJ386))","v":""},{"$f":"IF(Linkwahl!AK386=\"\",\"\",CELL(\"Inhalt\",Linkwahl!AK386))","v":""}]
["",{"$f":"IF(Linkwahl!AI387=\"\",\"\",CELL(\"Inhalt\",Linkwahl!AI387))","v":""},{"$f":"IF(Linkwahl!AJ387=\"\",\"\",CELL(\"Inhalt\",Linkwahl!AJ387))","v":""},{"$f":"IF(Linkwahl!AK387=\"\",\"\",CELL(\"Inhalt\",Linkwahl!AK387))","v":""}]
["",{"$f":"IF(Linkwahl!AI388=\"\",\"\",CELL(\"Inhalt\",Linkwahl!AI388))","v":""},{"$f":"IF(Linkwahl!AJ388=\"\",\"\",CELL(\"Inhalt\",Linkwahl!AJ388))","v":""},{"$f":"IF(Linkwahl!AK388=\"\",\"\",CELL(\"Inhalt\",Linkwahl!AK388))","v":""}]
["",{"$f":"IF(Linkwahl!AI389=\"\",\"\",CELL(\"Inhalt\",Linkwahl!AI389))","v":""},{"$f":"IF(Linkwahl!AJ389=\"\",\"\",CELL(\"Inhalt\",Linkwahl!AJ389))","v":""},{"$f":"IF(Linkwahl!AK389=\"\",\"\",CELL(\"Inhalt\",Linkwahl!AK389))","v":""}]
["",{"$f":"IF(Linkwahl!AI390=\"\",\"\",CELL(\"Inhalt\",Linkwahl!AI390))","v":""},{"$f":"IF(Linkwahl!AJ390=\"\",\"\",CELL(\"Inhalt\",Linkwahl!AJ390))","v":""},{"$f":"IF(Linkwahl!AK390=\"\",\"\",CELL(\"Inhalt\",Linkwahl!AK390))","v":""}]
["",{"$f":"IF(Linkwahl!AI391=\"\",\"\",CELL(\"Inhalt\",Linkwahl!AI391))","v":""},{"$f":"IF(Linkwahl!AJ391=\"\",\"\",CELL(\"Inhalt\",Linkwahl!AJ391))","v":""},{"$f":"IF(Linkwahl!AK391=\"\",\"\",CELL(\"Inhalt\",Linkwahl!AK391))","v":""}]
["",{"$f":"IF(Linkwahl!AI392=\"\",\"\",CELL(\"Inhalt\",Linkwahl!AI392))","v":""},{"$f":"IF(Linkwahl!AJ392=\"\",\"\",CELL(\"Inhalt\",Linkwahl!AJ392))","v":""},{"$f":"IF(Linkwahl!AK392=\"\",\"\",CELL(\"Inhalt\",Linkwahl!AK392))","v":""}]
["",{"$f":"IF(Linkwahl!AI393=\"\",\"\",CELL(\"Inhalt\",Linkwahl!AI393))","v":""},{"$f":"IF(Linkwahl!AJ393=\"\",\"\",CELL(\"Inhalt\",Linkwahl!AJ393))","v":""},{"$f":"IF(Linkwahl!AK393=\"\",\"\",CELL(\"Inhalt\",Linkwahl!AK393))","v":""}]
["",{"$f":"IF(Linkwahl!AI394=\"\",\"\",CELL(\"Inhalt\",Linkwahl!AI394))","v":""},{"$f":"IF(Linkwahl!AJ394=\"\",\"\",CELL(\"Inhalt\",Linkwahl!AJ394))","v":""},{"$f":"IF(Linkwahl!AK394=\"\",\"\",CELL(\"Inhalt\",Linkwahl!AK394))","v":""}]
["",{"$f":"IF(Linkwahl!AI396=\"\",\"\",CELL(\"Inhalt\",Linkwahl!AI396))","v":""},{"$f":"IF(Linkwahl!AJ396=\"\",\"\",CELL(\"Inhalt\",Linkwahl!AJ396))","v":""},{"$f":"IF(Linkwahl!AK396=\"\",\"\",CELL(\"Inhalt\",Linkwahl!AK396))","v":""}]
["",{"$f":"IF(Linkwahl!AI397=\"\",\"\",CELL(\"Inhalt\",Linkwahl!AI397))","v":""},{"$f":"IF(Linkwahl!AJ397=\"\",\"\",CELL(\"Inhalt\",Linkwahl!AJ397))","v":""},{"$f":"IF(Linkwahl!AK397=\"\",\"\",CELL(\"Inhalt\",Linkwahl!AK397))","v":""}]
["",{"$f":"IF(Linkwahl!AI398=\"\",\"\",CELL(\"Inhalt\",Linkwahl!AI398))","v":""},{"$f":"IF(Linkwahl!AJ398=\"\",\"\",CELL(\"Inhalt\",Linkwahl!AJ398))","v":""},{"$f":"IF(Linkwahl!AK398=\"\",\"\",CELL(\"Inhalt\",Linkwahl!AK398))","v":""}]
["",{"$f":"IF(Linkwahl!AI399=\"\",\"\",CELL(\"Inhalt\",Linkwahl!AI399))","v":""},{"$f":"IF(Linkwahl!AJ399=\"\",\"\",CELL(\"Inhalt\",Linkwahl!AJ399))","v":""},{"$f":"IF(Linkwahl!AK399=\"\",\"\",CELL(\"Inhalt\",Linkwahl!AK399))","v":""}]
["",{"$f":"IF(Linkwahl!AI400=\"\",\"\",CELL(\"Inhalt\",Linkwahl!AI400))","v":""},{"$f":"IF(Linkwahl!AJ400=\"\",\"\",CELL(\"Inhalt\",Linkwahl!AJ400))","v":""},{"$f":"IF(Linkwahl!AK400=\"\",\"\",CELL(\"Inhalt\",Linkwahl!AK400))","v":""}]
["",{"$f":"IF(Linkwahl!AI401=\"\",\"\",CELL(\"Inhalt\",Linkwahl!AI401))","v":""},{"$f":"IF(Linkwahl!AJ401=\"\",\"\",CELL(\"Inhalt\",Linkwahl!AJ401))","v":""},{"$f":"IF(Linkwahl!AK401=\"\",\"\",CELL(\"Inhalt\",Linkwahl!AK401))","v":""}]
["",{"$f":"IF(Linkwahl!AI402=\"\",\"\",CELL(\"Inhalt\",Linkwahl!AI402))","v":""},{"$f":"IF(Linkwahl!AJ402=\"\",\"\",CELL(\"Inhalt\",Linkwahl!AJ402))","v":""},{"$f":"IF(Linkwahl!AK402=\"\",\"\",CELL(\"Inhalt\",Linkwahl!AK402))","v":""}]
["",{"$f":"IF(Linkwahl!AI403=\"\",\"\",CELL(\"Inhalt\",Linkwahl!AI403))","v":""},{"$f":"IF(Linkwahl!AJ403=\"\",\"\",CELL(\"Inhalt\",Linkwahl!AJ403))","v":""},{"$f":"IF(Linkwahl!AK403=\"\",\"\",CELL(\"Inhalt\",Linkwahl!AK403))","v":""}]
["",{"$f":"IF(Linkwahl!AI404=\"\",\"\",CELL(\"Inhalt\",Linkwahl!AI404))","v":""},{"$f":"IF(Linkwahl!AJ404=\"\",\"\",CELL(\"Inhalt\",Linkwahl!AJ404))","v":""},{"$f":"IF(Linkwahl!AK404=\"\",\"\",CELL(\"Inhalt\",Linkwahl!AK404))","v":""}]
["",{"$f":"IF(Linkwahl!AI405=\"\",\"\",CELL(\"Inhalt\",Linkwahl!AI405))","v":""},{"$f":"IF(Linkwahl!AJ405=\"\",\"\",CELL(\"Inhalt\",Linkwahl!AJ405))","v":""},{"$f":"IF(Linkwahl!AK405=\"\",\"\",CELL(\"Inhalt\",Linkwahl!AK405))","v":""}]
["",{"$f":"IF(Linkwahl!AI406=\"\",\"\",CELL(\"Inhalt\",Linkwahl!AI406))","v":""},{"$f":"IF(Linkwahl!AJ406=\"\",\"\",CELL(\"Inhalt\",Linkwahl!AJ406))","v":""},{"$f":"IF(Linkwahl!AK406=\"\",\"\",CELL(\"Inhalt\",Linkwahl!AK406))","v":""}]
["",{"$f":"IF(Linkwahl!AI407=\"\",\"\",CELL(\"Inhalt\",Linkwahl!AI407))","v":""},{"$f":"IF(Linkwahl!AJ407=\"\",\"\",CELL(\"Inhalt\",Linkwahl!AJ407))","v":""},{"$f":"IF(Linkwahl!AK407=\"\",\"\",CELL(\"Inhalt\",Linkwahl!AK407))","v":""}]
["",{"$f":"IF(Linkwahl!AI408=\"\",\"\",CELL(\"Inhalt\",Linkwahl!AI408))","v":""},{"$f":"IF(Linkwahl!AJ408=\"\",\"\",CELL(\"Inhalt\",Linkwahl!AJ408))","v":""},{"$f":"IF(Linkwahl!AK408=\"\",\"\",CELL(\"Inhalt\",Linkwahl!AK408))","v":""}]
["",{"$f":"IF(Linkwahl!AI409=\"\",\"\",CELL(\"Inhalt\",Linkwahl!AI409))","v":""},{"$f":"IF(Linkwahl!AJ409=\"\",\"\",CELL(\"Inhalt\",Linkwahl!AJ409))","v":""},{"$f":"IF(Linkwahl!AK409=\"\",\"\",CELL(\"Inhalt\",Linkwahl!AK409))","v":""}]
["",{"$f":"IF(Linkwahl!AI410=\"\",\"\",CELL(\"Inhalt\",Linkwahl!AI410))","v":""},{"$f":"IF(Linkwahl!AJ410=\"\",\"\",CELL(\"Inhalt\",Linkwahl!AJ410))","v":""},{"$f":"IF(Linkwahl!AK410=\"\",\"\",CELL(\"Inhalt\",Linkwahl!AK410))","v":""}]
["",{"$f":"IF(Linkwahl!AI411=\"\",\"\",CELL(\"Inhalt\",Linkwahl!AI411))","v":""},{"$f":"IF(Linkwahl!AJ411=\"\",\"\",CELL(\"Inhalt\",Linkwahl!AJ411))","v":""},{"$f":"IF(Linkwahl!AK411=\"\",\"\",CELL(\"Inhalt\",Linkwahl!AK411))","v":""}]
["",{"$f":"IF(Linkwahl!AI412=\"\",\"\",CELL(\"Inhalt\",Linkwahl!AI412))","v":""},{"$f":"IF(Linkwahl!AJ412=\"\",\"\",CELL(\"Inhalt\",Linkwahl!AJ412))","v":""},{"$f":"IF(Linkwahl!AK412=\"\",\"\",CELL(\"Inhalt\",Linkwahl!AK412))","v":""}]
["",{"$f":"IF(Linkwahl!AI413=\"\",\"\",CELL(\"Inhalt\",Linkwahl!AI413))","v":""},{"$f":"IF(Linkwahl!AJ413=\"\",\"\",CELL(\"Inhalt\",Linkwahl!AJ413))","v":""},{"$f":"IF(Linkwahl!AK413=\"\",\"\",CELL(\"Inhalt\",Linkwahl!AK413))","v":""}]
["",{"$f":"IF(Linkwahl!AI414=\"\",\"\",CELL(\"Inhalt\",Linkwahl!AI414))","v":""},{"$f":"IF(Linkwahl!AJ414=\"\",\"\",CELL(\"Inhalt\",Linkwahl!AJ414))","v":""},{"$f":"IF(Linkwahl!AK414=\"\",\"\",CELL(\"Inhalt\",Linkwahl!AK414))","v":""}]
["",{"$f":"IF(Linkwahl!AI415=\"\",\"\",CELL(\"Inhalt\",Linkwahl!AI415))","v":""},{"$f":"IF(Linkwahl!AJ415=\"\",\"\",CELL(\"Inhalt\",Linkwahl!AJ415))","v":""},{"$f":"IF(Linkwahl!AK415=\"\",\"\",CELL(\"Inhalt\",Linkwahl!AK415))","v":""}]
["",{"$f":"IF(Linkwahl!AI416=\"\",\"\",CELL(\"Inhalt\",Linkwahl!AI416))","v":""},{"$f":"IF(Linkwahl!AJ416=\"\",\"\",CELL(\"Inhalt\",Linkwahl!AJ416))","v":""},{"$f":"IF(Linkwahl!AK416=\"\",\"\",CELL(\"Inhalt\",Linkwahl!AK416))","v":""}]
["",{"$f":"IF(Linkwahl!AI417=\"\",\"\",CELL(\"Inhalt\",Linkwahl!AI417))","v":""},{"$f":"IF(Linkwahl!AJ417=\"\",\"\",CELL(\"Inhalt\",Linkwahl!AJ417))","v":""},{"$f":"IF(Linkwahl!AK417=\"\",\"\",CELL(\"Inhalt\",Linkwahl!AK417))","v":""}]
["",{"$f":"IF(Linkwahl!AI418=\"\",\"\",CELL(\"Inhalt\",Linkwahl!AI418))","v":""},{"$f":"IF(Linkwahl!AJ418=\"\",\"\",CELL(\"Inhalt\",Linkwahl!AJ418))","v":""},{"$f":"IF(Linkwahl!AK418=\"\",\"\",CELL(\"Inhalt\",Linkwahl!AK418))","v":""}]
["",{"$f":"IF(Linkwahl!AI419=\"\",\"\",CELL(\"Inhalt\",Linkwahl!AI419))","v":""},{"$f":"IF(Linkwahl!AJ419=\"\",\"\",CELL(\"Inhalt\",Linkwahl!AJ419))","v":""},{"$f":"IF(Linkwahl!AK419=\"\",\"\",CELL(\"Inhalt\",Linkwahl!AK419))","v":""}]
["",{"$f":"IF(Linkwahl!AI420=\"\",\"\",CELL(\"Inhalt\",Linkwahl!AI420))","v":""},{"$f":"IF(Linkwahl!AJ420=\"\",\"\",CELL(\"Inhalt\",Linkwahl!AJ420))","v":""},{"$f":"IF(Linkwahl!AK420=\"\",\"\",CELL(\"Inhalt\",Linkwahl!AK420))","v":""}]
["",{"$f":"IF(Linkwahl!AI421=\"\",\"\",CELL(\"Inhalt\",Linkwahl!AI421))","v":""},{"$f":"IF(Linkwahl!AJ421=\"\",\"\",CELL(\"Inhalt\",Linkwahl!AJ421))","v":""},{"$f":"IF(Linkwahl!AK421=\"\",\"\",CELL(\"Inhalt\",Linkwahl!AK421))","v":""}]
["",{"$f":"IF(Linkwahl!AI422=\"\",\"\",CELL(\"Inhalt\",Linkwahl!AI422))","v":""},{"$f":"IF(Linkwahl!AJ422=\"\",\"\",CELL(\"Inhalt\",Linkwahl!AJ422))","v":""},{"$f":"IF(Linkwahl!AK422=\"\",\"\",CELL(\"Inhalt\",Linkwahl!AK422))","v":""}]
["",{"$f":"IF(Linkwahl!AI423=\"\",\"\",CELL(\"Inhalt\",Linkwahl!AI423))","v":""},{"$f":"IF(Linkwahl!AJ423=\"\",\"\",CELL(\"Inhalt\",Linkwahl!AJ423))","v":""},{"$f":"IF(Linkwahl!AK423=\"\",\"\",CELL(\"Inhalt\",Linkwahl!AK423))","v":""}]
["",{"$f":"IF(Linkwahl!AI424=\"\",\"\",CELL(\"Inhalt\",Linkwahl!AI424))","v":""},{"$f":"IF(Linkwahl!AJ424=\"\",\"\",CELL(\"Inhalt\",Linkwahl!AJ424))","v":""},{"$f":"IF(Linkwahl!AK424=\"\",\"\",CELL(\"Inhalt\",Linkwahl!AK424))","v":""}]
["",{"$f":"IF(Linkwahl!AI425=\"\",\"\",CELL(\"Inhalt\",Linkwahl!AI425))","v":""},{"$f":"IF(Linkwahl!AJ425=\"\",\"\",CELL(\"Inhalt\",Linkwahl!AJ425))","v":""},{"$f":"IF(Linkwahl!AK425=\"\",\"\",CELL(\"Inhalt\",Linkwahl!AK425))","v":""}]
["",{"$f":"IF(Linkwahl!AI426=\"\",\"\",CELL(\"Inhalt\",Linkwahl!AI426))","v":""},{"$f":"IF(Linkwahl!AJ426=\"\",\"\",CELL(\"Inhalt\",Linkwahl!AJ426))","v":""},{"$f":"IF(Linkwahl!AK426=\"\",\"\",CELL(\"Inhalt\",Linkwahl!AK426))","v":""}]
[{"$f":"IF(B260=\"\",\"\",HYPERLINK(\"http://www.zhlex.zh.ch/Erlass.html?Open&Ordnr=\"&C260,\"LS-Link\"))","v":""},{"$f":"IF(Linkwahl!AI427=\"\",\"\",CELL(\"Inhalt\",Linkwahl!AI427))","v":""},{"$f":"IF(Linkwahl!AJ427=\"\",\"\",CELL(\"Inhalt\",Linkwahl!AJ427))","v":""},{"$f":"IF(Linkwahl!AK427=\"\",\"\",CELL(\"Inhalt\",Linkwahl!AK427))","v":""}]
["",{"$f":"IF(Linkwahl!AI428=\"\",\"\",CELL(\"Inhalt\",Linkwahl!AI428))","v":""},{"$f":"IF(Linkwahl!AJ428=\"\",\"\",CELL(\"Inhalt\",Linkwahl!AJ428))","v":""},{"$f":"IF(Linkwahl!AK428=\"\",\"\",CELL(\"Inhalt\",Linkwahl!AK428))","v":""}]
["",{"$f":"IF(Linkwahl!AI429=\"\",\"\",CELL(\"Inhalt\",Linkwahl!AI429))","v":""},{"$f":"IF(Linkwahl!AJ429=\"\",\"\",CELL(\"Inhalt\",Linkwahl!AJ429))","v":""},{"$f":"IF(Linkwahl!AK429=\"\",\"\",CELL(\"Inhalt\",Linkwahl!AK429))","v":""}]
["",{"$f":"IF(Linkwahl!AI430=\"\",\"\",CELL(\"Inhalt\",Linkwahl!AI430))","v":""},{"$f":"IF(Linkwahl!AJ430=\"\",\"\",CELL(\"Inhalt\",Linkwahl!AJ430))","v":""},{"$f":"IF(Linkwahl!AK430=\"\",\"\",CELL(\"Inhalt\",Linkwahl!AK430))","v":""}]
["",{"$f":"IF(Linkwahl!AI431=\"\",\"\",CELL(\"Inhalt\",Linkwahl!AI431))","v":""},{"$f":"IF(Linkwahl!AJ431=\"\",\"\",CELL(\"Inhalt\",Linkwahl!AJ431))","v":""},{"$f":"IF(Linkwahl!AK431=\"\",\"\",CELL(\"Inhalt\",Linkwahl!AK431))","v":""}]
["",{"$f":"IF(Linkwahl!AI432=\"\",\"\",CELL(\"Inhalt\",Linkwahl!AI432))","v":""},{"$f":"IF(Linkwahl!AJ432=\"\",\"\",CELL(\"Inhalt\",Linkwahl!AJ432))","v":""},{"$f":"IF(Linkwahl!AK432=\"\",\"\",CELL(\"Inhalt\",Linkwahl!AK432))","v":""}]
["",{"$f":"IF(Linkwahl!AI433=\"\",\"\",CELL(\"Inhalt\",Linkwahl!AI433))","v":""},{"$f":"IF(Linkwahl!AJ433=\"\",\"\",CELL(\"Inhalt\",Linkwahl!AJ433))","v":""},{"$f":"IF(Linkwahl!AK433=\"\",\"\",CELL(\"Inhalt\",Linkwahl!AK433))","v":""}]
["",{"$f":"IF(Linkwahl!AI434=\"\",\"\",CELL(\"Inhalt\",Linkwahl!AI434))","v":""},{"$f":"IF(Linkwahl!AJ434=\"\",\"\",CELL(\"Inhalt\",Linkwahl!AJ434))","v":""},{"$f":"IF(Linkwahl!AK434=\"\",\"\",CELL(\"Inhalt\",Linkwahl!AK434))","v":""}]
["",{"$f":"IF(Linkwahl!AI435=\"\",\"\",CELL(\"Inhalt\",Linkwahl!AI435))","v":""},{"$f":"IF(Linkwahl!AJ435=\"\",\"\",CELL(\"Inhalt\",Linkwahl!AJ435))","v":""},{"$f":"IF(Linkwahl!AK435=\"\",\"\",CELL(\"Inhalt\",Linkwahl!AK435))","v":""}]
["",{"$f":"IF(Linkwahl!AI436=\"\",\"\",CELL(\"Inhalt\",Linkwahl!AI436))","v":""},{"$f":"IF(Linkwahl!AJ436=\"\",\"\",CELL(\"Inhalt\",Linkwahl!AJ436))","v":""},{"$f":"IF(Linkwahl!AK436=\"\",\"\",CELL(\"Inhalt\",Linkwahl!AK436))","v":""}]
["",{"$f":"IF(Linkwahl!AI437=\"\",\"\",CELL(\"Inhalt\",Linkwahl!AI437))","v":""},{"$f":"IF(Linkwahl!AJ437=\"\",\"\",CELL(\"Inhalt\",Linkwahl!AJ437))","v":""},{"$f":"IF(Linkwahl!AK437=\"\",\"\",CELL(\"Inhalt\",Linkwahl!AK437))","v":""}]
["",{"$f":"IF(Linkwahl!AI438=\"\",\"\",CELL(\"Inhalt\",Linkwahl!AI438))","v":""},{"$f":"IF(Linkwahl!AJ438=\"\",\"\",CELL(\"Inhalt\",Linkwahl!AJ438))","v":""},{"$f":"IF(Linkwahl!AK438=\"\",\"\",CELL(\"Inhalt\",Linkwahl!AK438))","v":""}]
["",{"$f":"IF(Linkwahl!AI439=\"\",\"\",CELL(\"Inhalt\",Linkwahl!AI439))","v":""},{"$f":"IF(Linkwahl!AJ439=\"\",\"\",CELL(\"Inhalt\",Linkwahl!AJ439))","v":""},{"$f":"IF(Linkwahl!AK439=\"\",\"\",CELL(\"Inhalt\",Linkwahl!AK439))","v":""}]
["",{"$f":"IF(Linkwahl!AI440=\"\",\"\",CELL(\"Inhalt\",Linkwahl!AI440))","v":""},{"$f":"IF(Linkwahl!AJ440=\"\",\"\",CELL(\"Inhalt\",Linkwahl!AJ440))","v":""},{"$f":"IF(Linkwahl!AK440=\"\",\"\",CELL(\"Inhalt\",Linkwahl!AK440))","v":""}]
["",{"$f":"IF(Linkwahl!AI441=\"\",\"\",CELL(\"Inhalt\",Linkwahl!AI441))","v":""},{"$f":"IF(Linkwahl!AJ441=\"\",\"\",CELL(\"Inhalt\",Linkwahl!AJ441))","v":""},{"$f":"IF(Linkwahl!AK441=\"\",\"\",CELL(\"Inhalt\",Linkwahl!AK441))","v":""}]
["",{"$f":"IF(Linkwahl!AI442=\"\",\"\",CELL(\"Inhalt\",Linkwahl!AI442))","v":""},{"$f":"IF(Linkwahl!AJ442=\"\",\"\",CELL(\"Inhalt\",Linkwahl!AJ442))","v":""},{"$f":"IF(Linkwahl!AK442=\"\",\"\",CELL(\"Inhalt\",Linkwahl!AK442))","v":""}]
["",{"$f":"IF(Linkwahl!AI443=\"\",\"\",CELL(\"Inhalt\",Linkwahl!AI443))","v":""},{"$f":"IF(Linkwahl!AJ443=\"\",\"\",CELL(\"Inhalt\",Linkwahl!AJ443))","v":""},{"$f":"IF(Linkwahl!AK443=\"\",\"\",CELL(\"Inhalt\",Linkwahl!AK443))","v":""}]
["",{"$f":"IF(Linkwahl!AI444=\"\",\"\",CELL(\"Inhalt\",Linkwahl!AI444))","v":""},{"$f":"IF(Linkwahl!AJ444=\"\",\"\",CELL(\"Inhalt\",Linkwahl!AJ444))","v":""},{"$f":"IF(Linkwahl!AK444=\"\",\"\",CELL(\"Inhalt\",Linkwahl!AK444))","v":""}]
["",{"$f":"IF(Linkwahl!AI445=\"\",\"\",CELL(\"Inhalt\",Linkwahl!AI445))","v":""},{"$f":"IF(Linkwahl!AJ445=\"\",\"\",CELL(\"Inhalt\",Linkwahl!AJ445))","v":""},{"$f":"IF(Linkwahl!AK445=\"\",\"\",CELL(\"Inhalt\",Linkwahl!AK445))","v":""}]
["",{"$f":"IF(Linkwahl!AI446=\"\",\"\",CELL(\"Inhalt\",Linkwahl!AI446))","v":""},{"$f":"IF(Linkwahl!AJ446=\"\",\"\",CELL(\"Inhalt\",Linkwahl!AJ446))","v":""},{"$f":"IF(Linkwahl!AK446=\"\",\"\",CELL(\"Inhalt\",Linkwahl!AK446))","v":""}]
["",{"$f":"IF(Linkwahl!AI447=\"\",\"\",CELL(\"Inhalt\",Linkwahl!AI447))","v":""},{"$f":"IF(Linkwahl!AJ447=\"\",\"\",CELL(\"Inhalt\",Linkwahl!AJ447))","v":""},{"$f":"IF(Linkwahl!AK447=\"\",\"\",CELL(\"Inhalt\",Linkwahl!AK447))","v":""}]
["",{"$f":"IF(Linkwahl!AI448=\"\",\"\",CELL(\"Inhalt\",Linkwahl!AI448))","v":""},{"$f":"IF(Linkwahl!AJ448=\"\",\"\",CELL(\"Inhalt\",Linkwahl!AJ448))","v":""},{"$f":"IF(Linkwahl!AK448=\"\",\"\",CELL(\"Inhalt\",Linkwahl!AK448))","v":""}]
["",{"$f":"IF(Linkwahl!AI449=\"\",\"\",CELL(\"Inhalt\",Linkwahl!AI449))","v":""},{"$f":"IF(Linkwahl!AJ449=\"\",\"\",CELL(\"Inhalt\",Linkwahl!AJ449))","v":""},{"$f":"IF(Linkwahl!AK449=\"\",\"\",CELL(\"Inhalt\",Linkwahl!AK449))","v":""}]
["",{"$f":"IF(Linkwahl!AI450=\"\",\"\",CELL(\"Inhalt\",Linkwahl!AI450))","v":""},{"$f":"IF(Linkwahl!AJ450=\"\",\"\",CELL(\"Inhalt\",Linkwahl!AJ450))","v":""},{"$f":"IF(Linkwahl!AK450=\"\",\"\",CELL(\"Inhalt\",Linkwahl!AK450))","v":""}]
["",{"$f":"IF(Linkwahl!AI451=\"\",\"\",CELL(\"Inhalt\",Linkwahl!AI451))","v":""},{"$f":"IF(Linkwahl!AJ451=\"\",\"\",CELL(\"Inhalt\",Linkwahl!AJ451))","v":""},{"$f":"IF(Linkwahl!AK451=\"\",\"\",CELL(\"Inhalt\",Linkwahl!AK451))","v":""}]
["",{"$f":"IF(Linkwahl!AI452=\"\",\"\",CELL(\"Inhalt\",Linkwahl!AI452))","v":""},{"$f":"IF(Linkwahl!AJ452=\"\",\"\",CELL(\"Inhalt\",Linkwahl!AJ452))","v":""},{"$f":"IF(Linkwahl!AK452=\"\",\"\",CELL(\"Inhalt\",Linkwahl!AK452))","v":""}]
["",{"$f":"IF(Linkwahl!AI453=\"\",\"\",CELL(\"Inhalt\",Linkwahl!AI453))","v":""},{"$f":"IF(Linkwahl!AJ453=\"\",\"\",CELL(\"Inhalt\",Linkwahl!AJ453))","v":""},{"$f":"IF(Linkwahl!AK453=\"\",\"\",CELL(\"Inhalt\",Linkwahl!AK453))","v":""}]
["",{"$f":"IF(Linkwahl!AI454=\"\",\"\",CELL(\"Inhalt\",Linkwahl!AI454))","v":""},{"$f":"IF(Linkwahl!AJ454=\"\",\"\",CELL(\"Inhalt\",Linkwahl!AJ454))","v":""},{"$f":"IF(Linkwahl!AK454=\"\",\"\",CELL(\"Inhalt\",Linkwahl!AK454))","v":""}]
["",{"$f":"IF(Linkwahl!AI455=\"\",\"\",CELL(\"Inhalt\",Linkwahl!AI455))","v":""},{"$f":"IF(Linkwahl!AJ455=\"\",\"\",CELL(\"Inhalt\",Linkwahl!AJ455))","v":""},{"$f":"IF(Linkwahl!AK455=\"\",\"\",CELL(\"Inhalt\",Linkwahl!AK455))","v":""}]
["",{"$f":"IF(Linkwahl!AI456=\"\",\"\",CELL(\"Inhalt\",Linkwahl!AI456))","v":""},{"$f":"IF(Linkwahl!AJ456=\"\",\"\",CELL(\"Inhalt\",Linkwahl!AJ456))","v":""},{"$f":"IF(Linkwahl!AK456=\"\",\"\",CELL(\"Inhalt\",Linkwahl!AK456))","v":""}]
["",{"$f":"IF(Linkwahl!AI457=\"\",\"\",CELL(\"Inhalt\",Linkwahl!AI457))","v":""},{"$f":"IF(Linkwahl!AJ457=\"\",\"\",CELL(\"Inhalt\",Linkwahl!AJ457))","v":""},{"$f":"IF(Linkwahl!AK457=\"\",\"\",CELL(\"Inhalt\",Linkwahl!AK457))","v":""}]
["",{"$f":"IF(Linkwahl!AI458=\"\",\"\",CELL(\"Inhalt\",Linkwahl!AI458))","v":""},{"$f":"IF(Linkwahl!AJ458=\"\",\"\",CELL(\"Inhalt\",Linkwahl!AJ458))","v":""},{"$f":"IF(Linkwahl!AK458=\"\",\"\",CELL(\"Inhalt\",Linkwahl!AK458))","v":""}]
["",{"$f":"IF(Linkwahl!AI459=\"\",\"\",CELL(\"Inhalt\",Linkwahl!AI459))","v":""},{"$f":"IF(Linkwahl!AJ459=\"\",\"\",CELL(\"Inhalt\",Linkwahl!AJ459))","v":""},{"$f":"IF(Linkwahl!AK459=\"\",\"\",CELL(\"Inhalt\",Linkwahl!AK459))","v":""}]
["",{"$f":"IF(Linkwahl!AI460=\"\",\"\",CELL(\"Inhalt\",Linkwahl!AI460))","v":""},{"$f":"IF(Linkwahl!AJ460=\"\",\"\",CELL(\"Inhalt\",Linkwahl!AJ460))","v":""},{"$f":"IF(Linkwahl!AK460=\"\",\"\",CELL(\"Inhalt\",Linkwahl!AK460))","v":""}]
["",{"$f":"IF(Linkwahl!AI461=\"\",\"\",CELL(\"Inhalt\",Linkwahl!AI461))","v":""},{"$f":"IF(Linkwahl!AJ461=\"\",\"\",CELL(\"Inhalt\",Linkwahl!AJ461))","v":""},{"$f":"IF(Linkwahl!AK461=\"\",\"\",CELL(\"Inhalt\",Linkwahl!AK461))","v":""}]
["",{"$f":"IF(Linkwahl!AI462=\"\",\"\",CELL(\"Inhalt\",Linkwahl!AI462))","v":""},{"$f":"IF(Linkwahl!AJ462=\"\",\"\",CELL(\"Inhalt\",Linkwahl!AJ462))","v":""},{"$f":"IF(Linkwahl!AK462=\"\",\"\",CELL(\"Inhalt\",Linkwahl!AK462))","v":""}]
["",{"$f":"IF(Linkwahl!AI463=\"\",\"\",CELL(\"Inhalt\",Linkwahl!AI463))","v":""},{"$f":"IF(Linkwahl!AJ463=\"\",\"\",CELL(\"Inhalt\",Linkwahl!AJ463))","v":""},{"$f":"IF(Linkwahl!AK463=\"\",\"\",CELL(\"Inhalt\",Linkwahl!AK463))","v":""}]
["",{"$f":"IF(Linkwahl!AI464=\"\",\"\",CELL(\"Inhalt\",Linkwahl!AI464))","v":""},{"$f":"IF(Linkwahl!AJ464=\"\",\"\",CELL(\"Inhalt\",Linkwahl!AJ464))","v":""},{"$f":"IF(Linkwahl!AK464=\"\",\"\",CELL(\"Inhalt\",Linkwahl!AK464))","v":""}]
["",{"$f":"IF(Linkwahl!AI465=\"\",\"\",CELL(\"Inhalt\",Linkwahl!AI465))","v":""},{"$f":"IF(Linkwahl!AJ465=\"\",\"\",CELL(\"Inhalt\",Linkwahl!AJ465))","v":""},{"$f":"IF(Linkwahl!AK465=\"\",\"\",CELL(\"Inhalt\",Linkwahl!AK465))","v":""}]
["",{"$f":"IF(Linkwahl!AI466=\"\",\"\",CELL(\"Inhalt\",Linkwahl!AI466))","v":""},{"$f":"IF(Linkwahl!AJ466=\"\",\"\",CELL(\"Inhalt\",Linkwahl!AJ466))","v":""},{"$f":"IF(Linkwahl!AK466=\"\",\"\",CELL(\"Inhalt\",Linkwahl!AK466))","v":""}]
["",{"$f":"IF(Linkwahl!AI467=\"\",\"\",CELL(\"Inhalt\",Linkwahl!AI467))","v":""},{"$f":"IF(Linkwahl!AJ467=\"\",\"\",CELL(\"Inhalt\",Linkwahl!AJ467))","v":""},{"$f":"IF(Linkwahl!AK467=\"\",\"\",CELL(\"Inhalt\",Linkwahl!AK467))","v":""}]
["",{"$f":"IF(Linkwahl!AI468=\"\",\"\",CELL(\"Inhalt\",Linkwahl!AI468))","v":""},{"$f":"IF(Linkwahl!AJ468=\"\",\"\",CELL(\"Inhalt\",Linkwahl!AJ468))","v":""},{"$f":"IF(Linkwahl!AK468=\"\",\"\",CELL(\"Inhalt\",Linkwahl!AK468))","v":""}]
["",{"$f":"IF(Linkwahl!AI469=\"\",\"\",CELL(\"Inhalt\",Linkwahl!AI469))","v":""},{"$f":"IF(Linkwahl!AJ469=\"\",\"\",CELL(\"Inhalt\",Linkwahl!AJ469))","v":""},{"$f":"IF(Linkwahl!AK469=\"\",\"\",CELL(\"Inhalt\",Linkwahl!AK469))","v":""}]
["",{"$f":"IF(Linkwahl!AI470=\"\",\"\",CELL(\"Inhalt\",Linkwahl!AI470))","v":""},{"$f":"IF(Linkwahl!AJ470=\"\",\"\",CELL(\"Inhalt\",Linkwahl!AJ470))","v":""},{"$f":"IF(Linkwahl!AK470=\"\",\"\",CELL(\"Inhalt\",Linkwahl!AK470))","v":""}]
["",{"$f":"IF(Linkwahl!AI471=\"\",\"\",CELL(\"Inhalt\",Linkwahl!AI471))","v":""},{"$f":"IF(Linkwahl!AJ471=\"\",\"\",CELL(\"Inhalt\",Linkwahl!AJ471))","v":""},{"$f":"IF(Linkwahl!AK471=\"\",\"\",CELL(\"Inhalt\",Linkwahl!AK471))","v":""}]
["",{"$f":"IF(Linkwahl!AI472=\"\",\"\",CELL(\"Inhalt\",Linkwahl!AI472))","v":""},{"$f":"IF(Linkwahl!AJ472=\"\",\"\",CELL(\"Inhalt\",Linkwahl!AJ472))","v":""},{"$f":"IF(Linkwahl!AK472=\"\",\"\",CELL(\"Inhalt\",Linkwahl!AK472))","v":""}]
["",{"$f":"IF(Linkwahl!AI473=\"\",\"\",CELL(\"Inhalt\",Linkwahl!AI473))","v":""},{"$f":"IF(Linkwahl!AJ473=\"\",\"\",CELL(\"Inhalt\",Linkwahl!AJ473))","v":""},{"$f":"IF(Linkwahl!AK473=\"\",\"\",CELL(\"Inhalt\",Linkwahl!AK473))","v":""}]
["",{"$f":"IF(Linkwahl!AI474=\"\",\"\",CELL(\"Inhalt\",Linkwahl!AI474))","v":""},{"$f":"IF(Linkwahl!AJ474=\"\",\"\",CELL(\"Inhalt\",Linkwahl!AJ474))","v":""},{"$f":"IF(Linkwahl!AK474=\"\",\"\",CELL(\"Inhalt\",Linkwahl!AK474))","v":""}]
["",{"$f":"IF(Linkwahl!AI475=\"\",\"\",CELL(\"Inhalt\",Linkwahl!AI475))","v":""},{"$f":"IF(Linkwahl!AJ475=\"\",\"\",CELL(\"Inhalt\",Linkwahl!AJ475))","v":""},{"$f":"IF(Linkwahl!AK475=\"\",\"\",CELL(\"Inhalt\",Linkwahl!AK475))","v":""}]
["",{"$f":"IF(Linkwahl!AI476=\"\",\"\",CELL(\"Inhalt\",Linkwahl!AI476))","v":""},{"$f":"IF(Linkwahl!AJ476=\"\",\"\",CELL(\"Inhalt\",Linkwahl!AJ476))","v":""},{"$f":"IF(Linkwahl!AK476=\"\",\"\",CELL(\"Inhalt\",Linkwahl!AK476))","v":""}]
["",{"$f":"IF(Linkwahl!AI477=\"\",\"\",CELL(\"Inhalt\",Linkwahl!AI477))","v":""},{"$f":"IF(Linkwahl!AJ477=\"\",\"\",CELL(\"Inhalt\",Linkwahl!AJ477))","v":""},{"$f":"IF(Linkwahl!AK477=\"\",\"\",CELL(\"Inhalt\",Linkwahl!AK477))","v":""}]
["",{"$f":"IF(Linkwahl!AI478=\"\",\"\",CELL(\"Inhalt\",Linkwahl!AI478))","v":""},{"$f":"IF(Linkwahl!AJ478=\"\",\"\",CELL(\"Inhalt\",Linkwahl!AJ478))","v":""},{"$f":"IF(Linkwahl!AK478=\"\",\"\",CELL(\"Inhalt\",Linkwahl!AK478))","v":""}]
["",{"$f":"IF(Linkwahl!AI479=\"\",\"\",CELL(\"Inhalt\",Linkwahl!AI479))","v":""},{"$f":"IF(Linkwahl!AJ479=\"\",\"\",CELL(\"Inhalt\",Linkwahl!AJ479))","v":""},{"$f":"IF(Linkwahl!AK479=\"\",\"\",CELL(\"Inhalt\",Linkwahl!AK479))","v":""}]
["",{"$f":"IF(Linkwahl!AI480=\"\",\"\",CELL(\"Inhalt\",Linkwahl!AI480))","v":""},{"$f":"IF(Linkwahl!AJ480=\"\",\"\",CELL(\"Inhalt\",Linkwahl!AJ480))","v":""},{"$f":"IF(Linkwahl!AK480=\"\",\"\",CELL(\"Inhalt\",Linkwahl!AK480))","v":""}]
["",{"$f":"IF(Linkwahl!AI481=\"\",\"\",CELL(\"Inhalt\",Linkwahl!AI481))","v":""},{"$f":"IF(Linkwahl!AJ481=\"\",\"\",CELL(\"Inhalt\",Linkwahl!AJ481))","v":""},{"$f":"IF(Linkwahl!AK481=\"\",\"\",CELL(\"Inhalt\",Linkwahl!AK481))","v":""}]
["",{"$f":"IF(Linkwahl!AI482=\"\",\"\",CELL(\"Inhalt\",Linkwahl!AI482))","v":""},{"$f":"IF(Linkwahl!AJ482=\"\",\"\",CELL(\"Inhalt\",Linkwahl!AJ482))","v":""},{"$f":"IF(Linkwahl!AK482=\"\",\"\",CELL(\"Inhalt\",Linkwahl!AK482))","v":""}]
["",{"$f":"IF(Linkwahl!AI483=\"\",\"\",CELL(\"Inhalt\",Linkwahl!AI483))","v":""},{"$f":"IF(Linkwahl!AJ483=\"\",\"\",CELL(\"Inhalt\",Linkwahl!AJ483))","v":""},{"$f":"IF(Linkwahl!AK483=\"\",\"\",CELL(\"Inhalt\",Linkwahl!AK483))","v":""}]
["",{"$f":"IF(Linkwahl!AI484=\"\",\"\",CELL(\"Inhalt\",Linkwahl!AI484))","v":""},{"$f":"IF(Linkwahl!AJ484=\"\",\"\",CELL(\"Inhalt\",Linkwahl!AJ484))","v":""},{"$f":"IF(Linkwahl!AK484=\"\",\"\",CELL(\"Inhalt\",Linkwahl!AK484))","v":""}]
["",{"$f":"IF(Linkwahl!AI485=\"\",\"\",CELL(\"Inhalt\",Linkwahl!AI485))","v":""},{"$f":"IF(Linkwahl!AJ485=\"\",\"\",CELL(\"Inhalt\",Linkwahl!AJ485))","v":""},{"$f":"IF(Linkwahl!AK485=\"\",\"\",CELL(\"Inhalt\",Linkwahl!AK485))","v":""}]
["",{"$f":"IF(Linkwahl!AI486=\"\",\"\",CELL(\"Inhalt\",Linkwahl!AI486))","v":""},{"$f":"IF(Linkwahl!AJ486=\"\",\"\",CELL(\"Inhalt\",Linkwahl!AJ486))","v":""},{"$f":"IF(Linkwahl!AK486=\"\",\"\",CELL(\"Inhalt\",Linkwahl!AK486))","v":""}]
["",{"$f":"IF(Linkwahl!AI487=\"\",\"\",CELL(\"Inhalt\",Linkwahl!AI487))","v":""},{"$f":"IF(Linkwahl!AJ487=\"\",\"\",CELL(\"Inhalt\",Linkwahl!AJ487))","v":""},{"$f":"IF(Linkwahl!AK487=\"\",\"\",CELL(\"Inhalt\",Linkwahl!AK487))","v":""}]
["",{"$f":"IF(Linkwahl!AI488=\"\",\"\",CELL(\"Inhalt\",Linkwahl!AI488))","v":""},{"$f":"IF(Linkwahl!AJ488=\"\",\"\",CELL(\"Inhalt\",Linkwahl!AJ488))","v":""},{"$f":"IF(Linkwahl!AK488=\"\",\"\",CELL(\"Inhalt\",Linkwahl!AK488))","v":""}]
["",{"$f":"IF(Linkwahl!AI489=\"\",\"\",CELL(\"Inhalt\",Linkwahl!AI489))","v":""},{"$f":"IF(Linkwahl!AJ489=\"\",\"\",CELL(\"Inhalt\",Linkwahl!AJ489))","v":""},{"$f":"IF(Linkwahl!AK489=\"\",\"\",CELL(\"Inhalt\",Linkwahl!AK489))","v":""}]
["",{"$f":"IF(Linkwahl!AI490=\"\",\"\",CELL(\"Inhalt\",Linkwahl!AI490))","v":""},{"$f":"IF(Linkwahl!AJ490=\"\",\"\",CELL(\"Inhalt\",Linkwahl!AJ490))","v":""},{"$f":"IF(Linkwahl!AK490=\"\",\"\",CELL(\"Inhalt\",Linkwahl!AK490))","v":""}]
[{"$f":"IF(B324=\"\",\"\",HYPERLINK(\"http://www.zhlex.zh.ch/Erlass.html?Open&Ordnr=\"&C324,\"LS-Link\"))","v":""},{"$f":"IF(Linkwahl!AI491=\"\",\"\",CELL(\"Inhalt\",Linkwahl!AI491))","v":""},{"$f":"IF(Linkwahl!AJ491=\"\",\"\",CELL(\"Inhalt\",Linkwahl!AJ491))","v":""},{"$f":"IF(Linkwahl!AK491=\"\",\"\",CELL(\"Inhalt\",Linkwahl!AK491))","v":""}]
["",{"$f":"IF(Linkwahl!AI492=\"\",\"\",CELL(\"Inhalt\",Linkwahl!AI492))","v":""},{"$f":"IF(Linkwahl!AJ492=\"\",\"\",CELL(\"Inhalt\",Linkwahl!AJ492))","v":""},{"$f":"IF(Linkwahl!AK492=\"\",\"\",CELL(\"Inhalt\",Linkwahl!AK492))","v":""}]
["",{"$f":"IF(Linkwahl!AI493=\"\",\"\",CELL(\"Inhalt\",Linkwahl!AI493))","v":""},{"$f":"IF(Linkwahl!AJ493=\"\",\"\",CELL(\"Inhalt\",Linkwahl!AJ493))","v":""},{"$f":"IF(Linkwahl!AK493=\"\",\"\",CELL(\"Inhalt\",Linkwahl!AK493))","v":""}]
["",{"$f":"IF(Linkwahl!AI494=\"\",\"\",CELL(\"Inhalt\",Linkwahl!AI494))","v":""},{"$f":"IF(Linkwahl!AJ494=\"\",\"\",CELL(\"Inhalt\",Linkwahl!AJ494))","v":""},{"$f":"IF(Linkwahl!AK494=\"\",\"\",CELL(\"Inhalt\",Linkwahl!AK494))","v":""}]
["",{"$f":"IF(Linkwahl!AI495=\"\",\"\",CELL(\"Inhalt\",Linkwahl!AI495))","v":""},{"$f":"IF(Linkwahl!AJ495=\"\",\"\",CELL(\"Inhalt\",Linkwahl!AJ495))","v":""},{"$f":"IF(Linkwahl!AK495=\"\",\"\",CELL(\"Inhalt\",Linkwahl!AK495))","v":""}]
["",{"$f":"IF(Linkwahl!AI496=\"\",\"\",CELL(\"Inhalt\",Linkwahl!AI496))","v":""},{"$f":"IF(Linkwahl!AJ496=\"\",\"\",CELL(\"Inhalt\",Linkwahl!AJ496))","v":""},{"$f":"IF(Linkwahl!AK496=\"\",\"\",CELL(\"Inhalt\",Linkwahl!AK496))","v":""}]
["",{"$f":"IF(Linkwahl!AI497=\"\",\"\",CELL(\"Inhalt\",Linkwahl!AI497))","v":""},{"$f":"IF(Linkwahl!AJ497=\"\",\"\",CELL(\"Inhalt\",Linkwahl!AJ497))","v":""},{"$f":"IF(Linkwahl!AK497=\"\",\"\",CELL(\"Inhalt\",Linkwahl!AK497))","v":""}]
["",{"$f":"IF(Linkwahl!AI498=\"\",\"\",CELL(\"Inhalt\",Linkwahl!AI498))","v":""},{"$f":"IF(Linkwahl!AJ498=\"\",\"\",CELL(\"Inhalt\",Linkwahl!AJ498))","v":""},{"$f":"IF(Linkwahl!AK498=\"\",\"\",CELL(\"Inhalt\",Linkwahl!AK498))","v":""}]
["",{"$f":"IF(Linkwahl!AI499=\"\",\"\",CELL(\"Inhalt\",Linkwahl!AI499))","v":""},{"$f":"IF(Linkwahl!AJ499=\"\",\"\",CELL(\"Inhalt\",Linkwahl!AJ499))","v":""},{"$f":"IF(Linkwahl!AK499=\"\",\"\",CELL(\"Inhalt\",Linkwahl!AK499))","v":""}]
["",{"$f":"IF(Linkwahl!AI500=\"\",\"\",CELL(\"Inhalt\",Linkwahl!AI500))","v":""},{"$f":"IF(Linkwahl!AJ500=\"\",\"\",CELL(\"Inhalt\",Linkwahl!AJ500))","v":""},{"$f":"IF(Linkwahl!AK500=\"\",\"\",CELL(\"Inhalt\",Linkwahl!AK500))","v":""}]
["",{"$f":"IF(Linkwahl!AI501=\"\",\"\",CELL(\"Inhalt\",Linkwahl!AI501))","v":""},{"$f":"IF(Linkwahl!AJ501=\"\",\"\",CELL(\"Inhalt\",Linkwahl!AJ501))","v":""},{"$f":"IF(Linkwahl!AK501=\"\",\"\",CELL(\"Inhalt\",Linkwahl!AK501))","v":""}]
["",{"$f":"IF(Linkwahl!AI502=\"\",\"\",CELL(\"Inhalt\",Linkwahl!AI502))","v":""},{"$f":"IF(Linkwahl!AJ502=\"\",\"\",CELL(\"Inhalt\",Linkwahl!AJ502))","v":""},{"$f":"IF(Linkwahl!AK502=\"\",\"\",CELL(\"Inhalt\",Linkwahl!AK502))","v":""}]
["",{"$f":"IF(Linkwahl!AI503=\"\",\"\",CELL(\"Inhalt\",Linkwahl!AI503))","v":""},{"$f":"IF(Linkwahl!AJ503=\"\",\"\",CELL(\"Inhalt\",Linkwahl!AJ503))","v":""},{"$f":"IF(Linkwahl!AK503=\"\",\"\",CELL(\"Inhalt\",Linkwahl!AK503))","v":""}]
["",{"$f":"IF(Linkwahl!AI504=\"\",\"\",CELL(\"Inhalt\",Linkwahl!AI504))","v":""},{"$f":"IF(Linkwahl!AJ504=\"\",\"\",CELL(\"Inhalt\",Linkwahl!AJ504))","v":""},{"$f":"IF(Linkwahl!AK504=\"\",\"\",CELL(\"Inhalt\",Linkwahl!AK504))","v":""}]
["",{"$f":"IF(Linkwahl!AI505=\"\",\"\",CELL(\"Inhalt\",Linkwahl!AI505))","v":""},{"$f":"IF(Linkwahl!AJ505=\"\",\"\",CELL(\"Inhalt\",Linkwahl!AJ505))","v":""},{"$f":"IF(Linkwahl!AK505=\"\",\"\",CELL(\"Inhalt\",Linkwahl!AK505))","v":""}]
["",{"$f":"IF(Linkwahl!AI506=\"\",\"\",CELL(\"Inhalt\",Linkwahl!AI506))","v":""},{"$f":"IF(Linkwahl!AJ506=\"\",\"\",CELL(\"Inhalt\",Linkwahl!AJ506))","v":""},{"$f":"IF(Linkwahl!AK506=\"\",\"\",CELL(\"Inhalt\",Linkwahl!AK506))","v":""}]
["",{"$f":"IF(Linkwahl!AI507=\"\",\"\",CELL(\"Inhalt\",Linkwahl!AI507))","v":""},{"$f":"IF(Linkwahl!AJ507=\"\",\"\",CELL(\"Inhalt\",Linkwahl!AJ507))","v":""},{"$f":"IF(Linkwahl!AK507=\"\",\"\",CELL(\"Inhalt\",Linkwahl!AK507))","v":""}]
["",{"$f":"IF(Linkwahl!AI508=\"\",\"\",CELL(\"Inhalt\",Linkwahl!AI508))","v":""},{"$f":"IF(Linkwahl!AJ508=\"\",\"\",CELL(\"Inhalt\",Linkwahl!AJ508))","v":""},{"$f":"IF(Linkwahl!AK508=\"\",\"\",CELL(\"Inhalt\",Linkwahl!AK508))","v":""}]
["",{"$f":"IF(Linkwahl!AI509=\"\",\"\",CELL(\"Inhalt\",Linkwahl!AI509))","v":""},{"$f":"IF(Linkwahl!AJ509=\"\",\"\",CELL(\"Inhalt\",Linkwahl!AJ509))","v":""},{"$f":"IF(Linkwahl!AK509=\"\",\"\",CELL(\"Inhalt\",Linkwahl!AK509))","v":""}]
["",{"$f":"IF(Linkwahl!AI510=\"\",\"\",CELL(\"Inhalt\",Linkwahl!AI510))","v":""},{"$f":"IF(Linkwahl!AJ510=\"\",\"\",CELL(\"Inhalt\",Linkwahl!AJ510))","v":""},{"$f":"IF(Linkwahl!AK510=\"\",\"\",CELL(\"Inhalt\",Linkwahl!AK510))","v":""}]
["",{"$f":"IF(Linkwahl!AI511=\"\",\"\",CELL(\"Inhalt\",Linkwahl!AI511))","v":""},{"$f":"IF(Linkwahl!AJ511=\"\",\"\",CELL(\"Inhalt\",Linkwahl!AJ511))","v":""},{"$f":"IF(Linkwahl!AK511=\"\",\"\",CELL(\"Inhalt\",Linkwahl!AK511))","v":""}]
["",{"$f":"IF(Linkwahl!AI512=\"\",\"\",CELL(\"Inhalt\",Linkwahl!AI512))","v":""},{"$f":"IF(Linkwahl!AJ512=\"\",\"\",CELL(\"Inhalt\",Linkwahl!AJ512))","v":""},{"$f":"IF(Linkwahl!AK512=\"\",\"\",CELL(\"Inhalt\",Linkwahl!AK512))","v":""}]
["",{"$f":"IF(Linkwahl!AI513=\"\",\"\",CELL(\"Inhalt\",Linkwahl!AI513))","v":""},{"$f":"IF(Linkwahl!AJ513=\"\",\"\",CELL(\"Inhalt\",Linkwahl!AJ513))","v":""},{"$f":"IF(Linkwahl!AK513=\"\",\"\",CELL(\"Inhalt\",Linkwahl!AK513))","v":""}]
["",{"$f":"IF(Linkwahl!AI514=\"\",\"\",CELL(\"Inhalt\",Linkwahl!AI514))","v":""},{"$f":"IF(Linkwahl!AJ514=\"\",\"\",CELL(\"Inhalt\",Linkwahl!AJ514))","v":""},{"$f":"IF(Linkwahl!AK514=\"\",\"\",CELL(\"Inhalt\",Linkwahl!AK514))","v":""}]
["",{"$f":"IF(Linkwahl!AI515=\"\",\"\",CELL(\"Inhalt\",Linkwahl!AI515))","v":""},{"$f":"IF(Linkwahl!AJ515=\"\",\"\",CELL(\"Inhalt\",Linkwahl!AJ515))","v":""},{"$f":"IF(Linkwahl!AK515=\"\",\"\",CELL(\"Inhalt\",Linkwahl!AK515))","v":""}]
["",{"$f":"IF(Linkwahl!AI516=\"\",\"\",CELL(\"Inhalt\",Linkwahl!AI516))","v":""},{"$f":"IF(Linkwahl!AJ516=\"\",\"\",CELL(\"Inhalt\",Linkwahl!AJ516))","v":""},{"$f":"IF(Linkwahl!AK516=\"\",\"\",CELL(\"Inhalt\",Linkwahl!AK516))","v":""}]
["",{"$f":"IF(Linkwahl!AI517=\"\",\"\",CELL(\"Inhalt\",Linkwahl!AI517))","v":""},{"$f":"IF(Linkwahl!AJ517=\"\",\"\",CELL(\"Inhalt\",Linkwahl!AJ517))","v":""},{"$f":"IF(Linkwahl!AK517=\"\",\"\",CELL(\"Inhalt\",Linkwahl!AK517))","v":""}]
["",{"$f":"IF(Linkwahl!AI518=\"\",\"\",CELL(\"Inhalt\",Linkwahl!AI518))","v":""},{"$f":"IF(Linkwahl!AJ518=\"\",\"\",CELL(\"Inhalt\",Linkwahl!AJ518))","v":""},{"$f":"IF(Linkwahl!AK518=\"\",\"\",CELL(\"Inhalt\",Linkwahl!AK518))","v":""}]
["",{"$f":"IF(Linkwahl!AI519=\"\",\"\",CELL(\"Inhalt\",Linkwahl!AI519))","v":""},{"$f":"IF(Linkwahl!AJ519=\"\",\"\",CELL(\"Inhalt\",Linkwahl!AJ519))","v":""},{"$f":"IF(Linkwahl!AK519=\"\",\"\",CELL(\"Inhalt\",Linkwahl!AK519))","v":""}]
["",{"$f":"IF(Linkwahl!AI520=\"\",\"\",CELL(\"Inhalt\",Linkwahl!AI520))","v":""},{"$f":"IF(Linkwahl!AJ520=\"\",\"\",CELL(\"Inhalt\",Linkwahl!AJ520))","v":""},{"$f":"IF(Linkwahl!AK520=\"\",\"\",CELL(\"Inhalt\",Linkwahl!AK520))","v":""}]
["",{"$f":"IF(Linkwahl!AI521=\"\",\"\",CELL(\"Inhalt\",Linkwahl!AI521))","v":""},{"$f":"IF(Linkwahl!AJ521=\"\",\"\",CELL(\"Inhalt\",Linkwahl!AJ521))","v":""},{"$f":"IF(Linkwahl!AK521=\"\",\"\",CELL(\"Inhalt\",Linkwahl!AK521))","v":""}]
["",{"$f":"IF(Linkwahl!AI522=\"\",\"\",CELL(\"Inhalt\",Linkwahl!AI522))","v":""},{"$f":"IF(Linkwahl!AJ522=\"\",\"\",CELL(\"Inhalt\",Linkwahl!AJ522))","v":""},{"$f":"IF(Linkwahl!AK522=\"\",\"\",CELL(\"Inhalt\",Linkwahl!AK522))","v":""}]
["",{"$f":"IF(Linkwahl!AI523=\"\",\"\",CELL(\"Inhalt\",Linkwahl!AI523))","v":""},{"$f":"IF(Linkwahl!AJ523=\"\",\"\",CELL(\"Inhalt\",Linkwahl!AJ523))","v":""},{"$f":"IF(Linkwahl!AK523=\"\",\"\",CELL(\"Inhalt\",Linkwahl!AK523))","v":""}]
["",{"$f":"IF(Linkwahl!AI524=\"\",\"\",CELL(\"Inhalt\",Linkwahl!AI524))","v":""},{"$f":"IF(Linkwahl!AJ524=\"\",\"\",CELL(\"Inhalt\",Linkwahl!AJ524))","v":""},{"$f":"IF(Linkwahl!AK524=\"\",\"\",CELL(\"Inhalt\",Linkwahl!AK524))","v":""}]
["",{"$f":"IF(Linkwahl!AI525=\"\",\"\",CELL(\"Inhalt\",Linkwahl!AI525))","v":""},{"$f":"IF(Linkwahl!AJ525=\"\",\"\",CELL(\"Inhalt\",Linkwahl!AJ525))","v":""},{"$f":"IF(Linkwahl!AK525=\"\",\"\",CELL(\"Inhalt\",Linkwahl!AK525))","v":""}]
["",{"$f":"IF(Linkwahl!AI526=\"\",\"\",CELL(\"Inhalt\",Linkwahl!AI526))","v":""},{"$f":"IF(Linkwahl!AJ526=\"\",\"\",CELL(\"Inhalt\",Linkwahl!AJ526))","v":""},{"$f":"IF(Linkwahl!AK526=\"\",\"\",CELL(\"Inhalt\",Linkwahl!AK526))","v":""}]
["",{"$f":"IF(Linkwahl!AI527=\"\",\"\",CELL(\"Inhalt\",Linkwahl!AI527))","v":""},{"$f":"IF(Linkwahl!AJ527=\"\",\"\",CELL(\"Inhalt\",Linkwahl!AJ527))","v":""},{"$f":"IF(Linkwahl!AK527=\"\",\"\",CELL(\"Inhalt\",Linkwahl!AK527))","v":""}]
["",{"$f":"IF(Linkwahl!AI528=\"\",\"\",CELL(\"Inhalt\",Linkwahl!AI528))","v":""},{"$f":"IF(Linkwahl!AJ528=\"\",\"\",CELL(\"Inhalt\",Linkwahl!AJ528))","v":""},{"$f":"IF(Linkwahl!AK528=\"\",\"\",CELL(\"Inhalt\",Linkwahl!AK528))","v":""}]
["",{"$f":"IF(Linkwahl!AI529=\"\",\"\",CELL(\"Inhalt\",Linkwahl!AI529))","v":""},{"$f":"IF(Linkwahl!AJ529=\"\",\"\",CELL(\"Inhalt\",Linkwahl!AJ529))","v":""},{"$f":"IF(Linkwahl!AK529=\"\",\"\",CELL(\"Inhalt\",Linkwahl!AK529))","v":""}]
["",{"$f":"IF(Linkwahl!AI530=\"\",\"\",CELL(\"Inhalt\",Linkwahl!AI530))","v":""},{"$f":"IF(Linkwahl!AJ530=\"\",\"\",CELL(\"Inhalt\",Linkwahl!AJ530))","v":""},{"$f":"IF(Linkwahl!AK530=\"\",\"\",CELL(\"Inhalt\",Linkwahl!AK530))","v":""}]
["",{"$f":"IF(Linkwahl!AI531=\"\",\"\",CELL(\"Inhalt\",Linkwahl!AI531))","v":""},{"$f":"IF(Linkwahl!AJ531=\"\",\"\",CELL(\"Inhalt\",Linkwahl!AJ531))","v":""},{"$f":"IF(Linkwahl!AK531=\"\",\"\",CELL(\"Inhalt\",Linkwahl!AK531))","v":""}]
["",{"$f":"IF(Linkwahl!AI532=\"\",\"\",CELL(\"Inhalt\",Linkwahl!AI532))","v":""},{"$f":"IF(Linkwahl!AJ532=\"\",\"\",CELL(\"Inhalt\",Linkwahl!AJ532))","v":""},{"$f":"IF(Linkwahl!AK532=\"\",\"\",CELL(\"Inhalt\",Linkwahl!AK532))","v":""}]
["",{"$f":"IF(Linkwahl!AI533=\"\",\"\",CELL(\"Inhalt\",Linkwahl!AI533))","v":""},{"$f":"IF(Linkwahl!AJ533=\"\",\"\",CELL(\"Inhalt\",Linkwahl!AJ533))","v":""},{"$f":"IF(Linkwahl!AK533=\"\",\"\",CELL(\"Inhalt\",Linkwahl!AK533))","v":""}]
["",{"$f":"IF(Linkwahl!AI534=\"\",\"\",CELL(\"Inhalt\",Linkwahl!AI534))","v":""},{"$f":"IF(Linkwahl!AJ534=\"\",\"\",CELL(\"Inhalt\",Linkwahl!AJ534))","v":""},{"$f":"IF(Linkwahl!AK534=\"\",\"\",CELL(\"Inhalt\",Linkwahl!AK534))","v":""}]
["",{"$f":"IF(Linkwahl!AI535=\"\",\"\",CELL(\"Inhalt\",Linkwahl!AI535))","v":""},{"$f":"IF(Linkwahl!AJ535=\"\",\"\",CELL(\"Inhalt\",Linkwahl!AJ535))","v":""},{"$f":"IF(Linkwahl!AK535=\"\",\"\",CELL(\"Inhalt\",Linkwahl!AK535))","v":""}]
["",{"$f":"IF(Linkwahl!AI536=\"\",\"\",CELL(\"Inhalt\",Linkwahl!AI536))","v":""},{"$f":"IF(Linkwahl!AJ536=\"\",\"\",CELL(\"Inhalt\",Linkwahl!AJ536))","v":""},{"$f":"IF(Linkwahl!AK536=\"\",\"\",CELL(\"Inhalt\",Linkwahl!AK536))","v":""}]
["",{"$f":"IF(Linkwahl!AI537=\"\",\"\",CELL(\"Inhalt\",Linkwahl!AI537))","v":""},{"$f":"IF(Linkwahl!AJ537=\"\",\"\",CELL(\"Inhalt\",Linkwahl!AJ537))","v":""},{"$f":"IF(Linkwahl!AK537=\"\",\"\",CELL(\"Inhalt\",Linkwahl!AK537))","v":""}]
["",{"$f":"IF(Linkwahl!AI538=\"\",\"\",CELL(\"Inhalt\",Linkwahl!AI538))","v":""},{"$f":"IF(Linkwahl!AJ538=\"\",\"\",CELL(\"Inhalt\",Linkwahl!AJ538))","v":""},{"$f":"IF(Linkwahl!AK538=\"\",\"\",CELL(\"Inhalt\",Linkwahl!AK538))","v":""}]
["",{"$f":"IF(Linkwahl!AI539=\"\",\"\",CELL(\"Inhalt\",Linkwahl!AI539))","v":""},{"$f":"IF(Linkwahl!AJ539=\"\",\"\",CELL(\"Inhalt\",Linkwahl!AJ539))","v":""},{"$f":"IF(Linkwahl!AK539=\"\",\"\",CELL(\"Inhalt\",Linkwahl!AK539))","v":""}]
["",{"$f":"IF(Linkwahl!AI540=\"\",\"\",CELL(\"Inhalt\",Linkwahl!AI540))","v":""},{"$f":"IF(Linkwahl!AJ540=\"\",\"\",CELL(\"Inhalt\",Linkwahl!AJ540))","v":""},{"$f":"IF(Linkwahl!AK540=\"\",\"\",CELL(\"Inhalt\",Linkwahl!AK540))","v":""}]
["",{"$f":"IF(Linkwahl!AI541=\"\",\"\",CELL(\"Inhalt\",Linkwahl!AI541))","v":""},{"$f":"IF(Linkwahl!AJ541=\"\",\"\",CELL(\"Inhalt\",Linkwahl!AJ541))","v":""},{"$f":"IF(Linkwahl!AK541=\"\",\"\",CELL(\"Inhalt\",Linkwahl!AK541))","v":""}]
["",{"$f":"IF(Linkwahl!AI542=\"\",\"\",CELL(\"Inhalt\",Linkwahl!AI542))","v":""},{"$f":"IF(Linkwahl!AJ542=\"\",\"\",CELL(\"Inhalt\",Linkwahl!AJ542))","v":""},{"$f":"IF(Linkwahl!AK542=\"\",\"\",CELL(\"Inhalt\",Linkwahl!AK542))","v":""}]
["",{"$f":"IF(Linkwahl!AI543=\"\",\"\",CELL(\"Inhalt\",Linkwahl!AI543))","v":""},{"$f":"IF(Linkwahl!AJ543=\"\",\"\",CELL(\"Inhalt\",Linkwahl!AJ543))","v":""},{"$f":"IF(Linkwahl!AK543=\"\",\"\",CELL(\"Inhalt\",Linkwahl!AK543))","v":""}]
["",{"$f":"IF(Linkwahl!AI544=\"\",\"\",CELL(\"Inhalt\",Linkwahl!AI544))","v":""},{"$f":"IF(Linkwahl!AJ544=\"\",\"\",CELL(\"Inhalt\",Linkwahl!AJ544))","v":""},{"$f":"IF(Linkwahl!AK544=\"\",\"\",CELL(\"Inhalt\",Linkwahl!AK544))","v":""}]
["",{"$f":"IF(Linkwahl!AI545=\"\",\"\",CELL(\"Inhalt\",Linkwahl!AI545))","v":""},{"$f":"IF(Linkwahl!AJ545=\"\",\"\",CELL(\"Inhalt\",Linkwahl!AJ545))","v":""},{"$f":"IF(Linkwahl!AK545=\"\",\"\",CELL(\"Inhalt\",Linkwahl!AK545))","v":""}]
["",{"$f":"IF(Linkwahl!AI546=\"\",\"\",CELL(\"Inhalt\",Linkwahl!AI546))","v":""},{"$f":"IF(Linkwahl!AJ546=\"\",\"\",CELL(\"Inhalt\",Linkwahl!AJ546))","v":""},{"$f":"IF(Linkwahl!AK546=\"\",\"\",CELL(\"Inhalt\",Linkwahl!AK546))","v":""}]
["",{"$f":"IF(Linkwahl!AI547=\"\",\"\",CELL(\"Inhalt\",Linkwahl!AI547))","v":""},{"$f":"IF(Linkwahl!AJ547=\"\",\"\",CELL(\"Inhalt\",Linkwahl!AJ547))","v":""},{"$f":"IF(Linkwahl!AK547=\"\",\"\",CELL(\"Inhalt\",Linkwahl!AK547))","v":""}]
["",{"$f":"IF(Linkwahl!AI548=\"\",\"\",CELL(\"Inhalt\",Linkwahl!AI548))","v":""},{"$f":"IF(Linkwahl!AJ548=\"\",\"\",CELL(\"Inhalt\",Linkwahl!AJ548))","v":""},{"$f":"IF(Linkwahl!AK548=\"\",\"\",CELL(\"Inhalt\",Linkwahl!AK548))","v":""}]
["",{"$f":"IF(Linkwahl!AI549=\"\",\"\",CELL(\"Inhalt\",Linkwahl!AI549))","v":""},{"$f":"IF(Linkwahl!AJ549=\"\",\"\",CELL(\"Inhalt\",Linkwahl!AJ549))","v":""},{"$f":"IF(Linkwahl!AK549=\"\",\"\",CELL(\"Inhalt\",Linkwahl!AK549))","v":""}]
["",{"$f":"IF(Linkwahl!AI550=\"\",\"\",CELL(\"Inhalt\",Linkwahl!AI550))","v":""},{"$f":"IF(Linkwahl!AJ550=\"\",\"\",CELL(\"Inhalt\",Linkwahl!AJ550))","v":""},{"$f":"IF(Linkwahl!AK550=\"\",\"\",CELL(\"Inhalt\",Linkwahl!AK550))","v":""}]
["",{"$f":"IF(Linkwahl!AI551=\"\",\"\",CELL(\"Inhalt\",Linkwahl!AI551))","v":""},{"$f":"IF(Linkwahl!AJ551=\"\",\"\",CELL(\"Inhalt\",Linkwahl!AJ551))","v":""},{"$f":"IF(Linkwahl!AK551=\"\",\"\",CELL(\"Inhalt\",Linkwahl!AK551))","v":""}]
["",{"$f":"IF(Linkwahl!AI552=\"\",\"\",CELL(\"Inhalt\",Linkwahl!AI552))","v":""},{"$f":"IF(Linkwahl!AJ552=\"\",\"\",CELL(\"Inhalt\",Linkwahl!AJ552))","v":""},{"$f":"IF(Linkwahl!AK552=\"\",\"\",CELL(\"Inhalt\",Linkwahl!AK552))","v":""}]
["",{"$f":"IF(Linkwahl!AI553=\"\",\"\",CELL(\"Inhalt\",Linkwahl!AI553))","v":""},{"$f":"IF(Linkwahl!AJ553=\"\",\"\",CELL(\"Inhalt\",Linkwahl!AJ553))","v":""},{"$f":"IF(Linkwahl!AK553=\"\",\"\",CELL(\"Inhalt\",Linkwahl!AK553))","v":""}]
["",{"$f":"IF(Linkwahl!AI554=\"\",\"\",CELL(\"Inhalt\",Linkwahl!AI554))","v":""},{"$f":"IF(Linkwahl!AJ554=\"\",\"\",CELL(\"Inhalt\",Linkwahl!AJ554))","v":""},{"$f":"IF(Linkwahl!AK554=\"\",\"\",CELL(\"Inhalt\",Linkwahl!AK554))","v":""}]
[{"$f":"IF(B388=\"\",\"\",HYPERLINK(\"http://www.zhlex.zh.ch/Erlass.html?Open&Ordnr=\"&C388,\"LS-Link\"))","v":""},{"$f":"IF(Linkwahl!AI555=\"\",\"\",CELL(\"Inhalt\",Linkwahl!AI555))","v":""},{"$f":"IF(Linkwahl!AJ555=\"\",\"\",CELL(\"Inhalt\",Linkwahl!AJ555))","v":""},{"$f":"IF(Linkwahl!AK555=\"\",\"\",CELL(\"Inhalt\",Linkwahl!AK555))","v":""}]
["",{"$f":"IF(Linkwahl!AI556=\"\",\"\",CELL(\"Inhalt\",Linkwahl!AI556))","v":""},{"$f":"IF(Linkwahl!AJ556=\"\",\"\",CELL(\"Inhalt\",Linkwahl!AJ556))","v":""},{"$f":"IF(Linkwahl!AK556=\"\",\"\",CELL(\"Inhalt\",Linkwahl!AK556))","v":""}]
["",{"$f":"IF(Linkwahl!AI557=\"\",\"\",CELL(\"Inhalt\",Linkwahl!AI557))","v":""},{"$f":"IF(Linkwahl!AJ557=\"\",\"\",CELL(\"Inhalt\",Linkwahl!AJ557))","v":""},{"$f":"IF(Linkwahl!AK557=\"\",\"\",CELL(\"Inhalt\",Linkwahl!AK557))","v":""}]
["",{"$f":"IF(Linkwahl!AI558=\"\",\"\",CELL(\"Inhalt\",Linkwahl!AI558))","v":""},{"$f":"IF(Linkwahl!AJ558=\"\",\"\",CELL(\"Inhalt\",Linkwahl!AJ558))","v":""},{"$f":"IF(Linkwahl!AK558=\"\",\"\",CELL(\"Inhalt\",Linkwahl!AK558))","v":""}]
["",{"$f":"IF(Linkwahl!AI559=\"\",\"\",CELL(\"Inhalt\",Linkwahl!AI559))","v":""},{"$f":"IF(Linkwahl!AJ559=\"\",\"\",CELL(\"Inhalt\",Linkwahl!AJ559))","v":""},{"$f":"IF(Linkwahl!AK559=\"\",\"\",CELL(\"Inhalt\",Linkwahl!AK559))","v":""}]
["",{"$f":"IF(Linkwahl!AI560=\"\",\"\",CELL(\"Inhalt\",Linkwahl!AI560))","v":""},{"$f":"IF(Linkwahl!AJ560=\"\",\"\",CELL(\"Inhalt\",Linkwahl!AJ560))","v":""},{"$f":"IF(Linkwahl!AK560=\"\",\"\",CELL(\"Inhalt\",Linkwahl!AK560))","v":""}]
["",{"$f":"IF(Linkwahl!AI561=\"\",\"\",CELL(\"Inhalt\",Linkwahl!AI561))","v":""},{"$f":"IF(Linkwahl!AJ561=\"\",\"\",CELL(\"Inhalt\",Linkwahl!AJ561))","v":""},{"$f":"IF(Linkwahl!AK561=\"\",\"\",CELL(\"Inhalt\",Linkwahl!AK561))","v":""}]
["",{"$f":"IF(Linkwahl!AI562=\"\",\"\",CELL(\"Inhalt\",Linkwahl!AI562))","v":""},{"$f":"IF(Linkwahl!AJ562=\"\",\"\",CELL(\"Inhalt\",Linkwahl!AJ562))","v":""},{"$f":"IF(Linkwahl!AK562=\"\",\"\",CELL(\"Inhalt\",Linkwahl!AK562))","v":""}]
["",{"$f":"IF(Linkwahl!AI563=\"\",\"\",CELL(\"Inhalt\",Linkwahl!AI563))","v":""},{"$f":"IF(Linkwahl!AJ563=\"\",\"\",CELL(\"Inhalt\",Linkwahl!AJ563))","v":""},{"$f":"IF(Linkwahl!AK563=\"\",\"\",CELL(\"Inhalt\",Linkwahl!AK563))","v":""}]
["",{"$f":"IF(Linkwahl!AI564=\"\",\"\",CELL(\"Inhalt\",Linkwahl!AI564))","v":""},{"$f":"IF(Linkwahl!AJ564=\"\",\"\",CELL(\"Inhalt\",Linkwahl!AJ564))","v":""},{"$f":"IF(Linkwahl!AK564=\"\",\"\",CELL(\"Inhalt\",Linkwahl!AK564))","v":""}]
["",{"$f":"IF(Linkwahl!AI565=\"\",\"\",CELL(\"Inhalt\",Linkwahl!AI565))","v":""},{"$f":"IF(Linkwahl!AJ565=\"\",\"\",CELL(\"Inhalt\",Linkwahl!AJ565))","v":""},{"$f":"IF(Linkwahl!AK565=\"\",\"\",CELL(\"Inhalt\",Linkwahl!AK565))","v":""}]
["",{"$f":"IF(Linkwahl!AI566=\"\",\"\",CELL(\"Inhalt\",Linkwahl!AI566))","v":""},{"$f":"IF(Linkwahl!AJ566=\"\",\"\",CELL(\"Inhalt\",Linkwahl!AJ566))","v":""},{"$f":"IF(Linkwahl!AK566=\"\",\"\",CELL(\"Inhalt\",Linkwahl!AK566))","v":""}]
["",{"$f":"IF(Linkwahl!AI567=\"\",\"\",CELL(\"Inhalt\",Linkwahl!AI567))","v":""},{"$f":"IF(Linkwahl!AJ567=\"\",\"\",CELL(\"Inhalt\",Linkwahl!AJ567))","v":""},{"$f":"IF(Linkwahl!AK567=\"\",\"\",CELL(\"Inhalt\",Linkwahl!AK567))","v":""}]
["",{"$f":"IF(Linkwahl!AI568=\"\",\"\",CELL(\"Inhalt\",Linkwahl!AI568))","v":""},{"$f":"IF(Linkwahl!AJ568=\"\",\"\",CELL(\"Inhalt\",Linkwahl!AJ568))","v":""},{"$f":"IF(Linkwahl!AK568=\"\",\"\",CELL(\"Inhalt\",Linkwahl!AK568))","v":""}]
["",{"$f":"IF(Linkwahl!AI569=\"\",\"\",CELL(\"Inhalt\",Linkwahl!AI569))","v":""},{"$f":"IF(Linkwahl!AJ569=\"\",\"\",CELL(\"Inhalt\",Linkwahl!AJ569))","v":""},{"$f":"IF(Linkwahl!AK569=\"\",\"\",CELL(\"Inhalt\",Linkwahl!AK569))","v":""}]